cxf-notifications mailing list archives

Site index · List index
Message view « Date » · « Thread »
Top « Date » · « Thread »
From Apache Hudson Server <hud...@hudson.zones.apache.org>
Subject Build failed in Hudson: CXF-2.1.x-JDK15 » Apache CXF Runtime Colocated Binding #71
Date Thu, 26 Mar 2009 16:57:50 GMT
See http://hudson.zones.apache.org/hudson/job/CXF-2.1.x-JDK15/org.apache.cxf$cxf-rt-bindings-coloc/71/

------------------------------------------
[INFO] ------------------------------------------------------------------------
[INFO] Building Apache CXF Runtime Colocated Binding
[INFO]    task-segment: [clean, install]
[INFO] ------------------------------------------------------------------------
[INFO] [clean:clean]
[INFO] Deleting directory http://hudson.zones.apache.org/hudson/job/CXF-2.1.x-JDK15/org.apache.cxf$cxf-rt-bindings-coloc/ws/target

[INFO] [checkstyle:checkstyle {execution: validate}]
[INFO] Starting audit...
Audit done.

[INFO] Preparing pmd:check
[HUDSON] Archiving http://hudson.zones.apache.org/hudson/job/CXF-2.1.x-JDK15/org.apache.cxf$cxf-rt-bindings-coloc/ws/pom.xml
 to /export/home/hudson/hudson/jobs/CXF-2.1.x-JDK15/modules/org.apache.cxf$cxf-rt-bindings-coloc/builds/2009-03-26_16-40-50/archive/org.apache.cxf/cxf-rt-bindings-coloc/2.1.5-SNAPSHOT/pom.xml
Mar 26, 2009 9:11:33 AM hudson.remoting.Channel$ReaderThread run
SEVERE: Unable to read a command
java.lang.ClassNotFoundException: hudson.remoting.ProxyOutputStream$Unexport
	at java.net.URLClassLoader$1.run(URLClassLoader.java:200)
	at java.security.AccessController.doPrivileged(Native Method)
	at java.net.URLClassLoader.findClass(URLClassLoader.java:188)
	at java.lang.ClassLoader.loadClass(ClassLoader.java:306)
	at org.codehaus.classworlds.RealmClassLoader.loadClassDirect(RealmClassLoader.java:195)
	at org.codehaus.classworlds.DefaultClassRealm.loadClass(DefaultClassRealm.java:255)
	at org.codehaus.classworlds.DefaultClassRealm.loadClass(DefaultClassRealm.java:274)
	at org.codehaus.classworlds.DefaultClassRealm.loadClass(DefaultClassRealm.java:274)
	at org.codehaus.classworlds.RealmClassLoader.loadClass(RealmClassLoader.java:214)
	at java.lang.ClassLoader.loadClass(ClassLoader.java:251)
	at java.lang.ClassLoader.loadClassInternal(ClassLoader.java:319)
	at java.lang.Class.forName0(Native Method)
	at java.lang.Class.forName(Class.java:242)
	at java.io.ObjectInputStream.resolveClass(ObjectInputStream.java:585)
	at java.io.ObjectInputStream.readNonProxyDesc(ObjectInputStream.java:1544)
	at java.io.ObjectInputStream.readClassDesc(ObjectInputStream.java:1466)
	at java.io.ObjectInputStream.readOrdinaryObject(ObjectInputStream.java:1699)
	at java.io.ObjectInputStream.readObject0(ObjectInputStream.java:1305)
	at java.io.ObjectInputStream.readObject(ObjectInputStream.java:348)
	at hudson.remoting.Channel$ReaderThread.run(Channel.java:637)
[INFO] [pmd:pmd]
[HUDSON] Archiving http://hudson.zones.apache.org/hudson/job/CXF-2.1.x-JDK15/org.apache.cxf$cxf-rt-bindings-coloc/ws/pom.xml
 to /export/home/hudson/hudson/jobs/CXF-2.1.x-JDK15/modules/org.apache.cxf$cxf-rt-bindings-coloc/builds/2009-03-26_16-40-50/archive/org.apache.cxf/cxf-rt-bindings-coloc/2.1.5-SNAPSHOT/pom.xml
[INFO] [pmd:check {execution: validate}]
[INFO] 
[INFO] [cxf-xml2fastinfoset:xml2fastinfoset {execution: xml2fastinfoset}]
[INFO] [remote-resources:process {execution: default}]
[INFO] [resources:resources]
[WARNING] File encoding has not been set, using platform encoding UTF-8, i.e. build is platform
dependent!
[WARNING] Using platform encoding (UTF-8 actually) to copy filtered resources, i.e. build
is platform dependent!
[INFO] Copying 1 resource
[INFO] Copying 1 resource
[INFO] skip non existing resourceDirectory http://hudson.zones.apache.org/hudson/job/CXF-2.1.x-JDK15/org.apache.cxf$cxf-rt-bindings-coloc/ws/src/main/resources-filtered

[INFO] skip non existing resourceDirectory http://hudson.zones.apache.org/hudson/job/CXF-2.1.x-JDK15/org.apache.cxf$cxf-rt-bindings-coloc/ws/target/generated/src/main/resources

[INFO] Copying 3 resources
[INFO] [compiler:compile]
[INFO] Compiling 10 source files to http://hudson.zones.apache.org/hudson/job/CXF-2.1.x-JDK15/org.apache.cxf$cxf-rt-bindings-coloc/ws/target/classes

[INFO] [resources:testResources]
[WARNING] File encoding has not been set, using platform encoding UTF-8, i.e. build is platform
dependent!
[WARNING] Using platform encoding (UTF-8 actually) to copy filtered resources, i.e. build
is platform dependent!
[INFO] Copying 0 resource
[INFO] Copying 0 resource
[INFO] Copying 0 resource
[INFO] skip non existing resourceDirectory http://hudson.zones.apache.org/hudson/job/CXF-2.1.x-JDK15/org.apache.cxf$cxf-rt-bindings-coloc/ws/target/generated/src/test/resources

[INFO] Copying 3 resources
[INFO] [compiler:testCompile]
[INFO] Compiling 3 source files to http://hudson.zones.apache.org/hudson/job/CXF-2.1.x-JDK15/org.apache.cxf$cxf-rt-bindings-coloc/ws/target/test-classes

[HUDSON] Archiving http://hudson.zones.apache.org/hudson/job/CXF-2.1.x-JDK15/org.apache.cxf$cxf-rt-bindings-coloc/ws/pom.xml
 to /export/home/hudson/hudson/jobs/CXF-2.1.x-JDK15/modules/org.apache.cxf$cxf-rt-bindings-coloc/builds/2009-03-26_16-40-50/archive/org.apache.cxf/cxf-rt-bindings-coloc/2.1.5-SNAPSHOT/pom.xml
[INFO] ------------------------------------------------------------------------
[ERROR] BUILD FAILURE
[INFO] ------------------------------------------------------------------------
[INFO] Compilation failure
http://hudson.zones.apache.org/hudson/job/CXF-2.1.x-JDK15/org.apache.cxf$cxf-rt-bindings-coloc/ws/src/test/java/org/apache/cxf/binding/coloc/ColocOutInterceptorTest.java
:[65,15] cannot find symbol
symbol  : method makeThreadSafe(boolean)
location: interface org.easymock.classextension.IMocksControl



http://hudson.zones.apache.org/hudson/job/CXF-2.1.x-JDK15/org.apache.cxf$cxf-rt-bindings-coloc/ws/src/test/java/org/apache/cxf/binding/coloc/ColocOutInterceptorTest.java
:[65,15] cannot find symbol
symbol  : method makeThreadSafe(boolean)
location: interface org.easymock.classextension.IMocksControl


[INFO] ------------------------------------------------------------------------
[INFO] Trace
org.apache.maven.BuildFailureException: Compilation failure
http://hudson.zones.apache.org/hudson/job/CXF-2.1.x-JDK15/org.apache.cxf$cxf-rt-bindings-coloc/ws/src/test/java/org/apache/cxf/binding/coloc/ColocOutInterceptorTest.java
:[65,15] cannot find symbol
symbol  : method makeThreadSafe(boolean)
location: interface org.easymock.classextension.IMocksControl


	at org.apache.maven.lifecycle.DefaultLifecycleExecutor.executeGoals(DefaultLifecycleExecutor.java:579)
	at org.apache.maven.lifecycle.DefaultLifecycleExecutor.executeGoalWithLifecycle(DefaultLifecycleExecutor.java:499)
	at org.apache.maven.lifecycle.DefaultLifecycleExecutor.executeGoal(DefaultLifecycleExecutor.java:478)
	at org.apache.maven.lifecycle.DefaultLifecycleExecutor.executeGoalAndHandleFailures(DefaultLifecycleExecutor.java:330)
	at org.apache.maven.lifecycle.DefaultLifecycleExecutor.executeTaskSegments(DefaultLifecycleExecutor.java:291)
	at org.apache.maven.lifecycle.DefaultLifecycleExecutor.execute(DefaultLifecycleExecutor.java:142)
	at org.apache.maven.lifecycle.LifecycleExecutorInterceptor.execute(LifecycleExecutorInterceptor.java:65)
	at org.apache.maven.DefaultMaven.doExecute(DefaultMaven.java:336)
	at org.apache.maven.DefaultMaven.execute(DefaultMaven.java:129)
	at org.apache.maven.cli.MavenCli.main(MavenCli.java:287)
	at sun.reflect.NativeMethodAccessorImpl.invoke0(Native Method)
	at sun.reflect.NativeMethodAccessorImpl.invoke(NativeMethodAccessorImpl.java:39)
	at sun.reflect.DelegatingMethodAccessorImpl.invoke(DelegatingMethodAccessorImpl.java:25)
	at java.lang.reflect.Method.invoke(Method.java:585)
	at org.codehaus.classworlds.Launcher.launchEnhanced(Launcher.java:315)
	at org.codehaus.classworlds.Launcher.launch(Launcher.java:255)
	at hudson.maven.agent.Main.launch(Main.java:158)
	at hudson.maven.MavenBuilder.call(MavenBuilder.java:162)
	at hudson.maven.MavenModuleSetBuild$Builder.call(MavenModuleSetBuild.java:579)
	at hudson.maven.MavenModuleSetBuild$Builder.call(MavenModuleSetBuild.java:525)
	at hudson.remoting.UserRequest.perform(UserRequest.java:69)
	at hudson.remoting.UserRequest.perform(UserRequest.java:23)
	at hudson.remoting.Request$2.run(Request.java:213)
	at java.util.concurrent.Executors$RunnableAdapter.call(Executors.java:417)
	at java.util.concurrent.FutureTask$Sync.innerRun(FutureTask.java:269)
	at java.util.concurrent.FutureTask.run(FutureTask.java:123)
	at java.util.concurrent.ThreadPoolExecutor$Worker.runTask(ThreadPoolExecutor.java:650)
	at java.util.concurrent.ThreadPoolExecutor$Worker.run(ThreadPoolExecutor.java:675)
	at java.lang.Thread.run(Thread.java:595)
Caused by: org.apache.maven.plugin.CompilationFailureException: Compilation failure
http://hudson.zones.apache.org/hudson/job/CXF-2.1.x-JDK15/org.apache.cxf$cxf-rt-bindings-coloc/ws/src/test/java/org/apache/cxf/binding/coloc/ColocOutInterceptorTest.java
:[65,15] cannot find symbol
symbol  : method makeThreadSafe(boolean)
location: interface org.easymock.classextension.IMocksControl


	at org.apache.maven.plugin.AbstractCompilerMojo.execute(AbstractCompilerMojo.java:516)
	at org.apache.maven.plugin.TestCompilerMojo.execute(TestCompilerMojo.java:102)
	at org.apache.maven.plugin.DefaultPluginManager.executeMojo(DefaultPluginManager.java:451)
	at hudson.maven.agent.PluginManagerInterceptor.executeMojo(PluginManagerInterceptor.java:182)
	at org.apache.maven.lifecycle.DefaultLifecycleExecutor.executeGoals(DefaultLifecycleExecutor.java:558)
	... 28 more
[INFO] ------------------------------------------------------------------------
[INFO] Total time: 16 minutes 41 seconds
[INFO] Finished at: Thu Mar 26 09:11:39 PST 2009
[INFO] Final Memory: 82M/164M
[INFO] ------------------------------------------------------------------------


Mime
View raw message