cxf-notifications mailing list archives

Site index · List index
Message view « Date » · « Thread »
Top « Date » · « Thread »
From Apache Hudson Server <hud...@hudson.zones.apache.org>
Subject Build failed in Hudson: CXF-Trunk-JDK15 » Apache CXF API #142
Date Mon, 09 Mar 2009 21:03:27 GMT
See http://hudson.zones.apache.org/hudson/job/CXF-Trunk-JDK15/org.apache.cxf$cxf-api/142/

------------------------------------------
[INFO] ------------------------------------------------------------------------
[INFO] Building Apache CXF API
[INFO]    task-segment: [clean, install]
[INFO] ------------------------------------------------------------------------
[INFO] [clean:clean]
[INFO] Deleting directory http://hudson.zones.apache.org/hudson/job/CXF-Trunk-JDK15/org.apache.cxf$cxf-api/ws/target

[INFO] [checkstyle:checkstyle {execution: validate}]
[INFO] Starting audit...
http://hudson.zones.apache.org/hudson/job/CXF-Trunk-JDK15/org.apache.cxf$cxf-api/ws/src/main/java/org/apache/cxf/phase/AbstractPhaseInterceptor.java
:46:1: Line contains a tab character.
http://hudson.zones.apache.org/hudson/job/CXF-Trunk-JDK15/org.apache.cxf$cxf-api/ws/src/main/java/org/apache/cxf/phase/AbstractPhaseInterceptor.java
:47:1: Line contains a tab character.
http://hudson.zones.apache.org/hudson/job/CXF-Trunk-JDK15/org.apache.cxf$cxf-api/ws/src/main/java/org/apache/cxf/phase/AbstractPhaseInterceptor.java
:48:1: Line contains a tab character.
http://hudson.zones.apache.org/hudson/job/CXF-Trunk-JDK15/org.apache.cxf$cxf-api/ws/src/main/java/org/apache/cxf/phase/AbstractPhaseInterceptor.java
:49:1: Line contains a tab character.
http://hudson.zones.apache.org/hudson/job/CXF-Trunk-JDK15/org.apache.cxf$cxf-api/ws/src/main/java/org/apache/cxf/phase/AbstractPhaseInterceptor.java
:50:1: Line contains a tab character.
http://hudson.zones.apache.org/hudson/job/CXF-Trunk-JDK15/org.apache.cxf$cxf-api/ws/src/main/java/org/apache/cxf/phase/AbstractPhaseInterceptor.java
:51: ctor def modifier at indentation level 8 not at correct indentation, 4
http://hudson.zones.apache.org/hudson/job/CXF-Trunk-JDK15/org.apache.cxf$cxf-api/ws/src/main/java/org/apache/cxf/phase/AbstractPhaseInterceptor.java
:51:1: Line contains a tab character.
http://hudson.zones.apache.org/hudson/job/CXF-Trunk-JDK15/org.apache.cxf$cxf-api/ws/src/main/java/org/apache/cxf/phase/AbstractPhaseInterceptor.java
:56:1: Line contains a tab character.
http://hudson.zones.apache.org/hudson/job/CXF-Trunk-JDK15/org.apache.cxf$cxf-api/ws/src/main/java/org/apache/cxf/phase/AbstractPhaseInterceptor.java
:57:1: Line contains a tab character.
http://hudson.zones.apache.org/hudson/job/CXF-Trunk-JDK15/org.apache.cxf$cxf-api/ws/src/main/java/org/apache/cxf/phase/AbstractPhaseInterceptor.java
:58:1: Line contains a tab character.
http://hudson.zones.apache.org/hudson/job/CXF-Trunk-JDK15/org.apache.cxf$cxf-api/ws/src/main/java/org/apache/cxf/phase/AbstractPhaseInterceptor.java
:59:1: Line contains a tab character.
http://hudson.zones.apache.org/hudson/job/CXF-Trunk-JDK15/org.apache.cxf$cxf-api/ws/src/main/java/org/apache/cxf/phase/AbstractPhaseInterceptor.java
:60:1: Line contains a tab character.
http://hudson.zones.apache.org/hudson/job/CXF-Trunk-JDK15/org.apache.cxf$cxf-api/ws/src/main/java/org/apache/cxf/phase/AbstractPhaseInterceptor.java
:66:1: Line contains a tab character.
http://hudson.zones.apache.org/hudson/job/CXF-Trunk-JDK15/org.apache.cxf$cxf-api/ws/src/main/java/org/apache/cxf/phase/AbstractPhaseInterceptor.java
:67:1: Line contains a tab character.
http://hudson.zones.apache.org/hudson/job/CXF-Trunk-JDK15/org.apache.cxf$cxf-api/ws/src/main/java/org/apache/cxf/phase/AbstractPhaseInterceptor.java
:68:1: Line contains a tab character.
http://hudson.zones.apache.org/hudson/job/CXF-Trunk-JDK15/org.apache.cxf$cxf-api/ws/src/main/java/org/apache/cxf/phase/AbstractPhaseInterceptor.java
:69:1: Line contains a tab character.
http://hudson.zones.apache.org/hudson/job/CXF-Trunk-JDK15/org.apache.cxf$cxf-api/ws/src/main/java/org/apache/cxf/phase/AbstractPhaseInterceptor.java
:70:1: Line contains a tab character.
http://hudson.zones.apache.org/hudson/job/CXF-Trunk-JDK15/org.apache.cxf$cxf-api/ws/src/main/java/org/apache/cxf/phase/AbstractPhaseInterceptor.java
:71:1: Line contains a tab character.
http://hudson.zones.apache.org/hudson/job/CXF-Trunk-JDK15/org.apache.cxf$cxf-api/ws/src/main/java/org/apache/cxf/phase/AbstractPhaseInterceptor.java
:72:1: Line contains a tab character.
http://hudson.zones.apache.org/hudson/job/CXF-Trunk-JDK15/org.apache.cxf$cxf-api/ws/src/main/java/org/apache/cxf/phase/AbstractPhaseInterceptor.java
:73:1: Line contains a tab character.
http://hudson.zones.apache.org/hudson/job/CXF-Trunk-JDK15/org.apache.cxf$cxf-api/ws/src/main/java/org/apache/cxf/phase/AbstractPhaseInterceptor.java
:74:1: Line contains a tab character.
http://hudson.zones.apache.org/hudson/job/CXF-Trunk-JDK15/org.apache.cxf$cxf-api/ws/src/main/java/org/apache/cxf/phase/AbstractPhaseInterceptor.java
:80:1: Line contains a tab character.
http://hudson.zones.apache.org/hudson/job/CXF-Trunk-JDK15/org.apache.cxf$cxf-api/ws/src/main/java/org/apache/cxf/phase/AbstractPhaseInterceptor.java
:81:1: Line contains a tab character.
http://hudson.zones.apache.org/hudson/job/CXF-Trunk-JDK15/org.apache.cxf$cxf-api/ws/src/main/java/org/apache/cxf/phase/AbstractPhaseInterceptor.java
:82:1: Line contains a tab character.
http://hudson.zones.apache.org/hudson/job/CXF-Trunk-JDK15/org.apache.cxf$cxf-api/ws/src/main/java/org/apache/cxf/phase/AbstractPhaseInterceptor.java
:83:1: Line contains a tab character.
http://hudson.zones.apache.org/hudson/job/CXF-Trunk-JDK15/org.apache.cxf$cxf-api/ws/src/main/java/org/apache/cxf/phase/AbstractPhaseInterceptor.java
:84:1: Line contains a tab character.
http://hudson.zones.apache.org/hudson/job/CXF-Trunk-JDK15/org.apache.cxf$cxf-api/ws/src/main/java/org/apache/cxf/phase/AbstractPhaseInterceptor.java
:85:1: Line contains a tab character.
http://hudson.zones.apache.org/hudson/job/CXF-Trunk-JDK15/org.apache.cxf$cxf-api/ws/src/main/java/org/apache/cxf/phase/AbstractPhaseInterceptor.java
:86:1: Line contains a tab character.
http://hudson.zones.apache.org/hudson/job/CXF-Trunk-JDK15/org.apache.cxf$cxf-api/ws/src/main/java/org/apache/cxf/phase/AbstractPhaseInterceptor.java
:87:1: Line contains a tab character.
http://hudson.zones.apache.org/hudson/job/CXF-Trunk-JDK15/org.apache.cxf$cxf-api/ws/src/main/java/org/apache/cxf/phase/AbstractPhaseInterceptor.java
:154: method def modifier at indentation level 8 not at correct indentation, 4
http://hudson.zones.apache.org/hudson/job/CXF-Trunk-JDK15/org.apache.cxf$cxf-api/ws/src/main/java/org/apache/cxf/phase/AbstractPhaseInterceptor.java
:154:1: Line contains a tab character.
Audit done.

[HUDSON] Archiving http://hudson.zones.apache.org/hudson/job/CXF-Trunk-JDK15/org.apache.cxf$cxf-api/ws/pom.xml
 to /export/home/hudson/hudson/jobs/CXF-Trunk-JDK15/modules/org.apache.cxf$cxf-api/builds/2009-03-09_21-01-19/archive/org.apache.cxf/cxf-api/2.2-SNAPSHOT/pom.xml
[INFO] ------------------------------------------------------------------------
[ERROR] BUILD ERROR
[INFO] ------------------------------------------------------------------------
[INFO] An error has occurred in Checkstyle report generation.

Embedded error: There are 31 checkstyle errors.
[INFO] ------------------------------------------------------------------------
[INFO] Trace
org.apache.maven.lifecycle.LifecycleExecutionException: An error has occurred in Checkstyle
report generation.
	at org.apache.maven.lifecycle.DefaultLifecycleExecutor.executeGoals(DefaultLifecycleExecutor.java:583)
	at org.apache.maven.lifecycle.DefaultLifecycleExecutor.executeGoalWithLifecycle(DefaultLifecycleExecutor.java:499)
	at org.apache.maven.lifecycle.DefaultLifecycleExecutor.executeGoal(DefaultLifecycleExecutor.java:478)
	at org.apache.maven.lifecycle.DefaultLifecycleExecutor.executeGoalAndHandleFailures(DefaultLifecycleExecutor.java:330)
	at org.apache.maven.lifecycle.DefaultLifecycleExecutor.executeTaskSegments(DefaultLifecycleExecutor.java:291)
	at org.apache.maven.lifecycle.DefaultLifecycleExecutor.execute(DefaultLifecycleExecutor.java:142)
	at org.apache.maven.lifecycle.LifecycleExecutorInterceptor.execute(LifecycleExecutorInterceptor.java:65)
	at org.apache.maven.DefaultMaven.doExecute(DefaultMaven.java:336)
	at org.apache.maven.DefaultMaven.execute(DefaultMaven.java:129)
	at org.apache.maven.cli.MavenCli.main(MavenCli.java:287)
	at sun.reflect.NativeMethodAccessorImpl.invoke0(Native Method)
	at sun.reflect.NativeMethodAccessorImpl.invoke(NativeMethodAccessorImpl.java:39)
	at sun.reflect.DelegatingMethodAccessorImpl.invoke(DelegatingMethodAccessorImpl.java:25)
	at java.lang.reflect.Method.invoke(Method.java:585)
	at org.codehaus.classworlds.Launcher.launchEnhanced(Launcher.java:315)
	at org.codehaus.classworlds.Launcher.launch(Launcher.java:255)
	at hudson.maven.agent.Main.launch(Main.java:158)
	at hudson.maven.MavenBuilder.call(MavenBuilder.java:162)
	at hudson.maven.MavenModuleSetBuild$Builder.call(MavenModuleSetBuild.java:579)
	at hudson.maven.MavenModuleSetBuild$Builder.call(MavenModuleSetBuild.java:525)
	at hudson.remoting.UserRequest.perform(UserRequest.java:69)
	at hudson.remoting.UserRequest.perform(UserRequest.java:23)
	at hudson.remoting.Request$2.run(Request.java:213)
	at java.util.concurrent.Executors$RunnableAdapter.call(Executors.java:417)
	at java.util.concurrent.FutureTask$Sync.innerRun(FutureTask.java:269)
	at java.util.concurrent.FutureTask.run(FutureTask.java:123)
	at java.util.concurrent.ThreadPoolExecutor$Worker.runTask(ThreadPoolExecutor.java:650)
	at java.util.concurrent.ThreadPoolExecutor$Worker.run(ThreadPoolExecutor.java:675)
	at java.lang.Thread.run(Thread.java:595)
Caused by: org.apache.maven.plugin.MojoExecutionException: An error has occurred in Checkstyle
report generation.
	at org.apache.maven.reporting.AbstractMavenReport.execute(AbstractMavenReport.java:79)
	at org.apache.maven.plugin.DefaultPluginManager.executeMojo(DefaultPluginManager.java:451)
	at hudson.maven.agent.PluginManagerInterceptor.executeMojo(PluginManagerInterceptor.java:182)
	at org.apache.maven.lifecycle.DefaultLifecycleExecutor.executeGoals(DefaultLifecycleExecutor.java:558)
	... 28 more
Caused by: org.apache.maven.reporting.MavenReportException: There are 31 checkstyle errors.
	at org.apache.maven.plugin.checkstyle.CheckstyleReport.executeCheckstyle(CheckstyleReport.java:955)
	at org.apache.maven.plugin.checkstyle.CheckstyleReport.executeReport(CheckstyleReport.java:635)
	at org.apache.maven.reporting.AbstractMavenReport.generate(AbstractMavenReport.java:98)
	at org.apache.maven.reporting.AbstractMavenReport.execute(AbstractMavenReport.java:73)
	... 31 more
[INFO] ------------------------------------------------------------------------
[INFO] Total time: 1 minute 46 seconds
[INFO] Finished at: Mon Mar 09 13:14:58 PST 2009
[INFO] Final Memory: 52M/99M
[INFO] ------------------------------------------------------------------------


Mime
View raw message