cxf-notifications mailing list archives

Site index · List index
Message view « Date » · « Thread »
Top « Date » · « Thread »
From Apache Hudson Server <hud...@hudson.zones.apache.org>
Subject Build failed in Hudson: CXF-2.0.x-JDK15 » Apache CXF System Tests #15
Date Fri, 06 Mar 2009 20:05:11 GMT
See http://hudson.zones.apache.org/hudson/job/CXF-2.0.x-JDK15/org.apache.cxf$cxf-systests/15/

------------------------------------------
[INFO] ------------------------------------------------------------------------
[INFO] Building Apache CXF System Tests
[INFO]    task-segment: [clean, install]
[INFO] ------------------------------------------------------------------------
[INFO] [clean:clean]
[INFO] Deleting directory http://hudson.zones.apache.org/hudson/job/CXF-2.0.x-JDK15/org.apache.cxf$cxf-systests/ws/target

[INFO] [checkstyle:checkstyle {execution: validate}]
[WARNING] File encoding has not been set, using platform encoding UTF-8, i.e. build is platform
dependent!
[INFO] Starting audit...
http://hudson.zones.apache.org/hudson/job/CXF-2.0.x-JDK15/org.apache.cxf$cxf-systests/ws/src/test/java/org/apache/cxf/systest/provider/HWSAXSourcePayloadProvider.java
:22:8: Unused import - java.io.ByteArrayInputStream.
http://hudson.zones.apache.org/hudson/job/CXF-2.0.x-JDK15/org.apache.cxf$cxf-systests/ws/src/test/java/org/apache/cxf/systest/provider/HWSAXSourcePayloadProvider.java
:23:8: Unused import - java.io.ByteArrayOutputStream.
http://hudson.zones.apache.org/hudson/job/CXF-2.0.x-JDK15/org.apache.cxf$cxf-systests/ws/src/test/java/org/apache/cxf/systest/provider/HWSAXSourcePayloadProvider.java
:40:8: Unused import - org.w3c.dom.DOMImplementation.
http://hudson.zones.apache.org/hudson/job/CXF-2.0.x-JDK15/org.apache.cxf$cxf-systests/ws/src/test/java/org/apache/cxf/systest/provider/HWSAXSourcePayloadProvider.java
:43:8: Unused import - org.w3c.dom.bootstrap.DOMImplementationRegistry.
http://hudson.zones.apache.org/hudson/job/CXF-2.0.x-JDK15/org.apache.cxf$cxf-systests/ws/src/test/java/org/apache/cxf/systest/provider/HWSAXSourcePayloadProvider.java
:44:8: Unused import - org.w3c.dom.ls.DOMImplementationLS.
http://hudson.zones.apache.org/hudson/job/CXF-2.0.x-JDK15/org.apache.cxf$cxf-systests/ws/src/test/java/org/apache/cxf/systest/provider/HWSAXSourcePayloadProvider.java
:45:8: Unused import - org.w3c.dom.ls.LSOutput.
http://hudson.zones.apache.org/hudson/job/CXF-2.0.x-JDK15/org.apache.cxf$cxf-systests/ws/src/test/java/org/apache/cxf/systest/provider/HWSAXSourcePayloadProvider.java
:46:8: Unused import - org.w3c.dom.ls.LSSerializer.
Audit done.

[HUDSON] Archiving http://hudson.zones.apache.org/hudson/job/CXF-2.0.x-JDK15/org.apache.cxf$cxf-systests/ws/pom.xml
 to /export/home/hudson/hudson/jobs/CXF-2.0.x-JDK15/modules/org.apache.cxf$cxf-systests/builds/2009-03-06_19-52-25/archive/org.apache.cxf/cxf-systests/2.0.11-SNAPSHOT/pom.xml
[INFO] ------------------------------------------------------------------------
[ERROR] BUILD ERROR
[INFO] ------------------------------------------------------------------------
[INFO] An error has occurred in Checkstyle report generation.

Embedded error: There are 7 checkstyle errors.
[INFO] ------------------------------------------------------------------------
[INFO] Trace
org.apache.maven.lifecycle.LifecycleExecutionException: An error has occurred in Checkstyle
report generation.
	at org.apache.maven.lifecycle.DefaultLifecycleExecutor.executeGoals(DefaultLifecycleExecutor.java:583)
	at org.apache.maven.lifecycle.DefaultLifecycleExecutor.executeGoalWithLifecycle(DefaultLifecycleExecutor.java:499)
	at org.apache.maven.lifecycle.DefaultLifecycleExecutor.executeGoal(DefaultLifecycleExecutor.java:478)
	at org.apache.maven.lifecycle.DefaultLifecycleExecutor.executeGoalAndHandleFailures(DefaultLifecycleExecutor.java:330)
	at org.apache.maven.lifecycle.DefaultLifecycleExecutor.executeTaskSegments(DefaultLifecycleExecutor.java:291)
	at org.apache.maven.lifecycle.DefaultLifecycleExecutor.execute(DefaultLifecycleExecutor.java:142)
	at org.apache.maven.lifecycle.LifecycleExecutorInterceptor.execute(LifecycleExecutorInterceptor.java:65)
	at org.apache.maven.DefaultMaven.doExecute(DefaultMaven.java:336)
	at org.apache.maven.DefaultMaven.execute(DefaultMaven.java:129)
	at org.apache.maven.cli.MavenCli.main(MavenCli.java:287)
	at sun.reflect.NativeMethodAccessorImpl.invoke0(Native Method)
	at sun.reflect.NativeMethodAccessorImpl.invoke(NativeMethodAccessorImpl.java:39)
	at sun.reflect.DelegatingMethodAccessorImpl.invoke(DelegatingMethodAccessorImpl.java:25)
	at java.lang.reflect.Method.invoke(Method.java:585)
	at org.codehaus.classworlds.Launcher.launchEnhanced(Launcher.java:315)
	at org.codehaus.classworlds.Launcher.launch(Launcher.java:255)
	at hudson.maven.agent.Main.launch(Main.java:158)
	at hudson.maven.MavenBuilder.call(MavenBuilder.java:162)
	at hudson.maven.MavenModuleSetBuild$Builder.call(MavenModuleSetBuild.java:567)
	at hudson.maven.MavenModuleSetBuild$Builder.call(MavenModuleSetBuild.java:513)
	at hudson.remoting.UserRequest.perform(UserRequest.java:69)
	at hudson.remoting.UserRequest.perform(UserRequest.java:23)
	at hudson.remoting.Request$2.run(Request.java:213)
	at java.util.concurrent.Executors$RunnableAdapter.call(Executors.java:417)
	at java.util.concurrent.FutureTask$Sync.innerRun(FutureTask.java:269)
	at java.util.concurrent.FutureTask.run(FutureTask.java:123)
	at java.util.concurrent.ThreadPoolExecutor$Worker.runTask(ThreadPoolExecutor.java:650)
	at java.util.concurrent.ThreadPoolExecutor$Worker.run(ThreadPoolExecutor.java:675)
	at java.lang.Thread.run(Thread.java:595)
Caused by: org.apache.maven.plugin.MojoExecutionException: An error has occurred in Checkstyle
report generation.
	at org.apache.maven.reporting.AbstractMavenReport.execute(AbstractMavenReport.java:79)
	at org.apache.maven.plugin.DefaultPluginManager.executeMojo(DefaultPluginManager.java:451)
	at hudson.maven.agent.PluginManagerInterceptor.executeMojo(PluginManagerInterceptor.java:182)
	at org.apache.maven.lifecycle.DefaultLifecycleExecutor.executeGoals(DefaultLifecycleExecutor.java:558)
	... 28 more
Caused by: org.apache.maven.reporting.MavenReportException: There are 7 checkstyle errors.
	at org.apache.maven.plugin.checkstyle.CheckstyleReport.executeCheckstyle(CheckstyleReport.java:955)
	at org.apache.maven.plugin.checkstyle.CheckstyleReport.executeReport(CheckstyleReport.java:635)
	at org.apache.maven.reporting.AbstractMavenReport.generate(AbstractMavenReport.java:98)
	at org.apache.maven.reporting.AbstractMavenReport.execute(AbstractMavenReport.java:73)
	... 31 more
[INFO] ------------------------------------------------------------------------
[INFO] Total time: 12 minutes 37 seconds
[INFO] Finished at: Fri Mar 06 12:16:31 PST 2009
[INFO] Final Memory: 95M/158M
[INFO] ------------------------------------------------------------------------


Mime
View raw message