cxf-notifications mailing list archives

Site index · List index
Message view « Date » · « Thread »
Top « Date » · « Thread »
From Apache Hudson Server <hud...@hudson.zones.apache.org>
Subject Build failed in Hudson: CXF-Trunk-JDK15 » Apache CXF Runtime JAX-RS Frontend #41
Date Thu, 12 Feb 2009 18:49:39 GMT
See http://hudson.zones.apache.org/hudson/job/CXF-Trunk-JDK15/org.apache.cxf$cxf-rt-frontend-jaxrs/41/changes

------------------------------------------
[INFO] ------------------------------------------------------------------------
[INFO] Building Apache CXF Runtime JAX-RS Frontend
[INFO]    task-segment: [clean, install]
[INFO] ------------------------------------------------------------------------
[INFO] [clean:clean]
[INFO] Deleting directory http://hudson.zones.apache.org/hudson/job/CXF-Trunk-JDK15/org.apache.cxf$cxf-rt-frontend-jaxrs/ws/target

[INFO] [checkstyle:checkstyle {execution: validate}]
[INFO] Starting audit...
Audit done.

[INFO] Preparing pmd:check
[HUDSON] Archiving http://hudson.zones.apache.org/hudson/job/CXF-Trunk-JDK15/org.apache.cxf$cxf-rt-frontend-jaxrs/ws/pom.xml
 to /export/home/hudson/hudson/jobs/CXF-Trunk-JDK15/modules/org.apache.cxf$cxf-rt-frontend-jaxrs/builds/2009-02-12_18-31-34/archive/org.apache.cxf/cxf-rt-frontend-jaxrs/2.2-SNAPSHOT/pom.xml
[INFO] [pmd:pmd]
[HUDSON] Archiving http://hudson.zones.apache.org/hudson/job/CXF-Trunk-JDK15/org.apache.cxf$cxf-rt-frontend-jaxrs/ws/pom.xml
 to /export/home/hudson/hudson/jobs/CXF-Trunk-JDK15/modules/org.apache.cxf$cxf-rt-frontend-jaxrs/builds/2009-02-12_18-31-34/archive/org.apache.cxf/cxf-rt-frontend-jaxrs/2.2-SNAPSHOT/pom.xml
[INFO] [pmd:check {execution: validate}]
[INFO] 
[INFO] [cxf-xml2fastinfoset:xml2fastinfoset {execution: xml2fastinfoset}]
[INFO] [remote-resources:process {execution: default}]
[INFO] [resources:resources]
[INFO] Using default encoding to copy filtered resources.
[INFO] [compiler:compile]
[INFO] Compiling 101 source files to http://hudson.zones.apache.org/hudson/job/CXF-Trunk-JDK15/org.apache.cxf$cxf-rt-frontend-jaxrs/ws/target/classes

[HUDSON] Archiving http://hudson.zones.apache.org/hudson/job/CXF-Trunk-JDK15/org.apache.cxf$cxf-rt-frontend-jaxrs/ws/pom.xml
 to /export/home/hudson/hudson/jobs/CXF-Trunk-JDK15/modules/org.apache.cxf$cxf-rt-frontend-jaxrs/builds/2009-02-12_18-31-34/archive/org.apache.cxf/cxf-rt-frontend-jaxrs/2.2-SNAPSHOT/pom.xml
[INFO] ------------------------------------------------------------------------
[ERROR] BUILD FAILURE
[INFO] ------------------------------------------------------------------------
[INFO] Compilation failure

http://hudson.zones.apache.org/hudson/job/CXF-Trunk-JDK15/org.apache.cxf$cxf-rt-frontend-jaxrs/ws/src/main/java/org/apache/cxf/jaxrs/impl/tl/ThreadLocalHttpServletResponse.java
:[105,16] [deprecation] setStatus(int,java.lang.String) in javax.servlet.http.HttpServletResponse
has been deprecated

http://hudson.zones.apache.org/hudson/job/CXF-Trunk-JDK15/org.apache.cxf$cxf-rt-frontend-jaxrs/ws/src/main/java/org/apache/cxf/jaxrs/impl/tl/ThreadLocalHttpServletResponse.java
:[61,18] [deprecation] encodeRedirectUrl(java.lang.String) in javax.servlet.http.HttpServletResponse
has been deprecated

http://hudson.zones.apache.org/hudson/job/CXF-Trunk-JDK15/org.apache.cxf$cxf-rt-frontend-jaxrs/ws/src/main/java/org/apache/cxf/jaxrs/impl/tl/ThreadLocalHttpServletResponse.java
:[70,18] [deprecation] encodeUrl(java.lang.String) in javax.servlet.http.HttpServletResponse
has been deprecated

http://hudson.zones.apache.org/hudson/job/CXF-Trunk-JDK15/org.apache.cxf$cxf-rt-frontend-jaxrs/ws/src/main/java/org/apache/cxf/jaxrs/provider/FormEncodingProvider.java
:[53,7] org.apache.cxf.jaxrs.provider.FormEncodingProvider is not abstract and does not override
abstract method getSize(javax.ws.rs.core.MultivaluedMap<java.lang.String,java.lang.String>,java.lang.Class<?>,java.lang.reflect.Type,java.lang.annotation.Annotation[],javax.ws.rs.core.MediaType)
in javax.ws.rs.ext.MessageBodyWriter

http://hudson.zones.apache.org/hudson/job/CXF-Trunk-JDK15/org.apache.cxf$cxf-rt-frontend-jaxrs/ws/src/main/java/org/apache/cxf/jaxrs/impl/tl/ThreadLocalHttpServletRequest.java
:[128,19] [deprecation] isRequestedSessionIdFromUrl() in javax.servlet.http.HttpServletRequest
has been deprecated

http://hudson.zones.apache.org/hudson/job/CXF-Trunk-JDK15/org.apache.cxf$cxf-rt-frontend-jaxrs/ws/src/main/java/org/apache/cxf/jaxrs/impl/tl/ThreadLocalHttpServletRequest.java
:[209,18] [deprecation] getRealPath(java.lang.String) in javax.servlet.ServletRequest has
been deprecated

http://hudson.zones.apache.org/hudson/job/CXF-Trunk-JDK15/org.apache.cxf$cxf-rt-frontend-jaxrs/ws/src/main/java/org/apache/cxf/jaxrs/impl/tl/ThreadLocalServletContext.java
:[124,16] [deprecation] log(java.lang.Exception,java.lang.String) in javax.servlet.ServletContext
has been deprecated

http://hudson.zones.apache.org/hudson/job/CXF-Trunk-JDK15/org.apache.cxf$cxf-rt-frontend-jaxrs/ws/src/main/java/org/apache/cxf/jaxrs/impl/tl/ThreadLocalServletContext.java
:[110,23] [deprecation] getServletNames() in javax.servlet.ServletContext has been deprecated

http://hudson.zones.apache.org/hudson/job/CXF-Trunk-JDK15/org.apache.cxf$cxf-rt-frontend-jaxrs/ws/src/main/java/org/apache/cxf/jaxrs/impl/tl/ThreadLocalServletContext.java
:[115,23] [deprecation] getServlets() in javax.servlet.ServletContext has been deprecated

http://hudson.zones.apache.org/hudson/job/CXF-Trunk-JDK15/org.apache.cxf$cxf-rt-frontend-jaxrs/ws/src/main/java/org/apache/cxf/jaxrs/impl/tl/ThreadLocalServletContext.java
:[101,19] [deprecation] getServlet(java.lang.String) in javax.servlet.ServletContext has been
deprecated


[INFO] ------------------------------------------------------------------------
[INFO] Trace
org.apache.maven.BuildFailureException: Compilation failure
	at org.apache.maven.lifecycle.DefaultLifecycleExecutor.executeGoals(DefaultLifecycleExecutor.java:579)
	at org.apache.maven.lifecycle.DefaultLifecycleExecutor.executeGoalWithLifecycle(DefaultLifecycleExecutor.java:499)
	at org.apache.maven.lifecycle.DefaultLifecycleExecutor.executeGoal(DefaultLifecycleExecutor.java:478)
	at org.apache.maven.lifecycle.DefaultLifecycleExecutor.executeGoalAndHandleFailures(DefaultLifecycleExecutor.java:330)
	at org.apache.maven.lifecycle.DefaultLifecycleExecutor.executeTaskSegments(DefaultLifecycleExecutor.java:291)
	at org.apache.maven.lifecycle.DefaultLifecycleExecutor.execute(DefaultLifecycleExecutor.java:142)
	at org.apache.maven.lifecycle.LifecycleExecutorInterceptor.execute(LifecycleExecutorInterceptor.java:42)
	at org.apache.maven.DefaultMaven.doExecute(DefaultMaven.java:336)
	at org.apache.maven.DefaultMaven.execute(DefaultMaven.java:129)
	at org.apache.maven.cli.MavenCli.main(MavenCli.java:287)
	at sun.reflect.NativeMethodAccessorImpl.invoke0(Native Method)
	at sun.reflect.NativeMethodAccessorImpl.invoke(NativeMethodAccessorImpl.java:39)
	at sun.reflect.DelegatingMethodAccessorImpl.invoke(DelegatingMethodAccessorImpl.java:25)
	at java.lang.reflect.Method.invoke(Method.java:585)
	at org.codehaus.classworlds.Launcher.launchEnhanced(Launcher.java:315)
	at org.codehaus.classworlds.Launcher.launch(Launcher.java:255)
	at hudson.maven.agent.Main.launch(Main.java:135)
	at hudson.maven.MavenBuilder.call(MavenBuilder.java:139)
	at hudson.maven.MavenModuleSetBuild$Builder.call(MavenModuleSetBuild.java:542)
	at hudson.maven.MavenModuleSetBuild$Builder.call(MavenModuleSetBuild.java:488)
	at hudson.remoting.UserRequest.perform(UserRequest.java:69)
	at hudson.remoting.UserRequest.perform(UserRequest.java:23)
	at hudson.remoting.Request$2.run(Request.java:213)
	at java.util.concurrent.Executors$RunnableAdapter.call(Executors.java:417)
	at java.util.concurrent.FutureTask$Sync.innerRun(FutureTask.java:269)
	at java.util.concurrent.FutureTask.run(FutureTask.java:123)
	at java.util.concurrent.ThreadPoolExecutor$Worker.runTask(ThreadPoolExecutor.java:650)
	at java.util.concurrent.ThreadPoolExecutor$Worker.run(ThreadPoolExecutor.java:675)
	at java.lang.Thread.run(Thread.java:595)
Caused by: org.apache.maven.plugin.CompilationFailureException: Compilation failure
	at org.apache.maven.plugin.AbstractCompilerMojo.execute(AbstractCompilerMojo.java:516)
	at org.apache.maven.plugin.CompilerMojo.execute(CompilerMojo.java:114)
	at org.apache.maven.plugin.DefaultPluginManager.executeMojo(DefaultPluginManager.java:451)
	at hudson.maven.agent.PluginManagerInterceptor.executeMojo(PluginManagerInterceptor.java:159)
	at org.apache.maven.lifecycle.DefaultLifecycleExecutor.executeGoals(DefaultLifecycleExecutor.java:558)
	... 28 more
[INFO] ------------------------------------------------------------------------
[INFO] Total time: 17 minutes 57 seconds
[INFO] Finished at: Thu Feb 12 10:58:03 PST 2009
[INFO] Final Memory: 89M/164M
[INFO] ------------------------------------------------------------------------


Mime
View raw message