cxf-notifications mailing list archives

Site index · List index
Message view « Date » · « Thread »
Top « Date » · « Thread »
From "Continuum@vmbuild.apache.org" <cxf-notificati...@incubator.apache.org>
Subject [continuum] BUILD SUCCESSFUL: Apache CXF
Date Tue, 03 Jul 2007 15:36:37 GMT
Online report : http://vmbuild.apache.org/continuum/servlet/continuum/target/ProjectBuild.vm/view/ProjectBuild/id/216/buildId/205047
Build statistics:
  State: Ok
  Previous State: Failed
  Started at: Tue, 3 Jul 2007 07:01:12 -0700
  Finished at: Tue, 3 Jul 2007 08:36:36 -0700
  Total time: 1h 35m 23s
  Build Trigger: Schedule
  Exit code: 0
  Building machine hostname: vmbuild.apache.org
  Operating system : Linux(unknown)
  Java version : 1.5.0_06(Sun Microsystems Inc.)

Changes
         eglynn          Changed mtosi_1.1/alarm_retrieval demo to run on port 9091, as 9090 may be already be taken by the zeus-admin service.

             /incubator/cxf/trunk/distribution/src/main/release/samples/mtosi_1.1/alarm_retrieval/src/demo/server/Server.java
            /incubator/cxf/trunk/distribution/src/main/release/samples/mtosi_1.1/wsdl/transport/http/FaultServiceSOAP_HTTP.wsdl
        
****************************************************************************
Output:
****************************************************************************
[INFO] Scanning for projects...
[INFO] Reactor build order: 
[INFO]   Apache CXF
[INFO]   Apache CXF Buildtools
[INFO]   Apache CXF Parent
[INFO]   Apache CXF Common Utilities
[INFO]   Apache CXF Common XSD2Java  Plugins
[INFO]   Apache CXF Common Schemas
[INFO]   Apache CXF XJC Default Value Plugin
[INFO]   Apache CXF XJC Default Value Plugin Tests
[INFO]   Apache CXF XJC Plugins
[INFO]   Apache CXF Common
[INFO]   Apache CXF API
[INFO]   Apache CXF Command Line Tools Common
[INFO]   Apache CXF Runtime Core
[INFO]   Apache CXF Command Line Tools Validator
[INFO]   Apache CXF Command Line Tools WSDLTo Core
[INFO]   Apache CXF Command Line Tools WSDLTo JAXWS Frontend
[INFO]   Apache CXF Command Line Tools WSDLTo JAXB Databinding
[INFO]   Apache CXF Command Line Tools JavaTo Core
[INFO]   Apache CXF Code Generation Maven2 Plugins
[INFO]   Apache CXF Test Utilities
[INFO]   Apache CXF Runtime JAXB DataBinding
[INFO]   Apache CXF Runtime SOAP Binding
[INFO]   Apache CXF Runtime Management
[INFO]   Apache CXF Runtime JMS Transport
[INFO]   Apache CXF Runtime XML Binding
[INFO]   Apache CXF Command Line Tools WSDLTo Test
[INFO]   Apache CXF Command Line Tools WSDLTo Misctools
[INFO]   Apache CXF Command Line Tools
[INFO]   Apache CXF Command Line Tools WSDLTo
[INFO]   Apache CXF Runtime Local transport
[INFO]   Apache CXF Runtime Simple Frontend
[INFO]   Apache CXF Runtime JAX-WS Frontend
[INFO]   Apache CXF Command Line Tools JavaTo Test
[INFO]   Apache CXF Command Line Tools JavaTo
[INFO]   Apache CXF Runtime HTTP transport
[INFO]   Apache CXF Runtime HTTP Jetty transport
[INFO]   Apache CXF Runtime Aegis Databinding
[INFO]   Apache CXF Runtime HTTP Binding
[INFO]   Apache CXF Runtime Object Binding
[INFO]   Apache CXF Colocated Binding
[INFO]   Apache CXF Runtime JBI Binding
[INFO]   Apache CXF Runtime
[INFO]   Apache CXF Runtime Bindings
[INFO]   Apache CXF Runtime JavaScript Frontend
[INFO]   Apache CXF Runtime JBI transport
[INFO]   Apache CXF Runtime WS Policy
[INFO]   Apache CXF Runtime WS Addressing
[INFO]   Apache CXF Runtime WS Reliable Messaging
[INFO]   Apache CXF Runtime WS Security
[INFO]   Apache CXF JBI Integration
[INFO]   Apache CXF JCA Connection
[INFO]   Apache CXF Integration
[INFO]   Apache CXF System Tests
[INFO]   Apache CXF Archetype - cxf-http-basic
[INFO]   Apache CXF Maven Archetypes
[INFO]   Apache CXF Eclipse Plugin Generator Maven2 Plugin
[INFO] ----------------------------------------------------------------------------
[INFO] Building Apache CXF
[INFO]    task-segment: [clean, install]
[INFO] ----------------------------------------------------------------------------
[INFO] [clean:clean]
[INFO] Deleting directory /x1/continuum/working-directory/216/target
[INFO] Deleting directory /x1/continuum/working-directory/216/target/classes
[INFO] Deleting directory /x1/continuum/working-directory/216/target/test-classes
[INFO] [site:attach-descriptor]
[INFO] [install:install]
[INFO] Installing /x1/continuum/working-directory/216/pom.xml to /home/continuum/.m2/repository/org/apache/cxf/cxf/2.1-incubator-SNAPSHOT/cxf-2.1-incubator-SNAPSHOT.pom
[INFO] ----------------------------------------------------------------------------
[INFO] Building Apache CXF Buildtools
[INFO]    task-segment: [clean, install]
[INFO] ----------------------------------------------------------------------------
[INFO] [clean:clean]
[INFO] Deleting directory /x1/continuum/working-directory/216/buildtools/target
[INFO] Deleting directory /x1/continuum/working-directory/216/buildtools/target/classes
[INFO] Deleting directory /x1/continuum/working-directory/216/buildtools/target/test-classes
[INFO] [resources:resources]
[INFO] Using default encoding to copy filtered resources.
[INFO] [compiler:compile]
[INFO] Compiling 1 source file to /x1/continuum/working-directory/216/buildtools/target/classes
[INFO] [resources:testResources]
[INFO] Using default encoding to copy filtered resources.
[INFO] [compiler:testCompile]
[INFO] Not compiling test sources
[INFO] [surefire:test]
[INFO] Tests are skipped.
[INFO] [jar:jar]
[INFO] Building jar: /x1/continuum/working-directory/216/buildtools/target/cxf-buildtools-2.1-incubator-SNAPSHOT.jar
[INFO] [install:install]
[INFO] Installing /x1/continuum/working-directory/216/buildtools/target/cxf-buildtools-2.1-incubator-SNAPSHOT.jar to /home/continuum/.m2/repository/org/apache/cxf/cxf-buildtools/2.1-incubator-SNAPSHOT/cxf-buildtools-2.1-incubator-SNAPSHOT.jar
[INFO] ----------------------------------------------------------------------------
[INFO] Building Apache CXF Parent
[INFO]    task-segment: [clean, install]
[INFO] ----------------------------------------------------------------------------
[INFO] [clean:clean]
[INFO] Deleting directory /x1/continuum/working-directory/216/parent/target
[INFO] Deleting directory /x1/continuum/working-directory/216/parent/target/classes
[INFO] Deleting directory /x1/continuum/working-directory/216/parent/target/test-classes
[INFO] Setting property: classpath.resource.loader.class => 'org.codehaus.plexus.velocity.ContextClassLoaderResourceLoader'.
[INFO] Setting property: velocimacro.messages.on => 'false'.
[INFO] Setting property: resource.loader => 'classpath'.
[INFO] Setting property: resource.manager.logwhenfound => 'false'.
[INFO] ************************************************************** 
[INFO] Starting Jakarta Velocity v1.4
[INFO] RuntimeInstance initializing.
[INFO] Default Properties File: org/apache/velocity/runtime/defaults/velocity.properties
[INFO] Default ResourceManager initializing. (class org.apache.velocity.runtime.resource.ResourceManagerImpl)
[INFO] Resource Loader Instantiated: org.codehaus.plexus.velocity.ContextClassLoaderResourceLoader
[INFO] ClasspathResourceLoader : initialization starting.
[INFO] ClasspathResourceLoader : initialization complete.
[INFO] ResourceCache : initialized. (class org.apache.velocity.runtime.resource.ResourceCacheImpl)
[INFO] Default ResourceManager initialization complete.
[INFO] Loaded System Directive: org.apache.velocity.runtime.directive.Literal
[INFO] Loaded System Directive: org.apache.velocity.runtime.directive.Macro
[INFO] Loaded System Directive: org.apache.velocity.runtime.directive.Parse
[INFO] Loaded System Directive: org.apache.velocity.runtime.directive.Include
[INFO] Loaded System Directive: org.apache.velocity.runtime.directive.Foreach
[INFO] Created: 20 parsers.
[INFO] Velocimacro : initialization starting.
[INFO] Velocimacro : adding VMs from VM library template : VM_global_library.vm
[ERROR] ResourceManager : unable to find resource 'VM_global_library.vm' in any resource loader.
[INFO] Velocimacro : error using  VM library template VM_global_library.vm : org.apache.velocity.exception.ResourceNotFoundException: Unable to find resource 'VM_global_library.vm'
[INFO] Velocimacro :  VM library template macro registration complete.
[INFO] Velocimacro : allowInline = true : VMs can be defined inline in templates
[INFO] Velocimacro : allowInlineToOverride = false : VMs defined inline may NOT replace previous VM definitions
[INFO] Velocimacro : allowInlineLocal = false : VMs defined inline will be  global in scope if allowed.
[INFO] Velocimacro : initialization complete.
[INFO] Velocity successfully started.
[INFO] [checkstyle:checkstyle {execution: validate}]
[INFO] Source directory does not exist - skipping report.
[INFO] Preparing pmd:check
[INFO] [pmd:pmd]
[INFO] [pmd:check {execution: validate}]
[INFO] Setting property: classpath.resource.loader.class => 'org.codehaus.plexus.velocity.ContextClassLoaderResourceLoader'.
[INFO] Setting property: velocimacro.messages.on => 'false'.
[INFO] Setting property: resource.loader => 'classpath'.
[INFO] Setting property: resource.manager.logwhenfound => 'false'.
[INFO] [remote-resources:process {execution: default}]
[INFO] [site:attach-descriptor]
[INFO] [install:install]
[INFO] Installing /x1/continuum/working-directory/216/parent/pom.xml to /home/continuum/.m2/repository/org/apache/cxf/cxf-parent/2.1-incubator-SNAPSHOT/cxf-parent-2.1-incubator-SNAPSHOT.pom
[INFO] ----------------------------------------------------------------------------
[INFO] Building Apache CXF Common Utilities
[INFO]    task-segment: [clean, install]
[INFO] ----------------------------------------------------------------------------
[INFO] [clean:clean]
[INFO] Deleting directory /x1/continuum/working-directory/216/common/common/target
[INFO] Deleting directory /x1/continuum/working-directory/216/common/common/target/classes
[INFO] Deleting directory /x1/continuum/working-directory/216/common/common/target/test-classes
[INFO] [checkstyle:checkstyle {execution: validate}]
[INFO] Starting audit...
Audit done.

[INFO] Preparing pmd:check
[INFO] [pmd:pmd]
[INFO] [pmd:check {execution: validate}]
[INFO] 
[INFO] [remote-resources:process {execution: default}]
[INFO] [resources:resources]
[INFO] Using default encoding to copy filtered resources.
[INFO] [compiler:compile]
[INFO] Compiling 100 source files to /x1/continuum/working-directory/216/common/common/target/classes
[INFO] [resources:testResources]
[INFO] Using default encoding to copy filtered resources.
[INFO] [compiler:testCompile]
[INFO] Compiling 36 source files to /x1/continuum/working-directory/216/common/common/target/test-classes
[INFO] [surefire:test]
[INFO] Surefire report directory: /x1/continuum/working-directory/216/common/common/target/surefire-reports

-------------------------------------------------------
 T E S T S
-------------------------------------------------------
Running org.apache.cxf.helpers.ServiceUtilsTest
Tests run: 1, Failures: 0, Errors: 0, Skipped: 0, Time elapsed: 0.054 sec
Running org.apache.cxf.common.commands.ForkedCommandTest
Tests run: 4, Failures: 0, Errors: 0, Skipped: 0, Time elapsed: 1.759 sec
Running org.apache.cxf.common.classloader.FireWallClassLoaderTest
Tests run: 4, Failures: 0, Errors: 0, Skipped: 0, Time elapsed: 0.039 sec
Running org.apache.cxf.common.util.Base64UtilityTest
Tests run: 3, Failures: 0, Errors: 0, Skipped: 0, Time elapsed: 0.045 sec
Running org.apache.cxf.version.VersionTest
Tests run: 2, Failures: 0, Errors: 0, Skipped: 0, Time elapsed: 0.017 sec
Running org.apache.cxf.common.util.CollectionUtilsTest
Tests run: 2, Failures: 0, Errors: 0, Skipped: 0, Time elapsed: 0.015 sec
Running org.apache.cxf.common.util.PackageUtilsTest
Tests run: 2, Failures: 0, Errors: 0, Skipped: 0, Time elapsed: 0.017 sec
Running org.apache.cxf.configuration.spring.SpringBeanMapTest
Tests run: 1, Failures: 0, Errors: 0, Skipped: 0, Time elapsed: 1.174 sec
Running org.apache.cxf.common.annotation.AnnotationProcessorTest
Tests run: 5, Failures: 0, Errors: 0, Skipped: 0, Time elapsed: 0.172 sec
Running org.apache.cxf.resource.ClassLoaderResolverTest
Tests run: 2, Failures: 0, Errors: 0, Skipped: 0, Time elapsed: 0.042 sec
Running org.apache.cxf.helpers.XMLUtilsTest
Tests run: 1, Failures: 0, Errors: 0, Skipped: 0, Time elapsed: 0.101 sec
Running org.apache.cxf.helpers.NameSpaceTest
Tests run: 2, Failures: 0, Errors: 0, Skipped: 0, Time elapsed: 0.057 sec
Running org.apache.cxf.common.util.TwoStageCacheTest
Tests run: 4, Failures: 0, Errors: 0, Skipped: 0, Time elapsed: 2.197 sec
Running org.apache.cxf.common.i18n.BundleUtilsTest
Tests run: 2, Failures: 0, Errors: 0, Skipped: 0, Time elapsed: 0.018 sec
Running org.apache.cxf.jaxb.JAXBUtilsTest
Tests run: 4, Failures: 0, Errors: 0, Skipped: 0, Time elapsed: 0.051 sec
Running org.apache.cxf.resource.URIResolverTest
Tests run: 2, Failures: 0, Errors: 0, Skipped: 0, Time elapsed: 0.028 sec
Running org.apache.cxf.common.injection.ResourceInjectorTest
Tests run: 8, Failures: 0, Errors: 0, Skipped: 0, Time elapsed: 0.114 sec
Running org.apache.cxf.staxutils.FragmentStreamReaderTest
Tests run: 1, Failures: 0, Errors: 0, Skipped: 0, Time elapsed: 0.314 sec
Running org.apache.cxf.staxutils.W3CDOMStreamReaderTest
Tests run: 1, Failures: 0, Errors: 0, Skipped: 0, Time elapsed: 0.206 sec
Running org.apache.cxf.configuration.spring.SpringBeanQNameMapTest
Tests run: 1, Failures: 0, Errors: 0, Skipped: 0, Time elapsed: 0.15 sec
Running org.apache.cxf.staxutils.StaxUtilsTest
Tests run: 5, Failures: 0, Errors: 0, Skipped: 0, Time elapsed: 0.064 sec
Running org.apache.cxf.jaxb.DatatypeFactoryTest
Tests run: 1, Failures: 0, Errors: 0, Skipped: 0, Time elapsed: 0.03 sec
Running org.apache.cxf.common.i18n.MessageTest
Tests run: 2, Failures: 0, Errors: 0, Skipped: 0, Time elapsed: 0.018 sec
Running org.apache.cxf.common.logging.LogUtilsTest
Tests run: 7, Failures: 0, Errors: 0, Skipped: 0, Time elapsed: 0.164 sec
Running org.apache.cxf.staxutils.DepthXMLStreamReaderTest
Tests run: 1, Failures: 0, Errors: 0, Skipped: 0, Time elapsed: 0.011 sec
Running org.apache.cxf.common.util.PropertiesLoaderUtilsTest
Tests run: 2, Failures: 0, Errors: 0, Skipped: 0, Time elapsed: 0.075 sec
Running org.apache.cxf.common.util.StringUtilsTest
Tests run: 6, Failures: 0, Errors: 0, Skipped: 0, Time elapsed: 0.027 sec
Running org.apache.cxf.jaxb.WrapperHelperTest
Tests run: 1, Failures: 0, Errors: 0, Skipped: 0, Time elapsed: 0.025 sec
Running org.apache.cxf.common.commands.ResultBufferedCommandTest
Tests run: 2, Failures: 0, Errors: 0, Skipped: 0, Time elapsed: 0.652 sec
Running org.apache.cxf.staxutils.StaxStreamFilterTest
Tests run: 2, Failures: 0, Errors: 0, Skipped: 0, Time elapsed: 0.047 sec

Results :

Tests run: 81, Failures: 0, Errors: 0, Skipped: 0

[INFO] [jar:jar]
[INFO] Building jar: /x1/continuum/working-directory/216/common/common/target/cxf-common-utilities-2.1-incubator-SNAPSHOT.jar
[INFO] [install:install]
[INFO] Installing /x1/continuum/working-directory/216/common/common/target/cxf-common-utilities-2.1-incubator-SNAPSHOT.jar to /home/continuum/.m2/repository/org/apache/cxf/cxf-common-utilities/2.1-incubator-SNAPSHOT/cxf-common-utilities-2.1-incubator-SNAPSHOT.jar
[INFO] ----------------------------------------------------------------------------
[INFO] Building Apache CXF Common XSD2Java  Plugins
[INFO]    task-segment: [clean, install]
[INFO] ----------------------------------------------------------------------------
[INFO] [clean:clean]
[INFO] Deleting directory /x1/continuum/working-directory/216/common/xsd/target
[INFO] Deleting directory /x1/continuum/working-directory/216/common/xsd/target/classes
[INFO] Deleting directory /x1/continuum/working-directory/216/common/xsd/target/test-classes
[INFO] [checkstyle:checkstyle {execution: validate}]
[INFO] Starting audit...
Audit done.

[INFO] Preparing pmd:check
[INFO] [pmd:pmd]
[INFO] [pmd:check {execution: validate}]
[INFO] 
[INFO] [plugin:descriptor]
[INFO] Using 2 extractors.
[INFO] Applying extractor for language: java
[INFO] Extractor for language: java found 1 mojo descriptors.
[INFO] Applying extractor for language: bsh
[INFO] Extractor for language: bsh found 0 mojo descriptors.
[INFO] [remote-resources:process {execution: default}]
[INFO] [resources:resources]
[INFO] Using default encoding to copy filtered resources.
[INFO] [compiler:compile]
[INFO] Compiling 3 source files to /x1/continuum/working-directory/216/common/xsd/target/classes
[INFO] [resources:testResources]
[INFO] Using default encoding to copy filtered resources.
[INFO] [compiler:testCompile]
[INFO] No sources to compile
[INFO] [surefire:test]
[INFO] Surefire report directory: /x1/continuum/working-directory/216/common/xsd/target/surefire-reports

-------------------------------------------------------
 T E S T S
-------------------------------------------------------
There are no tests to run.

Results :

Tests run: 0, Failures: 0, Errors: 0, Skipped: 0

[INFO] [jar:jar]
[INFO] Building jar: /x1/continuum/working-directory/216/common/xsd/target/cxf-common-xsd-2.1-incubator-SNAPSHOT.jar
[INFO] [plugin:addPluginArtifactMetadata]
[INFO] [install:install]
[INFO] Installing /x1/continuum/working-directory/216/common/xsd/target/cxf-common-xsd-2.1-incubator-SNAPSHOT.jar to /home/continuum/.m2/repository/org/apache/cxf/cxf-common-xsd/2.1-incubator-SNAPSHOT/cxf-common-xsd-2.1-incubator-SNAPSHOT.jar
[INFO] [plugin:updateRegistry]
[INFO] ----------------------------------------------------------------------------
[INFO] Building Apache CXF Common Schemas
[INFO]    task-segment: [clean, install]
[INFO] ----------------------------------------------------------------------------
[INFO] [clean:clean]
[INFO] Deleting directory /x1/continuum/working-directory/216/common/schemas/target
[INFO] Deleting directory /x1/continuum/working-directory/216/common/schemas/target/classes
[INFO] Deleting directory /x1/continuum/working-directory/216/common/schemas/target/test-classes
[INFO] [checkstyle:checkstyle {execution: validate}]
[INFO] Starting audit...
Audit done.

[INFO] Preparing pmd:check
[INFO] [pmd:pmd]
[INFO] [pmd:check {execution: validate}]
[INFO] 
[INFO] [remote-resources:process {execution: default}]
[INFO] [resources:resources]
[INFO] Using default encoding to copy filtered resources.
[INFO] [compiler:compile]
[INFO] No sources to compile
[INFO] [resources:testResources]
[INFO] Using default encoding to copy filtered resources.
[INFO] [compiler:testCompile]
[INFO] Not compiling test sources
[INFO] [surefire:test]
[INFO] Tests are skipped.
[INFO] [jar:jar]
[INFO] Building jar: /x1/continuum/working-directory/216/common/schemas/target/cxf-common-schemas-2.1-incubator-SNAPSHOT.jar
[INFO] [install:install]
[INFO] Installing /x1/continuum/working-directory/216/common/schemas/target/cxf-common-schemas-2.1-incubator-SNAPSHOT.jar to /home/continuum/.m2/repository/org/apache/cxf/cxf-common-schemas/2.1-incubator-SNAPSHOT/cxf-common-schemas-2.1-incubator-SNAPSHOT.jar
[INFO] ----------------------------------------------------------------------------
[INFO] Building Apache CXF XJC Default Value Plugin
[INFO]    task-segment: [clean, install]
[INFO] ----------------------------------------------------------------------------
[INFO] [clean:clean]
[INFO] Deleting directory /x1/continuum/working-directory/216/common/xjc/dv/target
[INFO] Deleting directory /x1/continuum/working-directory/216/common/xjc/dv/target/classes
[INFO] Deleting directory /x1/continuum/working-directory/216/common/xjc/dv/target/test-classes
[INFO] [checkstyle:checkstyle {execution: validate}]
[INFO] Starting audit...
Audit done.

[INFO] Preparing pmd:check
[INFO] [pmd:pmd]
[INFO] [pmd:check {execution: validate}]
[INFO] 
[INFO] [remote-resources:process {execution: default}]
[INFO] [resources:resources]
[INFO] Using default encoding to copy filtered resources.
[INFO] [compiler:compile]
[INFO] Compiling 1 source file to /x1/continuum/working-directory/216/common/xjc/dv/target/classes
[INFO] [resources:testResources]
[INFO] Using default encoding to copy filtered resources.
[INFO] [compiler:testCompile]
[INFO] Not compiling test sources
[INFO] [surefire:test]
[INFO] Tests are skipped.
[INFO] [jar:jar]
[INFO] Building jar: /x1/continuum/working-directory/216/common/xjc/dv/target/cxf-xjc-dv-2.1-incubator-SNAPSHOT.jar
[INFO] [install:install]
[INFO] Installing /x1/continuum/working-directory/216/common/xjc/dv/target/cxf-xjc-dv-2.1-incubator-SNAPSHOT.jar to /home/continuum/.m2/repository/org/apache/cxf/cxf-xjc-dv/2.1-incubator-SNAPSHOT/cxf-xjc-dv-2.1-incubator-SNAPSHOT.jar
[INFO] ----------------------------------------------------------------------------
[INFO] Building Apache CXF XJC Default Value Plugin Tests
[INFO]    task-segment: [clean, install]
[INFO] ----------------------------------------------------------------------------
[INFO] [clean:clean]
[INFO] Deleting directory /x1/continuum/working-directory/216/common/xjc/dv-test/target
[INFO] Deleting directory /x1/continuum/working-directory/216/common/xjc/dv-test/target/classes
[INFO] Deleting directory /x1/continuum/working-directory/216/common/xjc/dv-test/target/test-classes
[INFO] [checkstyle:checkstyle {execution: validate}]
[INFO] Starting audit...
Audit done.

[INFO] Preparing pmd:check
[INFO] [pmd:pmd]
[INFO] [pmd:check {execution: validate}]
[INFO] 
[INFO] [jaxb:generate {execution: default}]
[INFO] Compiling file:/x1/continuum/working-directory/216/common/xjc/dv-test/src/test/resources/schemas/configuration/foo.xsd
[INFO] Writing output to /x1/continuum/working-directory/216/common/xjc/dv-test/target/generated/src/test/java
[INFO] [remote-resources:process {execution: default}]
[INFO] [resources:resources]
[INFO] Using default encoding to copy filtered resources.
[INFO] [compiler:compile]
[INFO] Compiling 4 source files to /x1/continuum/working-directory/216/common/xjc/dv-test/target/classes
[INFO] [resources:testResources]
[INFO] Using default encoding to copy filtered resources.
[INFO] [compiler:testCompile]
[INFO] Compiling 1 source file to /x1/continuum/working-directory/216/common/xjc/dv-test/target/test-classes
[INFO] [surefire:test]
[INFO] Surefire report directory: /x1/continuum/working-directory/216/common/xjc/dv-test/target/surefire-reports

-------------------------------------------------------
 T E S T S
-------------------------------------------------------
Running org.apache.cxf.xjc.dv.DefaultValueTest
Tests run: 1, Failures: 0, Errors: 0, Skipped: 0, Time elapsed: 0.173 sec

Results :

Tests run: 1, Failures: 0, Errors: 0, Skipped: 0

[INFO] [jar:jar]
[INFO] Building jar: /x1/continuum/working-directory/216/common/xjc/dv-test/target/cxf-xjc-dv-test-2.1-incubator-SNAPSHOT.jar
[INFO] [install:install]
[INFO] Installing /x1/continuum/working-directory/216/common/xjc/dv-test/target/cxf-xjc-dv-test-2.1-incubator-SNAPSHOT.jar to /home/continuum/.m2/repository/org/apache/cxf/cxf-xjc-dv-test/2.1-incubator-SNAPSHOT/cxf-xjc-dv-test-2.1-incubator-SNAPSHOT.jar
[INFO] ----------------------------------------------------------------------------
[INFO] Building Apache CXF XJC Plugins
[INFO]    task-segment: [clean, install]
[INFO] ----------------------------------------------------------------------------
[INFO] [clean:clean]
[INFO] Deleting directory /x1/continuum/working-directory/216/common/xjc/target
[INFO] Deleting directory /x1/continuum/working-directory/216/common/xjc/target/classes
[INFO] Deleting directory /x1/continuum/working-directory/216/common/xjc/target/test-classes
[INFO] [checkstyle:checkstyle {execution: validate}]
[INFO] Source directory does not exist - skipping report.
[INFO] Preparing pmd:check
[INFO] [pmd:pmd]
[INFO] [pmd:check {execution: validate}]
[INFO] [remote-resources:process {execution: default}]
[INFO] [site:attach-descriptor]
[INFO] [install:install]
[INFO] Installing /x1/continuum/working-directory/216/common/xjc/pom.xml to /home/continuum/.m2/repository/org/apache/cxf/cxf-xjc/2.1-incubator-SNAPSHOT/cxf-xjc-2.1-incubator-SNAPSHOT.pom
[INFO] ----------------------------------------------------------------------------
[INFO] Building Apache CXF Common
[INFO]    task-segment: [clean, install]
[INFO] ----------------------------------------------------------------------------
[INFO] [clean:clean]
[INFO] Deleting directory /x1/continuum/working-directory/216/common/target
[INFO] Deleting directory /x1/continuum/working-directory/216/common/target/classes
[INFO] Deleting directory /x1/continuum/working-directory/216/common/target/test-classes
[INFO] [site:attach-descriptor]
[INFO] [install:install]
[INFO] Installing /x1/continuum/working-directory/216/common/pom.xml to /home/continuum/.m2/repository/org/apache/cxf/cxf-common/2.1-incubator-SNAPSHOT/cxf-common-2.1-incubator-SNAPSHOT.pom
[INFO] ----------------------------------------------------------------------------
[INFO] Building Apache CXF API
[INFO]    task-segment: [clean, install]
[INFO] ----------------------------------------------------------------------------
[INFO] [clean:clean]
[INFO] Deleting directory /x1/continuum/working-directory/216/api/target
[INFO] Deleting directory /x1/continuum/working-directory/216/api/target/classes
[INFO] Deleting directory /x1/continuum/working-directory/216/api/target/test-classes
[INFO] [checkstyle:checkstyle {execution: validate}]
[INFO] Starting audit...
Audit done.

[INFO] Preparing pmd:check
[INFO] [pmd:pmd]
[INFO] [pmd:check {execution: validate}]
[INFO] 
[INFO] [dependency:unpack {execution: unpack-schemas}]
[INFO] Configured Artifact: org.apache.cxf:cxf-common-schemas:2.1-incubator-SNAPSHOT:jar
[INFO] Expanding: /home/continuum/.m2/repository/org/apache/cxf/cxf-common-schemas/2.1-incubator-SNAPSHOT/cxf-common-schemas-2.1-incubator-SNAPSHOT.jar into /x1/continuum/working-directory/216/api/target/schemas
[INFO] [cxf-common-xsd:xsdtojava {execution: generate-sources}]
[INFO] [remote-resources:process {execution: default}]
[INFO] [resources:resources]
[INFO] Using default encoding to copy filtered resources.
[INFO] [compiler:compile]
[INFO] Compiling 220 source files to /x1/continuum/working-directory/216/api/target/classes
[INFO] [cxf-common-xsd:xsdtojava {execution: generate-test-sources}]
[INFO] [resources:testResources]
[INFO] Using default encoding to copy filtered resources.
[INFO] [compiler:testCompile]
[INFO] Compiling 28 source files to /x1/continuum/working-directory/216/api/target/test-classes
[INFO] [surefire:test]
[INFO] Surefire report directory: /x1/continuum/working-directory/216/api/target/surefire-reports

-------------------------------------------------------
 T E S T S
-------------------------------------------------------
Running org.apache.cxf.wsdl.JAXBExtensionHelperTest
Tests run: 2, Failures: 0, Errors: 0, Skipped: 0, Time elapsed: 1.952 sec
Running org.apache.cxf.service.model.BindingMessageInfoTest
Tests run: 1, Failures: 0, Errors: 0, Skipped: 0, Time elapsed: 0.023 sec
Running org.apache.cxf.ws.policy.IntersectorTest
Tests run: 3, Failures: 0, Errors: 0, Skipped: 0, Time elapsed: 0.097 sec
Running org.apache.cxf.ws.policy.builder.jaxb.JaxbAssertionTest
Tests run: 3, Failures: 0, Errors: 0, Skipped: 0, Time elapsed: 0.588 sec
Running org.apache.cxf.ws.policy.builder.jaxb.JaxbAssertionBuilderTest
Tests run: 3, Failures: 0, Errors: 0, Skipped: 0, Time elapsed: 0.079 sec
Running org.apache.cxf.service.model.OperationInfoTest
Tests run: 5, Failures: 0, Errors: 0, Skipped: 0, Time elapsed: 0.114 sec
Running org.apache.cxf.ws.policy.AssertionInfoMapTest
Tests run: 3, Failures: 0, Errors: 0, Skipped: 0, Time elapsed: 0.043 sec
Running org.apache.cxf.BusFactoryTest
Tests run: 1, Failures: 0, Errors: 0, Skipped: 0, Time elapsed: 0.016 sec
Running org.apache.cxf.service.model.FaultInfoTest
Tests run: 1, Failures: 0, Errors: 0, Skipped: 0, Time elapsed: 0.008 sec
Running org.apache.cxf.service.model.SchemaInfoTest
Tests run: 2, Failures: 0, Errors: 0, Skipped: 0, Time elapsed: 0.025 sec
Running org.apache.cxf.service.model.MessagePartInfoTest
Tests run: 3, Failures: 0, Errors: 0, Skipped: 0, Time elapsed: 0.024 sec
Running org.apache.cxf.ws.policy.builder.primitive.NestedPrimitiveAssertionTest
Tests run: 1, Failures: 0, Errors: 0, Skipped: 0, Time elapsed: 0.027 sec
Running org.apache.cxf.service.model.BindingFaultInfoTest
Tests run: 1, Failures: 0, Errors: 0, Skipped: 0, Time elapsed: 0.018 sec
Running org.apache.cxf.ws.policy.builder.primitive.NestedPrimitiveAssertionBuilderTest
Tests run: 5, Failures: 0, Errors: 0, Skipped: 0, Time elapsed: 0.164 sec
Running org.apache.cxf.service.model.InterfaceInfoTest
Tests run: 2, Failures: 0, Errors: 0, Skipped: 0, Time elapsed: 0.031 sec
Running org.apache.cxf.phase.PhaseInterceptorChainTest
Tests run: 16, Failures: 0, Errors: 0, Skipped: 0, Time elapsed: 0.278 sec
Running org.apache.cxf.service.model.BindingOperationInfoTest
Tests run: 6, Failures: 0, Errors: 0, Skipped: 0, Time elapsed: 0.027 sec
Running org.apache.cxf.service.model.MessageInfoTest
Tests run: 2, Failures: 0, Errors: 0, Skipped: 0, Time elapsed: 0.009 sec

Results :

Tests run: 60, Failures: 0, Errors: 0, Skipped: 0

[INFO] [jar:jar]
[INFO] Building jar: /x1/continuum/working-directory/216/api/target/cxf-api-2.1-incubator-SNAPSHOT.jar
[INFO] Preparing javadoc:jar
[WARNING] Removing: check from forked lifecycle, to prevent recursive invocation.
[WARNING] Removing: jar from forked lifecycle, to prevent recursive invocation.
[INFO] [checkstyle:checkstyle {execution: validate}]
[INFO] Starting audit...
Audit done.

[INFO] [dependency:unpack {execution: unpack-schemas}]
[INFO] Configured Artifact: org.apache.cxf:cxf-common-schemas:2.1-incubator-SNAPSHOT:jar
[INFO] cxf-common-schemas-2.1-incubator-SNAPSHOT.jar already unpacked.
[INFO] [cxf-common-xsd:xsdtojava {execution: generate-sources}]
[INFO] [javadoc:jar {execution: package}]
7 warnings
[INFO] Javadoc Warnings
[WARNING] javadoc: warning - Multiple sources of package comments found for package "org.apache.cxf.endpoint"
[WARNING] javadoc: warning - Multiple sources of package comments found for package "org.apache.cxf.transport"
[WARNING] javadoc: warning - Multiple sources of package comments found for package "org.apache.cxf.interceptor"
[WARNING] javadoc: warning - Multiple sources of package comments found for package "org.apache.cxf.service"
[WARNING] javadoc: warning - Multiple sources of package comments found for package "org.apache.cxf.phase"
[WARNING] javadoc: warning - Multiple sources of package comments found for package "org.apache.cxf.binding"
[WARNING] javadoc: warning - Multiple sources of package comments found for package "org.apache.cxf"
[INFO] Building jar: /x1/continuum/working-directory/216/api/target/cxf-api-2.1-incubator-SNAPSHOT-javadoc.jar
[INFO] [install:install]
[INFO] Installing /x1/continuum/working-directory/216/api/target/cxf-api-2.1-incubator-SNAPSHOT.jar to /home/continuum/.m2/repository/org/apache/cxf/cxf-api/2.1-incubator-SNAPSHOT/cxf-api-2.1-incubator-SNAPSHOT.jar
[INFO] Installing /x1/continuum/working-directory/216/api/target/cxf-api-2.1-incubator-SNAPSHOT-javadoc.jar to /home/continuum/.m2/repository/org/apache/cxf/cxf-api/2.1-incubator-SNAPSHOT/cxf-api-2.1-incubator-SNAPSHOT-javadoc.jar
[INFO] ----------------------------------------------------------------------------
[INFO] Building Apache CXF Command Line Tools Common
[INFO]    task-segment: [clean, install]
[INFO] ----------------------------------------------------------------------------
[INFO] [clean:clean]
[INFO] Deleting directory /x1/continuum/working-directory/216/tools/common/target
[INFO] Deleting directory /x1/continuum/working-directory/216/tools/common/target/classes
[INFO] Deleting directory /x1/continuum/working-directory/216/tools/common/target/test-classes
[INFO] [checkstyle:checkstyle {execution: validate}]
[INFO] Starting audit...
Audit done.

[INFO] Preparing pmd:check
[INFO] [pmd:pmd]
[INFO] [pmd:check {execution: validate}]
[INFO] 
[INFO] [remote-resources:process {execution: default}]
[INFO] [resources:resources]
[INFO] Using default encoding to copy filtered resources.
[INFO] [compiler:compile]
[INFO] Compiling 70 source files to /x1/continuum/working-directory/216/tools/common/target/classes
[INFO] [resources:testResources]
[INFO] Using default encoding to copy filtered resources.
[INFO] [compiler:testCompile]
[INFO] Compiling 20 source files to /x1/continuum/working-directory/216/tools/common/target/test-classes
[INFO] [surefire:test]
[INFO] Surefire report directory: /x1/continuum/working-directory/216/tools/common/target/surefire-reports

-------------------------------------------------------
 T E S T S
-------------------------------------------------------
Running org.apache.cxf.tools.common.ToolContextTest
Tests run: 1, Failures: 0, Errors: 0, Skipped: 0, Time elapsed: 0.054 sec
Running org.apache.cxf.tools.common.toolspec.parser.CommandLineParserTest
Tests run: 16, Failures: 0, Errors: 0, Skipped: 0, Time elapsed: 3.513 sec
Running org.apache.cxf.tools.common.ProcessorEnvironmentTest
Tests run: 7, Failures: 0, Errors: 0, Skipped: 0, Time elapsed: 0.062 sec
Running org.apache.cxf.tools.common.model.JavaClassTest
Tests run: 2, Failures: 0, Errors: 0, Skipped: 0, Time elapsed: 0.066 sec
Running org.apache.cxf.tools.common.toolspec.ToolSupportTest
Tests run: 1, Failures: 0, Errors: 0, Skipped: 0, Time elapsed: 0.013 sec
Running org.apache.cxf.tools.common.model.JavaParameterTest
Tests run: 1, Failures: 0, Errors: 0, Skipped: 0, Time elapsed: 0.012 sec
Running org.apache.cxf.tools.util.URIParserUtilTest
Tests run: 3, Failures: 0, Errors: 0, Skipped: 0, Time elapsed: 0.058 sec
Running org.apache.cxf.tools.common.model.JavaTypeTest
Tests run: 3, Failures: 0, Errors: 0, Skipped: 0, Time elapsed: 0.015 sec
Running org.apache.cxf.tools.common.toolspec.AbstractToolContainerTest
Tests run: 3, Failures: 0, Errors: 0, Skipped: 0, Time elapsed: 0.175 sec
Running org.apache.cxf.tools.common.dom.SchemaValidatingSAXParserTest
Tests run: 1, Failures: 0, Errors: 0, Skipped: 0, Time elapsed: 0.052 sec
Running org.apache.cxf.tools.common.dom.ExtendedDocumentBuilderTest
Tests run: 2, Failures: 0, Errors: 0, Skipped: 0, Time elapsed: 0.025 sec
Running org.apache.cxf.tools.common.WSDLVersionTest
Tests run: 1, Failures: 0, Errors: 0, Skipped: 0, Time elapsed: 0.022 sec
Running org.apache.cxf.tools.util.BuiltInTypesJavaMappingUtilTest
Tests run: 1, Failures: 0, Errors: 0, Skipped: 0, Time elapsed: 0.017 sec
Running org.apache.cxf.tools.util.NameUtilTest
Tests run: 3, Failures: 0, Errors: 0, Skipped: 0, Time elapsed: 0.021 sec
Running org.apache.cxf.tools.util.FileWriterUtilTest
Tests run: 2, Failures: 0, Errors: 0, Skipped: 0, Time elapsed: 0.043 sec
Running org.apache.cxf.tools.common.toolspec.ToolExceptionTest
Tests run: 1, Failures: 0, Errors: 0, Skipped: 0, Time elapsed: 0.013 sec
Running org.apache.cxf.tools.common.dom.DocumentTest
Tests run: 1, Failures: 0, Errors: 0, Skipped: 1, Time elapsed: 0.009 sec
Running org.apache.cxf.tools.common.model.JavaInterfaceTest
Tests run: 1, Failures: 0, Errors: 0, Skipped: 0, Time elapsed: 0.005 sec
Running org.apache.cxf.tools.common.toolspec.ToolSpecTest
Tests run: 8, Failures: 0, Errors: 0, Skipped: 0, Time elapsed: 0.165 sec

Results :

Tests run: 58, Failures: 0, Errors: 0, Skipped: 1

[INFO] [jar:jar]
[INFO] Building jar: /x1/continuum/working-directory/216/tools/common/target/cxf-tools-common-2.1-incubator-SNAPSHOT.jar
[INFO] [install:install]
[INFO] Installing /x1/continuum/working-directory/216/tools/common/target/cxf-tools-common-2.1-incubator-SNAPSHOT.jar to /home/continuum/.m2/repository/org/apache/cxf/cxf-tools-common/2.1-incubator-SNAPSHOT/cxf-tools-common-2.1-incubator-SNAPSHOT.jar
[INFO] ----------------------------------------------------------------------------
[INFO] Building Apache CXF Runtime Core
[INFO]    task-segment: [clean, install]
[INFO] ----------------------------------------------------------------------------
[INFO] [clean:clean]
[INFO] Deleting directory /x1/continuum/working-directory/216/rt/core/target
[INFO] Deleting directory /x1/continuum/working-directory/216/rt/core/target/classes
[INFO] Deleting directory /x1/continuum/working-directory/216/rt/core/target/test-classes
[INFO] [checkstyle:checkstyle {execution: validate}]
[INFO] Starting audit...
Audit done.

[INFO] Preparing pmd:check
[INFO] [pmd:pmd]
[INFO] [pmd:check {execution: validate}]
[INFO] 
[INFO] [remote-resources:process {execution: default}]
[INFO] [resources:resources]
[INFO] Using default encoding to copy filtered resources.
[INFO] [compiler:compile]
[INFO] Compiling 135 source files to /x1/continuum/working-directory/216/rt/core/target/classes
[INFO] [resources:testResources]
[INFO] Using default encoding to copy filtered resources.
[INFO] [compiler:testCompile]
[INFO] Compiling 30 source files to /x1/continuum/working-directory/216/rt/core/target/test-classes
[INFO] [surefire:test]
[INFO] Surefire report directory: /x1/continuum/working-directory/216/rt/core/target/surefire-reports

-------------------------------------------------------
 T E S T S
-------------------------------------------------------
Running org.apache.cxf.interceptor.OutgoingChainInterceptorTest
Tests run: 1, Failures: 0, Errors: 0, Skipped: 0, Time elapsed: 1.201 sec
Running org.apache.cxf.test.XPathAssertTest
Tests run: 2, Failures: 0, Errors: 0, Skipped: 0, Time elapsed: 0.419 sec
Running org.apache.cxf.buslifecycle.CXFBusLifeCycleManagerTest
Tests run: 5, Failures: 0, Errors: 0, Skipped: 0, Time elapsed: 0.059 sec
Running org.apache.cxf.endpoint.EndpointResolverRegistryImplTest
Tests run: 6, Failures: 0, Errors: 0, Skipped: 0, Time elapsed: 0.113 sec
Running org.apache.cxf.bus.extension.ExtensionTest
Tests run: 3, Failures: 0, Errors: 0, Skipped: 0, Time elapsed: 0.03 sec
Running org.apache.cxf.attachment.AttachmentSerializerTest
Tests run: 2, Failures: 0, Errors: 0, Skipped: 0, Time elapsed: 0.379 sec
Running org.apache.cxf.wsdl11.WSDLManagerImplTest
Tests run: 2, Failures: 0, Errors: 0, Skipped: 0, Time elapsed: 0.562 sec
Running org.apache.cxf.configuration.spring.ConfigurerImplTest
Tests run: 4, Failures: 0, Errors: 0, Skipped: 0, Time elapsed: 1.837 sec
Running org.apache.cxf.transport.CachedOutputStreamTest
Tests run: 1, Failures: 0, Errors: 0, Skipped: 0, Time elapsed: 0.091 sec
Running org.apache.cxf.workqueue.AutomaticWorkQueueTest
Tests run: 10, Failures: 0, Errors: 0, Skipped: 0, Time elapsed: 12.002 sec
Running org.apache.cxf.bus.CXFBusImplTest
Tests run: 7, Failures: 0, Errors: 0, Skipped: 0, Time elapsed: 1.137 sec
Running org.apache.cxf.endpoint.ServerRegistryImpTest
Tests run: 1, Failures: 0, Errors: 0, Skipped: 0, Time elapsed: 0.009 sec
Running org.apache.cxf.bus.spring.SpringBusFactoryTest
Tests run: 7, Failures: 0, Errors: 0, Skipped: 0, Time elapsed: 1.771 sec
Running org.apache.cxf.interceptor.ServiceInvokerInterceptorTest
Tests run: 1, Failures: 0, Errors: 0, Skipped: 0, Time elapsed: 0.019 sec
Running org.apache.cxf.wsdl11.WSDLDefinitionBuilderTest
Tests run: 2, Failures: 0, Errors: 0, Skipped: 0, Time elapsed: 0.074 sec
Running org.apache.cxf.bus.spring.BusApplicationContextTest
Tests run: 1, Failures: 0, Errors: 0, Skipped: 0, Time elapsed: 0.43 sec
Running org.apache.cxf.bus.extension.ExtensionFragmentParserTest
Tests run: 1, Failures: 0, Errors: 0, Skipped: 0, Time elapsed: 0.01 sec
Running org.apache.cxf.transport.HttpUriMapperTest
Tests run: 2, Failures: 0, Errors: 0, Skipped: 0, Time elapsed: 0.014 sec
Running org.apache.cxf.bus.extension.ExtensionManagerTest
Tests run: 2, Failures: 0, Errors: 0, Skipped: 0, Time elapsed: 0.022 sec
Running org.apache.cxf.wsdl11.ServiceWSDLBuilderTest
Tests run: 8, Failures: 0, Errors: 0, Skipped: 0, Time elapsed: 0.777 sec
Running org.apache.cxf.bus.spring.BusDefinitionParserTest
Tests run: 1, Failures: 0, Errors: 0, Skipped: 0, Time elapsed: 0.321 sec
Running org.apache.cxf.attachment.AttachmentDeserializerTest
Tests run: 4, Failures: 0, Errors: 0, Skipped: 0, Time elapsed: 0.038 sec
Running org.apache.cxf.wsdl11.WSDLServiceBuilderTest
Tests run: 14, Failures: 0, Errors: 0, Skipped: 0, Time elapsed: 1.055 sec

Results :

Tests run: 87, Failures: 0, Errors: 0, Skipped: 0

[INFO] [jar:jar]
[INFO] Building jar: /x1/continuum/working-directory/216/rt/core/target/cxf-rt-core-2.1-incubator-SNAPSHOT.jar
[INFO] [install:install]
[INFO] Installing /x1/continuum/working-directory/216/rt/core/target/cxf-rt-core-2.1-incubator-SNAPSHOT.jar to /home/continuum/.m2/repository/org/apache/cxf/cxf-rt-core/2.1-incubator-SNAPSHOT/cxf-rt-core-2.1-incubator-SNAPSHOT.jar
[INFO] ----------------------------------------------------------------------------
[INFO] Building Apache CXF Command Line Tools Validator
[INFO]    task-segment: [clean, install]
[INFO] ----------------------------------------------------------------------------
[INFO] [clean:clean]
[INFO] Deleting directory /x1/continuum/working-directory/216/tools/validator/target
[INFO] Deleting directory /x1/continuum/working-directory/216/tools/validator/target/classes
[INFO] Deleting directory /x1/continuum/working-directory/216/tools/validator/target/test-classes
[INFO] [checkstyle:checkstyle {execution: validate}]
[INFO] Starting audit...
Audit done.

[INFO] Preparing pmd:check
[INFO] [pmd:pmd]
[INFO] [pmd:check {execution: validate}]
[INFO] 
[INFO] [remote-resources:process {execution: default}]
[INFO] [resources:resources]
[INFO] Using default encoding to copy filtered resources.
[INFO] [compiler:compile]
[INFO] Compiling 24 source files to /x1/continuum/working-directory/216/tools/validator/target/classes
[INFO] [resources:testResources]
[INFO] Using default encoding to copy filtered resources.
[INFO] [compiler:testCompile]
[INFO] Compiling 5 source files to /x1/continuum/working-directory/216/tools/validator/target/test-classes
[INFO] [surefire:test]
[INFO] Surefire report directory: /x1/continuum/working-directory/216/tools/validator/target/surefire-reports

-------------------------------------------------------
 T E S T S
-------------------------------------------------------
Running org.apache.cxf.tools.validator.WSDLValidationTest
Tests run: 12, Failures: 0, Errors: 0, Skipped: 0, Time elapsed: 6.724 sec
Running org.apache.cxf.tools.validator.internal.WSDLRefValidatorTest
Tests run: 7, Failures: 0, Errors: 0, Skipped: 0, Time elapsed: 0.641 sec
Running org.apache.cxf.tools.validator.internal.WSDL11ValidatorTest
Tests run: 1, Failures: 0, Errors: 0, Skipped: 0, Time elapsed: 0.089 sec
Running org.apache.cxf.tools.validator.internal.Stax2DOMTest
Tests run: 1, Failures: 0, Errors: 0, Skipped: 0, Time elapsed: 0.062 sec
Running org.apache.cxf.tools.validator.internal.model.XNodeTest
Tests run: 3, Failures: 0, Errors: 0, Skipped: 0, Time elapsed: 0.025 sec

Results :

Tests run: 24, Failures: 0, Errors: 0, Skipped: 0

[INFO] [jar:jar]
[INFO] Building jar: /x1/continuum/working-directory/216/tools/validator/target/cxf-tools-validator-2.1-incubator-SNAPSHOT.jar
[INFO] [install:install]
[INFO] Installing /x1/continuum/working-directory/216/tools/validator/target/cxf-tools-validator-2.1-incubator-SNAPSHOT.jar to /home/continuum/.m2/repository/org/apache/cxf/cxf-tools-validator/2.1-incubator-SNAPSHOT/cxf-tools-validator-2.1-incubator-SNAPSHOT.jar
[INFO] ----------------------------------------------------------------------------
[INFO] Building Apache CXF Command Line Tools WSDLTo Core
[INFO]    task-segment: [clean, install]
[INFO] ----------------------------------------------------------------------------
[INFO] [clean:clean]
[INFO] Deleting directory /x1/continuum/working-directory/216/tools/wsdlto/core/target
[INFO] Deleting directory /x1/continuum/working-directory/216/tools/wsdlto/core/target/classes
[INFO] Deleting directory /x1/continuum/working-directory/216/tools/wsdlto/core/target/test-classes
[INFO] [checkstyle:checkstyle {execution: validate}]
[INFO] Starting audit...
Audit done.

[INFO] Preparing pmd:check
[INFO] [pmd:pmd]
[INFO] [pmd:check {execution: validate}]
[INFO] 
[INFO] [cxf-common-xsd:xsdtojava {execution: generate-sources}]
[INFO] [remote-resources:process {execution: default}]
[INFO] [resources:resources]
[INFO] Using default encoding to copy filtered resources.
[INFO] [compiler:compile]
[INFO] Compiling 18 source files to /x1/continuum/working-directory/216/tools/wsdlto/core/target/classes
[INFO] [resources:testResources]
[INFO] Using default encoding to copy filtered resources.
[INFO] [compiler:testCompile]
[INFO] Compiling 1 source file to /x1/continuum/working-directory/216/tools/wsdlto/core/target/test-classes
[INFO] [surefire:test]
[INFO] Surefire report directory: /x1/continuum/working-directory/216/tools/wsdlto/core/target/surefire-reports

-------------------------------------------------------
 T E S T S
-------------------------------------------------------
Running org.apache.cxf.tools.wsdlto.WSDLToJavaContainerTest
Tests run: 1, Failures: 0, Errors: 0, Skipped: 0, Time elapsed: 0.188 sec

Results :

Tests run: 1, Failures: 0, Errors: 0, Skipped: 0

[INFO] [jar:jar]
[INFO] Building jar: /x1/continuum/working-directory/216/tools/wsdlto/core/target/cxf-tools-wsdlto-core-2.1-incubator-SNAPSHOT.jar
[INFO] [install:install]
[INFO] Installing /x1/continuum/working-directory/216/tools/wsdlto/core/target/cxf-tools-wsdlto-core-2.1-incubator-SNAPSHOT.jar to /home/continuum/.m2/repository/org/apache/cxf/cxf-tools-wsdlto-core/2.1-incubator-SNAPSHOT/cxf-tools-wsdlto-core-2.1-incubator-SNAPSHOT.jar
[INFO] ----------------------------------------------------------------------------
[INFO] Building Apache CXF Command Line Tools WSDLTo JAXWS Frontend
[INFO]    task-segment: [clean, install]
[INFO] ----------------------------------------------------------------------------
[INFO] [clean:clean]
[INFO] Deleting directory /x1/continuum/working-directory/216/tools/wsdlto/frontend/jaxws/target
[INFO] Deleting directory /x1/continuum/working-directory/216/tools/wsdlto/frontend/jaxws/target/classes
[INFO] Deleting directory /x1/continuum/working-directory/216/tools/wsdlto/frontend/jaxws/target/test-classes
[INFO] [checkstyle:checkstyle {execution: validate}]
[INFO] Starting audit...
Audit done.

[INFO] Preparing pmd:check
[INFO] [pmd:pmd]
[INFO] [pmd:check {execution: validate}]
[INFO] 
[INFO] [remote-resources:process {execution: default}]
[INFO] [resources:resources]
[INFO] Using default encoding to copy filtered resources.
[INFO] [compiler:compile]
[INFO] Compiling 37 source files to /x1/continuum/working-directory/216/tools/wsdlto/frontend/jaxws/target/classes
[INFO] [resources:testResources]
[INFO] Using default encoding to copy filtered resources.
[INFO] [compiler:testCompile]
[INFO] Compiling 9 source files to /x1/continuum/working-directory/216/tools/wsdlto/frontend/jaxws/target/test-classes
[INFO] [surefire:test]
[INFO] Surefire report directory: /x1/continuum/working-directory/216/tools/wsdlto/frontend/jaxws/target/surefire-reports

-------------------------------------------------------
 T E S T S
-------------------------------------------------------
Running org.apache.cxf.tools.wsdlto.frontend.jaxws.processor.internal.PortTypeProcessorTest
Tests run: 1, Failures: 0, Errors: 0, Skipped: 0, Time elapsed: 0.061 sec
Running org.apache.cxf.tools.wsdlto.frontend.jaxws.processor.internal.ProcessorUtilTest
Tests run: 1, Failures: 0, Errors: 0, Skipped: 0, Time elapsed: 0.03 sec
Running org.apache.cxf.tools.wsdlto.frontend.jaxws.processor.internal.mapper.MethodMapperTest
Tests run: 3, Failures: 0, Errors: 0, Skipped: 0, Time elapsed: 0.09 sec
Running org.apache.cxf.tools.wsdlto.frontend.jaxws.processor.internal.annotator.WebParamAnnotatorTest
Tests run: 3, Failures: 0, Errors: 0, Skipped: 0, Time elapsed: 0.035 sec
Running org.apache.cxf.tools.wsdlto.frontend.jaxws.processor.internal.annotator.WebMethodAnnotatorTest
Tests run: 2, Failures: 0, Errors: 0, Skipped: 0, Time elapsed: 0.036 sec
Running org.apache.cxf.tools.wsdlto.frontend.jaxws.processor.internal.mapper.InterfaceMapperTest
Tests run: 2, Failures: 0, Errors: 0, Skipped: 0, Time elapsed: 0.108 sec
Running org.apache.cxf.tools.wsdlto.frontend.jaxws.JAXWSProfileTest
Tests run: 1, Failures: 0, Errors: 0, Skipped: 0, Time elapsed: 2.176 sec
Running org.apache.cxf.tools.wsdlto.frontend.jaxws.wsdl11.JAXWSDefinitionBuilderTest
Tests run: 3, Failures: 0, Errors: 0, Skipped: 0, Time elapsed: 1.025 sec

Results :

Tests run: 16, Failures: 0, Errors: 0, Skipped: 0

[INFO] [jar:jar]
[INFO] Building jar: /x1/continuum/working-directory/216/tools/wsdlto/frontend/jaxws/target/cxf-tools-wsdlto-frontend-jaxws-2.1-incubator-SNAPSHOT.jar
[INFO] [install:install]
[INFO] Installing /x1/continuum/working-directory/216/tools/wsdlto/frontend/jaxws/target/cxf-tools-wsdlto-frontend-jaxws-2.1-incubator-SNAPSHOT.jar to /home/continuum/.m2/repository/org/apache/cxf/cxf-tools-wsdlto-frontend-jaxws/2.1-incubator-SNAPSHOT/cxf-tools-wsdlto-frontend-jaxws-2.1-incubator-SNAPSHOT.jar
[INFO] ----------------------------------------------------------------------------
[INFO] Building Apache CXF Command Line Tools WSDLTo JAXB Databinding
[INFO]    task-segment: [clean, install]
[INFO] ----------------------------------------------------------------------------
[INFO] [clean:clean]
[INFO] Deleting directory /x1/continuum/working-directory/216/tools/wsdlto/databinding/jaxb/target
[INFO] Deleting directory /x1/continuum/working-directory/216/tools/wsdlto/databinding/jaxb/target/classes
[INFO] Deleting directory /x1/continuum/working-directory/216/tools/wsdlto/databinding/jaxb/target/test-classes
[INFO] [checkstyle:checkstyle {execution: validate}]
[INFO] Starting audit...
Audit done.

[INFO] Preparing pmd:check
[INFO] [pmd:pmd]
[INFO] [pmd:check {execution: validate}]
[INFO] 
[INFO] [remote-resources:process {execution: default}]
[INFO] [resources:resources]
[INFO] Using default encoding to copy filtered resources.
[INFO] [compiler:compile]
[INFO] Compiling 5 source files to /x1/continuum/working-directory/216/tools/wsdlto/databinding/jaxb/target/classes
[INFO] [resources:testResources]
[INFO] Using default encoding to copy filtered resources.
[INFO] [compiler:testCompile]
[INFO] Nothing to compile - all classes are up to date
[INFO] [surefire:test]
[INFO] Surefire report directory: /x1/continuum/working-directory/216/tools/wsdlto/databinding/jaxb/target/surefire-reports

-------------------------------------------------------
 T E S T S
-------------------------------------------------------
There are no tests to run.

Results :

Tests run: 0, Failures: 0, Errors: 0, Skipped: 0

[INFO] [jar:jar]
[INFO] Building jar: /x1/continuum/working-directory/216/tools/wsdlto/databinding/jaxb/target/cxf-tools-wsdlto-databinding-jaxb-2.1-incubator-SNAPSHOT.jar
[INFO] [install:install]
[INFO] Installing /x1/continuum/working-directory/216/tools/wsdlto/databinding/jaxb/target/cxf-tools-wsdlto-databinding-jaxb-2.1-incubator-SNAPSHOT.jar to /home/continuum/.m2/repository/org/apache/cxf/cxf-tools-wsdlto-databinding-jaxb/2.1-incubator-SNAPSHOT/cxf-tools-wsdlto-databinding-jaxb-2.1-incubator-SNAPSHOT.jar
[INFO] ----------------------------------------------------------------------------
[INFO] Building Apache CXF Command Line Tools JavaTo Core
[INFO]    task-segment: [clean, install]
[INFO] ----------------------------------------------------------------------------
[INFO] [clean:clean]
[INFO] Deleting directory /x1/continuum/working-directory/216/tools/javato/core/target
[INFO] Deleting directory /x1/continuum/working-directory/216/tools/javato/core/target/classes
[INFO] Deleting directory /x1/continuum/working-directory/216/tools/javato/core/target/test-classes
[INFO] [checkstyle:checkstyle {execution: validate}]
[INFO] Starting audit...
Audit done.

[INFO] Preparing pmd:check
[INFO] [pmd:pmd]
[INFO] [pmd:check {execution: validate}]
[INFO] 
[INFO] [remote-resources:process {execution: default}]
[INFO] [resources:resources]
[INFO] Using default encoding to copy filtered resources.
[INFO] [compiler:compile]
[INFO] Compiling 19 source files to /x1/continuum/working-directory/216/tools/javato/core/target/classes
[INFO] [resources:testResources]
[INFO] Using default encoding to copy filtered resources.
[INFO] [compiler:testCompile]
[INFO] No sources to compile
[INFO] [surefire:test]
[INFO] Surefire report directory: /x1/continuum/working-directory/216/tools/javato/core/target/surefire-reports

-------------------------------------------------------
 T E S T S
-------------------------------------------------------
There are no tests to run.

Results :

Tests run: 0, Failures: 0, Errors: 0, Skipped: 0

[INFO] [jar:jar]
[INFO] Building jar: /x1/continuum/working-directory/216/tools/javato/core/target/cxf-tools-java2wsdl-2.1-incubator-SNAPSHOT.jar
[INFO] [install:install]
[INFO] Installing /x1/continuum/working-directory/216/tools/javato/core/target/cxf-tools-java2wsdl-2.1-incubator-SNAPSHOT.jar to /home/continuum/.m2/repository/org/apache/cxf/cxf-tools-java2wsdl/2.1-incubator-SNAPSHOT/cxf-tools-java2wsdl-2.1-incubator-SNAPSHOT.jar
[INFO] ----------------------------------------------------------------------------
[INFO] Building Apache CXF Code Generation Maven2 Plugins
[INFO]    task-segment: [clean, install]
[INFO] ----------------------------------------------------------------------------
[INFO] [clean:clean]
[INFO] Deleting directory /x1/continuum/working-directory/216/maven-plugins/codegen-plugin/target
[INFO] Deleting directory /x1/continuum/working-directory/216/maven-plugins/codegen-plugin/target/classes
[INFO] Deleting directory /x1/continuum/working-directory/216/maven-plugins/codegen-plugin/target/test-classes
[INFO] [checkstyle:checkstyle {execution: validate}]
[INFO] Starting audit...
Audit done.

[INFO] Preparing pmd:check
[INFO] [pmd:pmd]
[INFO] [pmd:check {execution: validate}]
[INFO] 
[INFO] [plugin:descriptor]
[INFO] Using 2 extractors.
[INFO] Applying extractor for language: java
[INFO] Extractor for language: java found 2 mojo descriptors.
[INFO] Applying extractor for language: bsh
[INFO] Extractor for language: bsh found 0 mojo descriptors.
[INFO] [remote-resources:process {execution: default}]
[INFO] [resources:resources]
[INFO] Using default encoding to copy filtered resources.
[INFO] [compiler:compile]
[INFO] Compiling 4 source files to /x1/continuum/working-directory/216/maven-plugins/codegen-plugin/target/classes
[INFO] [resources:testResources]
[INFO] Using default encoding to copy filtered resources.
[INFO] [compiler:testCompile]
[INFO] Nothing to compile - all classes are up to date
[INFO] [surefire:test]
[INFO] Surefire report directory: /x1/continuum/working-directory/216/maven-plugins/codegen-plugin/target/surefire-reports

-------------------------------------------------------
 T E S T S
-------------------------------------------------------
There are no tests to run.

Results :

Tests run: 0, Failures: 0, Errors: 0, Skipped: 0

[INFO] [jar:jar]
[INFO] Building jar: /x1/continuum/working-directory/216/maven-plugins/codegen-plugin/target/cxf-codegen-plugin-2.1-incubator-SNAPSHOT.jar
[INFO] [plugin:addPluginArtifactMetadata]
[INFO] [install:install]
[INFO] Installing /x1/continuum/working-directory/216/maven-plugins/codegen-plugin/target/cxf-codegen-plugin-2.1-incubator-SNAPSHOT.jar to /home/continuum/.m2/repository/org/apache/cxf/cxf-codegen-plugin/2.1-incubator-SNAPSHOT/cxf-codegen-plugin-2.1-incubator-SNAPSHOT.jar
[INFO] [plugin:updateRegistry]
[INFO] ----------------------------------------------------------------------------
[INFO] Building Apache CXF Test Utilities
[INFO]    task-segment: [clean, install]
[INFO] ----------------------------------------------------------------------------
[INFO] [clean:clean]
[INFO] Deleting directory /x1/continuum/working-directory/216/testutils/target
[INFO] Deleting directory /x1/continuum/working-directory/216/testutils/target/classes
[INFO] Deleting directory /x1/continuum/working-directory/216/testutils/target/test-classes
[INFO] [checkstyle:checkstyle {execution: validate}]
[INFO] Starting audit...
Audit done.

[INFO] Preparing pmd:check
[INFO] [pmd:pmd]
[INFO] [pmd:check {execution: validate}]
[INFO] 
[INFO] [antrun:run {execution: validate}]
[INFO] Executing tasks
    [mkdir] Created dir: /x1/continuum/working-directory/216/testutils/target/generated/src/main/resources/wsdl/type_test
     [xslt] Processing /x1/continuum/working-directory/216/testutils/src/main/resources/wsdl/type_test/type_test.xsd to /x1/continuum/working-directory/216/testutils/target/generated/src/main/resources/wsdl/type_test/type_test_1.xsd
     [xslt] Loading stylesheet /x1/continuum/working-directory/216/testutils/src/main/resources/wsdl/type_test/type_test_ID_xsd.xsl
     [xslt] Processing /x1/continuum/working-directory/216/testutils/src/main/resources/wsdl/type_test/type_test.xsd to /x1/continuum/working-directory/216/testutils/target/generated/src/main/resources/wsdl/type_test/type_test_2.xsd
     [xslt] Loading stylesheet /x1/continuum/working-directory/216/testutils/src/main/resources/wsdl/type_test/type_test_ID_xsd.xsl
     [xslt] Processing /x1/continuum/working-directory/216/testutils/src/main/resources/wsdl/type_test/type_test.xsd to /x1/continuum/working-directory/216/testutils/target/generated/src/main/resources/wsdl/type_test/type_test_3.xsd
     [xslt] Loading stylesheet /x1/continuum/working-directory/216/testutils/src/main/resources/wsdl/type_test/type_test_ID_xsd.xsl
     [xslt] Processing /x1/continuum/working-directory/216/testutils/src/main/resources/wsdl/type_test/type_test.xsd to /x1/continuum/working-directory/216/testutils/target/generated/src/main/resources/wsdl/type_test/type_test_doclit.wsdl
     [xslt] Loading stylesheet /x1/continuum/working-directory/216/testutils/src/main/resources/wsdl/type_test/type_test_wsdl.xsl
     [xslt] Processing /x1/continuum/working-directory/216/testutils/src/main/resources/wsdl/type_test/type_test.xsd to /x1/continuum/working-directory/216/testutils/target/generated/src/main/resources/wsdl/type_test/type_test_rpclit.wsdl
     [xslt] Loading stylesheet /x1/continuum/working-directory/216/testutils/src/main/resources/wsdl/type_test/type_test_wsdl.xsl
     [xslt] Processing /x1/continuum/working-directory/216/testutils/src/main/resources/wsdl/type_test/type_test.xsd to /x1/continuum/working-directory/216/testutils/target/generated/src/main/resources/wsdl/type_test/type_test_xml_inc.wsdl
     [xslt] Loading stylesheet /x1/continuum/working-directory/216/testutils/src/main/resources/wsdl/type_test/type_test_wsdl.xsl
     [xslt] Processing /x1/continuum/working-directory/216/testutils/src/main/resources/wsdl/type_test/type_test.xsd to /x1/continuum/working-directory/216/testutils/target/generated/src/main/resources/wsdl/type_test/type_test_xml.wsdl
     [xslt] Loading stylesheet /x1/continuum/working-directory/216/testutils/src/main/resources/wsdl/type_test/type_test_xml_wsdl.xsl
     [xslt] Processing /x1/continuum/working-directory/216/testutils/src/main/resources/wsdl/type_test/type_test.xsd to /x1/continuum/working-directory/216/testutils/target/generated/src/main/resources/wsdl/type_test/type_test_doclit_soap.wsdl
     [xslt] Loading stylesheet /x1/continuum/working-directory/216/testutils/src/main/resources/wsdl/type_test/type_test_soap_wsdl.xsl
     [xslt] Processing /x1/continuum/working-directory/216/testutils/src/main/resources/wsdl/type_test/type_test.xsd to /x1/continuum/working-directory/216/testutils/target/generated/src/main/resources/wsdl/type_test/type_test_rpclit_soap.wsdl
     [xslt] Loading stylesheet /x1/continuum/working-directory/216/testutils/src/main/resources/wsdl/type_test/type_test_soap_wsdl.xsl
    [mkdir] Created dir: /x1/continuum/working-directory/216/testutils/target/generated/src/main/java/org/apache/cxf/systest/type_test
     [xslt] Processing /x1/continuum/working-directory/216/testutils/src/main/resources/wsdl/type_test/type_test.xsd to /x1/continuum/working-directory/216/testutils/target/generated/src/main/java/org/apache/cxf/systest/type_test/TypeTestImpl.java
     [xslt] Loading stylesheet /x1/continuum/working-directory/216/testutils/src/main/resources/wsdl/type_test/type_test_impl_java.xsl
     [xslt] Processing /x1/continuum/working-directory/216/testutils/src/main/resources/wsdl/type_test/type_test.xsd to /x1/continuum/working-directory/216/testutils/target/generated/src/main/java/org/apache/cxf/systest/type_test/TypeTestTester.java
     [xslt] Loading stylesheet /x1/continuum/working-directory/216/testutils/src/main/resources/wsdl/type_test/type_test_tester_java.xsl
[INFO] Executed tasks
[INFO] Registering compile source root /x1/continuum/working-directory/216/testutils/target/generated/src/main/java
[INFO] [cxf-codegen:wsdl2java {execution: generate-sources}]
Jul 3, 2007 7:06:43 AM org.apache.cxf.tools.wsdlto.core.PluginLoader loadPlugin
INFO: Loading plugin jar:file:/x1/continuum/working-directory/216/tools/wsdlto/frontend/jaxws/target/cxf-tools-wsdlto-frontend-jaxws-2.1-incubator-SNAPSHOT.jar!/META-INF/tools-plugin.xml
Jul 3, 2007 7:06:43 AM org.apache.cxf.tools.wsdlto.core.PluginLoader loadPlugin
INFO: Found 1 frontends in <jaxws> plugin.
Jul 3, 2007 7:06:43 AM org.apache.cxf.tools.wsdlto.core.PluginLoader loadPlugin
INFO: Loading <jaxws> frontend from <jaxws> plugin.
Jul 3, 2007 7:06:43 AM org.apache.cxf.tools.wsdlto.core.PluginLoader loadPlugin
INFO: Loading plugin jar:file:/x1/continuum/working-directory/216/tools/wsdlto/databinding/jaxb/target/cxf-tools-wsdlto-databinding-jaxb-2.1-incubator-SNAPSHOT.jar!/META-INF/tools-plugin.xml
Jul 3, 2007 7:06:43 AM org.apache.cxf.tools.wsdlto.core.PluginLoader loadPlugin
INFO: Found 1 databindings in <jaxb> plugin.
Jul 3, 2007 7:06:43 AM org.apache.cxf.tools.wsdlto.core.PluginLoader loadPlugin
INFO: Loading <jaxb> databinding from <jaxb> plugin.
Jul 3, 2007 7:06:44 AM org.springframework.context.support.AbstractApplicationContext refresh
INFO: Refreshing org.apache.cxf.bus.spring.BusApplicationContext@338ec7: display name [org.apache.cxf.bus.spring.BusApplicationContext@338ec7]; startup date [Tue Jul 03 07:06:44 PDT 2007]; root of context hierarchy
Jul 3, 2007 7:06:44 AM org.apache.cxf.bus.spring.BusApplicationContext getConfigResources
INFO: Could not find the configuration file cxf.xml on the classpath.
Jul 3, 2007 7:06:44 AM org.springframework.beans.factory.xml.XmlBeanDefinitionReader loadBeanDefinitions
INFO: Loading XML bean definitions from class path resource [META-INF/cxf/cxf.xml]
Jul 3, 2007 7:06:44 AM org.springframework.context.support.AbstractApplicationContext refresh
INFO: Bean factory for application context [org.apache.cxf.bus.spring.BusApplicationContext@338ec7]: org.springframework.beans.factory.support.DefaultListableBeanFactory@a9ce90
Jul 3, 2007 7:06:45 AM org.springframework.context.support.AbstractApplicationContext$BeanPostProcessorChecker postProcessAfterInitialization
INFO: Bean 'org.apache.cxf.bus.spring.Jsr250BeanPostProcessor' is not eligible for getting processed by all BeanPostProcessors (for example: not eligible for auto-proxying)
Jul 3, 2007 7:06:45 AM org.springframework.context.support.AbstractApplicationContext$BeanPostProcessorChecker postProcessAfterInitialization
INFO: Bean 'cxf' is not eligible for getting processed by all BeanPostProcessors (for example: not eligible for auto-proxying)
Jul 3, 2007 7:06:45 AM org.springframework.context.support.AbstractApplicationContext$BeanPostProcessorChecker postProcessAfterInitialization
INFO: Bean 'org.apache.cxf.bus.spring.BusExtensionPostProcessor' is not eligible for getting processed by all BeanPostProcessors (for example: not eligible for auto-proxying)
Jul 3, 2007 7:06:45 AM org.springframework.beans.factory.support.DefaultListableBeanFactory preInstantiateSingletons
INFO: Pre-instantiating singletons in org.springframework.beans.factory.support.DefaultListableBeanFactory@a9ce90: defining beans [cxf,org.apache.cxf.bus.spring.Jsr250BeanPostProcessor,org.apache.cxf.bus.spring.BusExtensionPostProcessor,org.apache.cxf.resource.ResourceManager,org.apache.cxf.binding.BindingFactoryManager,org.apache.cxf.transport.DestinationFactoryManager,org.apache.cxf.transport.ConduitInitiatorManager,org.apache.cxf.wsdl.WSDLManager,org.apache.cxf.phase.PhaseManager,org.apache.cxf.workqueue.WorkQueueManager,org.apache.cxf.buslifecycle.BusLifeCycleManager,org.apache.cxf.endpoint.ServerRegistry,org.apache.cxf.endpoint.ServerLifeCycleManager,org.apache.cxf.endpoint.ClientLifeCycleManager,org.apache.cxf.transports.http.QueryHandlerRegistry,org.apache.cxf.endpoint.EndpointResolverRegistry,org.apache.cxf.headers.HeaderManager,org.apache.cxf.catalog.OASISCatalogManager]; root of factory hierarchy
[INFO] [cxf-common-xsd:xsdtojava {execution: generate-sources}]
[INFO] [remote-resources:process {execution: default}]
[INFO] [resources:resources]
[INFO] Using default encoding to copy filtered resources.
[INFO] [compiler:compile]
[INFO] Compiling 1313 source files to /x1/continuum/working-directory/216/testutils/target/classes
[INFO] [resources:testResources]
[INFO] Using default encoding to copy filtered resources.
[INFO] [compiler:testCompile]
[INFO] Compiling 1 source file to /x1/continuum/working-directory/216/testutils/target/test-classes
[INFO] [surefire:test]
[INFO] Surefire report directory: /x1/continuum/working-directory/216/testutils/target/surefire-reports

-------------------------------------------------------
 T E S T S
-------------------------------------------------------
Running org.apache.header_test.rpc.TestRPCHeaderTest
Tests run: 2, Failures: 0, Errors: 0, Skipped: 0, Time elapsed: 0.144 sec

Results :

Tests run: 2, Failures: 0, Errors: 0, Skipped: 0

[INFO] [jar:jar]
[INFO] Building jar: /x1/continuum/working-directory/216/testutils/target/cxf-testutils-2.1-incubator-SNAPSHOT.jar
[INFO] [install:install]
[INFO] Installing /x1/continuum/working-directory/216/testutils/target/cxf-testutils-2.1-incubator-SNAPSHOT.jar to /home/continuum/.m2/repository/org/apache/cxf/cxf-testutils/2.1-incubator-SNAPSHOT/cxf-testutils-2.1-incubator-SNAPSHOT.jar
[INFO] ----------------------------------------------------------------------------
[INFO] Building Apache CXF Runtime JAXB DataBinding
[INFO]    task-segment: [clean, install]
[INFO] ----------------------------------------------------------------------------
[INFO] [clean:clean]
[INFO] Deleting directory /x1/continuum/working-directory/216/rt/databinding/jaxb/target
[INFO] Deleting directory /x1/continuum/working-directory/216/rt/databinding/jaxb/target/classes
[INFO] Deleting directory /x1/continuum/working-directory/216/rt/databinding/jaxb/target/test-classes
[INFO] [checkstyle:checkstyle {execution: validate}]
[INFO] Starting audit...
Audit done.

[INFO] Preparing pmd:check
[INFO] [pmd:pmd]
[INFO] [pmd:check {execution: validate}]
[INFO] 
[INFO] [remote-resources:process {execution: default}]
[INFO] [resources:resources]
[INFO] Using default encoding to copy filtered resources.
[INFO] [compiler:compile]
[INFO] Compiling 11 source files to /x1/continuum/working-directory/216/rt/databinding/jaxb/target/classes
[INFO] [cxf-common-xsd:xsdtojava {execution: generate-sources}]
[INFO] [dependency:unpack {execution: unpack-schemas}]
[INFO] Configured Artifact: org.apache.cxf:cxf-common-schemas:2.1-incubator-SNAPSHOT:jar
[INFO] Expanding: /home/continuum/.m2/repository/org/apache/cxf/cxf-common-schemas/2.1-incubator-SNAPSHOT/cxf-common-schemas-2.1-incubator-SNAPSHOT.jar into /x1/continuum/working-directory/216/rt/databinding/jaxb/target/generated/src/test/resources
[INFO] [resources:testResources]
[INFO] Using default encoding to copy filtered resources.
[INFO] [compiler:testCompile]
[INFO] Compiling 13 source files to /x1/continuum/working-directory/216/rt/databinding/jaxb/target/test-classes
[INFO] [surefire:test]
[INFO] Surefire report directory: /x1/continuum/working-directory/216/rt/databinding/jaxb/target/surefire-reports

-------------------------------------------------------
 T E S T S
-------------------------------------------------------
Running org.apache.cxf.jaxb.BareInInterceptorTest
Tests run: 4, Failures: 0, Errors: 0, Skipped: 0, Time elapsed: 7.692 sec
Running org.apache.cxf.jaxb.DocLiteralInInterceptorTest
Tests run: 3, Failures: 0, Errors: 0, Skipped: 0, Time elapsed: 0.885 sec
Running org.apache.cxf.jaxb.WrappedInInterceptorTest
Tests run: 2, Failures: 0, Errors: 0, Skipped: 0, Time elapsed: 0.71 sec
Running org.apache.cxf.jaxb.io.XMLStreamDataReaderTest
Tests run: 4, Failures: 0, Errors: 0, Skipped: 0, Time elapsed: 0.202 sec
Running org.apache.cxf.jaxb.io.XMLStreamDataWriterTest
Tests run: 5, Failures: 0, Errors: 0, Skipped: 0, Time elapsed: 0.25 sec
Running org.apache.cxf.jaxb.JAXBEncoderDecoderTest
Tests run: 9, Failures: 0, Errors: 0, Skipped: 0, Time elapsed: 1.898 sec
Running org.apache.cxf.jaxb.BareOutInterceptorTest
Tests run: 2, Failures: 0, Errors: 0, Skipped: 0, Time elapsed: 0.531 sec
Running org.apache.cxf.jaxb.JAXBDataBindingTest
Tests run: 6, Failures: 0, Errors: 0, Skipped: 0, Time elapsed: 1.036 sec

Results :

Tests run: 35, Failures: 0, Errors: 0, Skipped: 0

[INFO] [jar:jar]
[INFO] Building jar: /x1/continuum/working-directory/216/rt/databinding/jaxb/target/cxf-rt-databinding-jaxb-2.1-incubator-SNAPSHOT.jar
[INFO] [install:install]
[INFO] Installing /x1/continuum/working-directory/216/rt/databinding/jaxb/target/cxf-rt-databinding-jaxb-2.1-incubator-SNAPSHOT.jar to /home/continuum/.m2/repository/org/apache/cxf/cxf-rt-databinding-jaxb/2.1-incubator-SNAPSHOT/cxf-rt-databinding-jaxb-2.1-incubator-SNAPSHOT.jar
[INFO] ----------------------------------------------------------------------------
[INFO] Building Apache CXF Runtime SOAP Binding
[INFO]    task-segment: [clean, install]
[INFO] ----------------------------------------------------------------------------
[INFO] [clean:clean]
[INFO] Deleting directory /x1/continuum/working-directory/216/rt/bindings/soap/target
[INFO] Deleting directory /x1/continuum/working-directory/216/rt/bindings/soap/target/classes
[INFO] Deleting directory /x1/continuum/working-directory/216/rt/bindings/soap/target/test-classes
[INFO] [checkstyle:checkstyle {execution: validate}]
[INFO] Starting audit...
Audit done.

[INFO] Preparing pmd:check
[INFO] [pmd:pmd]
[INFO] [pmd:check {execution: validate}]
[INFO] 
[INFO] [remote-resources:process {execution: default}]
[INFO] [resources:resources]
[INFO] Using default encoding to copy filtered resources.
[INFO] [compiler:compile]
[INFO] Compiling 38 source files to /x1/continuum/working-directory/216/rt/bindings/soap/target/classes
[INFO] [resources:testResources]
[INFO] Using default encoding to copy filtered resources.
[INFO] [compiler:testCompile]
[INFO] Compiling 14 source files to /x1/continuum/working-directory/216/rt/bindings/soap/target/test-classes
[INFO] [surefire:test]
[INFO] Surefire report directory: /x1/continuum/working-directory/216/rt/bindings/soap/target/surefire-reports

-------------------------------------------------------
 T E S T S
-------------------------------------------------------
Running org.apache.cxf.binding.soap.SoapDestinationFactoryTest
Tests run: 1, Failures: 0, Errors: 0, Skipped: 0, Time elapsed: 0.197 sec
Running org.apache.cxf.binding.soap.RPCOutInterceptorTest
Tests run: 2, Failures: 0, Errors: 0, Skipped: 0, Time elapsed: 2.363 sec
Running org.apache.cxf.binding.soap.saaj.SAAJInInterceptorTest
Tests run: 1, Failures: 0, Errors: 0, Skipped: 0, Time elapsed: 2.357 sec
Running org.apache.cxf.binding.soap.SoapBindingTest
Tests run: 1, Failures: 0, Errors: 0, Skipped: 0, Time elapsed: 0.011 sec
Running org.apache.cxf.binding.soap.MustUnderstandInterceptorTest
Tests run: 3, Failures: 0, Errors: 0, Skipped: 0, Time elapsed: 0.212 sec
Running org.apache.cxf.binding.soap.interceptor.SoapFaultSerializerTest
Tests run: 3, Failures: 0, Errors: 0, Skipped: 0, Time elapsed: 1.647 sec
Running org.apache.cxf.binding.soap.SoapActionInterceptorTest
Tests run: 1, Failures: 0, Errors: 0, Skipped: 0, Time elapsed: 0.014 sec
Running org.apache.cxf.binding.soap.ServiceModelUtilTest
Tests run: 1, Failures: 0, Errors: 0, Skipped: 0, Time elapsed: 0.082 sec
Running org.apache.cxf.binding.soap.SoapBindingFactoryTest
Tests run: 2, Failures: 0, Errors: 0, Skipped: 0, Time elapsed: 0.294 sec
Running org.apache.cxf.binding.soap.RPCInInterceptorTest
Tests run: 2, Failures: 0, Errors: 0, Skipped: 0, Time elapsed: 0.231 sec
Running org.apache.cxf.binding.soap.ReadHeaderInterceptorTest
Tests run: 2, Failures: 0, Errors: 0, Skipped: 0, Time elapsed: 0.34 sec
Running org.apache.cxf.binding.soap.SoapOutInterceptorTest
Tests run: 1, Failures: 0, Errors: 0, Skipped: 0, Time elapsed: 0.036 sec

Results :

Tests run: 20, Failures: 0, Errors: 0, Skipped: 0

[INFO] [jar:jar]
[INFO] Building jar: /x1/continuum/working-directory/216/rt/bindings/soap/target/cxf-rt-bindings-soap-2.1-incubator-SNAPSHOT.jar
[INFO] [install:install]
[INFO] Installing /x1/continuum/working-directory/216/rt/bindings/soap/target/cxf-rt-bindings-soap-2.1-incubator-SNAPSHOT.jar to /home/continuum/.m2/repository/org/apache/cxf/cxf-rt-bindings-soap/2.1-incubator-SNAPSHOT/cxf-rt-bindings-soap-2.1-incubator-SNAPSHOT.jar
[INFO] ----------------------------------------------------------------------------
[INFO] Building Apache CXF Runtime Management
[INFO]    task-segment: [clean, install]
[INFO] ----------------------------------------------------------------------------
[INFO] [clean:clean]
[INFO] Deleting directory /x1/continuum/working-directory/216/rt/management/target
[INFO] Deleting directory /x1/continuum/working-directory/216/rt/management/target/classes
[INFO] Deleting directory /x1/continuum/working-directory/216/rt/management/target/test-classes
[INFO] [checkstyle:checkstyle {execution: validate}]
[INFO] Starting audit...
Audit done.

[INFO] Preparing pmd:check
[INFO] [pmd:pmd]
[INFO] [pmd:check {execution: validate}]
[INFO] 
[INFO] [cxf-common-xsd:xsdtojava {execution: generate-sources}]
[INFO] [remote-resources:process {execution: default}]
[INFO] [resources:resources]
[INFO] Using default encoding to copy filtered resources.
[INFO] [compiler:compile]
[INFO] Compiling 20 source files to /x1/continuum/working-directory/216/rt/management/target/classes
[INFO] [resources:testResources]
[INFO] Using default encoding to copy filtered resources.
[INFO] [compiler:testCompile]
[INFO] Compiling 13 source files to /x1/continuum/working-directory/216/rt/management/target/test-classes
[INFO] [surefire:test]
[INFO] Surefire report directory: /x1/continuum/working-directory/216/rt/management/target/surefire-reports

-------------------------------------------------------
 T E S T S
-------------------------------------------------------
Running org.apache.cxf.management.jmx.MBServerConnectorTest
Tests run: 1, Failures: 0, Errors: 0, Skipped: 0, Time elapsed: 1.699 sec
Running org.apache.cxf.management.interceptor.ResponseTimeMessageOutInterceptorTest
Tests run: 3, Failures: 0, Errors: 0, Skipped: 0, Time elapsed: 1.583 sec
Running org.apache.cxf.management.utils.ManagementConsoleTest
Tests run: 1, Failures: 0, Errors: 0, Skipped: 0, Time elapsed: 0.039 sec
Running org.apache.cxf.management.interceptor.ResponseTimeMessageInInterceptorTest
Tests run: 3, Failures: 0, Errors: 0, Skipped: 0, Time elapsed: 0.058 sec
Running org.apache.cxf.management.interceptor.ResponseTimeMessageInvokerInterceptorTest
Tests run: 1, Failures: 0, Errors: 0, Skipped: 0, Time elapsed: 0.053 sec
Running org.apache.cxf.management.counters.CounterRepositoryTest
Tests run: 3, Failures: 0, Errors: 0, Skipped: 0, Time elapsed: 0.07 sec
Running org.apache.cxf.management.InstrumentationManagerTest
Tests run: 2, Failures: 0, Errors: 0, Skipped: 0, Time elapsed: 4.494 sec
Running org.apache.cxf.management.jmx.export.ModelMBeanAssemblerTest
Tests run: 10, Failures: 0, Errors: 0, Skipped: 0, Time elapsed: 0.507 sec
Running org.apache.cxf.management.jmx.JMXManagedComponentManagerTest
Tests run: 2, Failures: 0, Errors: 0, Skipped: 0, Time elapsed: 4.175 sec

Results :

Tests run: 26, Failures: 0, Errors: 0, Skipped: 0

[INFO] [jar:jar]
[INFO] Building jar: /x1/continuum/working-directory/216/rt/management/target/cxf-rt-management-2.1-incubator-SNAPSHOT.jar
[INFO] [install:install]
[INFO] Installing /x1/continuum/working-directory/216/rt/management/target/cxf-rt-management-2.1-incubator-SNAPSHOT.jar to /home/continuum/.m2/repository/org/apache/cxf/cxf-rt-management/2.1-incubator-SNAPSHOT/cxf-rt-management-2.1-incubator-SNAPSHOT.jar
[INFO] ----------------------------------------------------------------------------
[INFO] Building Apache CXF Runtime JMS Transport
[INFO]    task-segment: [clean, install]
[INFO] ----------------------------------------------------------------------------
[INFO] [clean:clean]
[INFO] Deleting directory /x1/continuum/working-directory/216/rt/transports/jms/target
[INFO] Deleting directory /x1/continuum/working-directory/216/rt/transports/jms/target/classes
[INFO] Deleting directory /x1/continuum/working-directory/216/rt/transports/jms/target/test-classes
[INFO] [checkstyle:checkstyle {execution: validate}]
[INFO] Starting audit...
Audit done.

[INFO] Preparing pmd:check
[INFO] [pmd:pmd]
[INFO] [pmd:check {execution: validate}]
[INFO] 
[INFO] [cxf-common-xsd:xsdtojava {execution: generate-sources}]
[INFO] [remote-resources:process {execution: default}]
[INFO] [resources:resources]
[INFO] Using default encoding to copy filtered resources.
[INFO] [compiler:compile]
[INFO] Compiling 27 source files to /x1/continuum/working-directory/216/rt/transports/jms/target/classes
[INFO] [resources:testResources]
[INFO] Using default encoding to copy filtered resources.
[INFO] [compiler:testCompile]
[INFO] Compiling 6 source files to /x1/continuum/working-directory/216/rt/transports/jms/target/test-classes
[INFO] [surefire:test]
[INFO] Surefire report directory: /x1/continuum/working-directory/216/rt/transports/jms/target/surefire-reports

-------------------------------------------------------
 T E S T S
-------------------------------------------------------
Running org.apache.cxf.transport.jms.JMSConduitTest
Tests run: 3, Failures: 0, Errors: 0, Skipped: 0, Time elapsed: 20.977 sec
Running org.apache.cxf.transport.jms.PooledSessionTest
Tests run: 1, Failures: 0, Errors: 0, Skipped: 0, Time elapsed: 0.052 sec
Running org.apache.cxf.transport.jms.JMSDestinationTest
Tests run: 7, Failures: 0, Errors: 0, Skipped: 0, Time elapsed: 20.298 sec
Running org.apache.cxf.transport.jms.JMSUtilsTest
Tests run: 1, Failures: 0, Errors: 0, Skipped: 0, Time elapsed: 0.014 sec

Results :

Tests run: 12, Failures: 0, Errors: 0, Skipped: 0

[INFO] [jar:jar]
[INFO] Building jar: /x1/continuum/working-directory/216/rt/transports/jms/target/cxf-rt-transports-jms-2.1-incubator-SNAPSHOT.jar
[INFO] [install:install]
[INFO] Installing /x1/continuum/working-directory/216/rt/transports/jms/target/cxf-rt-transports-jms-2.1-incubator-SNAPSHOT.jar to /home/continuum/.m2/repository/org/apache/cxf/cxf-rt-transports-jms/2.1-incubator-SNAPSHOT/cxf-rt-transports-jms-2.1-incubator-SNAPSHOT.jar
[INFO] ----------------------------------------------------------------------------
[INFO] Building Apache CXF Runtime XML Binding
[INFO]    task-segment: [clean, install]
[INFO] ----------------------------------------------------------------------------
[INFO] [clean:clean]
[INFO] Deleting directory /x1/continuum/working-directory/216/rt/bindings/xml/target
[INFO] Deleting directory /x1/continuum/working-directory/216/rt/bindings/xml/target/classes
[INFO] Deleting directory /x1/continuum/working-directory/216/rt/bindings/xml/target/test-classes
[INFO] [checkstyle:checkstyle {execution: validate}]
[INFO] Starting audit...
Audit done.

[INFO] Preparing pmd:check
[INFO] [pmd:pmd]
[INFO] [pmd:check {execution: validate}]
[INFO] 
[INFO] [cxf-common-xsd:xsdtojava {execution: generate-sources}]
[INFO] [remote-resources:process {execution: default}]
[INFO] [resources:resources]
[INFO] Using default encoding to copy filtered resources.
[INFO] [compiler:compile]
[INFO] Compiling 17 source files to /x1/continuum/working-directory/216/rt/bindings/xml/target/classes
[INFO] [resources:testResources]
[INFO] Using default encoding to copy filtered resources.
[INFO] [compiler:testCompile]
[INFO] Compiling 6 source files to /x1/continuum/working-directory/216/rt/bindings/xml/target/test-classes
[INFO] [surefire:test]
[INFO] Surefire report directory: /x1/continuum/working-directory/216/rt/bindings/xml/target/surefire-reports

-------------------------------------------------------
 T E S T S
-------------------------------------------------------
Running org.apache.cxf.binding.xml.interceptor.XMLMessageOutInterceptorTest
Tests run: 3, Failures: 0, Errors: 0, Skipped: 0, Time elapsed: 4.536 sec
Running org.apache.cxf.binding.xml.interceptor.XMLMessageInInterceptorTest
Tests run: 3, Failures: 0, Errors: 0, Skipped: 0, Time elapsed: 0.627 sec
Running org.apache.cxf.binding.xml.interceptor.XMLFaultInterceptorsTest
Tests run: 1, Failures: 0, Errors: 0, Skipped: 0, Time elapsed: 0.263 sec
Running org.apache.cxf.binding.xml.interceptor.XMLFaultOutInterceptorTest
Tests run: 1, Failures: 0, Errors: 0, Skipped: 0, Time elapsed: 0.101 sec
Running org.apache.cxf.binding.xml.XMLBindingFactoryTest
Tests run: 1, Failures: 0, Errors: 0, Skipped: 0, Time elapsed: 0.022 sec

Results :

Tests run: 9, Failures: 0, Errors: 0, Skipped: 0

[INFO] [jar:jar]
[INFO] Building jar: /x1/continuum/working-directory/216/rt/bindings/xml/target/cxf-rt-bindings-xml-2.1-incubator-SNAPSHOT.jar
[INFO] [install:install]
[INFO] Installing /x1/continuum/working-directory/216/rt/bindings/xml/target/cxf-rt-bindings-xml-2.1-incubator-SNAPSHOT.jar to /home/continuum/.m2/repository/org/apache/cxf/cxf-rt-bindings-xml/2.1-incubator-SNAPSHOT/cxf-rt-bindings-xml-2.1-incubator-SNAPSHOT.jar
[INFO] ----------------------------------------------------------------------------
[INFO] Building Apache CXF Command Line Tools WSDLTo Test
[INFO]    task-segment: [clean, install]
[INFO] ----------------------------------------------------------------------------
[INFO] [clean:clean]
[INFO] Deleting directory /x1/continuum/working-directory/216/tools/wsdlto/test/target
[INFO] Deleting directory /x1/continuum/working-directory/216/tools/wsdlto/test/target/classes
[INFO] Deleting directory /x1/continuum/working-directory/216/tools/wsdlto/test/target/test-classes
[INFO] [checkstyle:checkstyle {execution: validate}]
[INFO] Starting audit...
Audit done.

[INFO] Preparing pmd:check
[INFO] [pmd:pmd]
[INFO] [pmd:check {execution: validate}]
[INFO] 
[INFO] [remote-resources:process {execution: default}]
[INFO] [resources:resources]
[INFO] Using default encoding to copy filtered resources.
[INFO] [compiler:compile]
[INFO] No sources to compile
[INFO] [resources:testResources]
[INFO] Using default encoding to copy filtered resources.
[INFO] [compiler:testCompile]
[INFO] Compiling 8 source files to /x1/continuum/working-directory/216/tools/wsdlto/test/target/test-classes
[INFO] [surefire:test]
[INFO] Surefire report directory: /x1/continuum/working-directory/216/tools/wsdlto/test/target/surefire-reports

-------------------------------------------------------
 T E S T S
-------------------------------------------------------
Running org.apache.cxf.tools.wsdlto.WSDLToJavaTest
Tests run: 3, Failures: 0, Errors: 0, Skipped: 0, Time elapsed: 1.593 sec
Running org.apache.cxf.tools.wsdlto.jaxws.wsdl11.JAXWSDefinitionBuilderTest
Tests run: 2, Failures: 0, Errors: 0, Skipped: 0, Time elapsed: 1.53 sec
Running org.apache.cxf.tools.wsdlto.jaxws.CodeGenOptionTest
Tests run: 3, Failures: 0, Errors: 0, Skipped: 0, Time elapsed: 20.414 sec
Running org.apache.cxf.tools.wsdlto.validator.ValidatorTest
Tests run: 1, Failures: 0, Errors: 0, Skipped: 0, Time elapsed: 0.254 sec
Running org.apache.cxf.tools.wsdlto.jaxws.JAXWSContainerTest
Tests run: 2, Failures: 0, Errors: 0, Skipped: 0, Time elapsed: 0.729 sec
Running org.apache.cxf.tools.wsdlto.core.PluginLoaderTest
Tests run: 1, Failures: 0, Errors: 0, Skipped: 0, Time elapsed: 0.013 sec
Running org.apache.cxf.tools.wsdlto.jaxws.CodeGenBugTest
2007-07-03 07:11:55.085::INFO:  Logging to STDERR via org.mortbay.log.StdErrLog
2007-07-03 07:11:55.172::INFO:  jetty-6.1.3
2007-07-03 07:11:55.222::INFO:  Started SocketConnector @ 0.0.0.0:8585
Tests run: 26, Failures: 0, Errors: 0, Skipped: 0, Time elapsed: 74.482 sec
Running org.apache.cxf.tools.wsdlto.jaxws.CodeGenTest
Tests run: 29, Failures: 0, Errors: 0, Skipped: 0, Time elapsed: 85.496 sec

Results :

Tests run: 67, Failures: 0, Errors: 0, Skipped: 0

[INFO] [jar:jar]
[INFO] Building jar: /x1/continuum/working-directory/216/tools/wsdlto/test/target/cxf-tools-wsdlto-test-2.1-incubator-SNAPSHOT.jar
[INFO] [install:install]
[INFO] Installing /x1/continuum/working-directory/216/tools/wsdlto/test/target/cxf-tools-wsdlto-test-2.1-incubator-SNAPSHOT.jar to /home/continuum/.m2/repository/org/apache/cxf/cxf-tools-wsdlto-test/2.1-incubator-SNAPSHOT/cxf-tools-wsdlto-test-2.1-incubator-SNAPSHOT.jar
[INFO] ----------------------------------------------------------------------------
[INFO] Building Apache CXF Command Line Tools WSDLTo Misctools
[INFO]    task-segment: [clean, install]
[INFO] ----------------------------------------------------------------------------
[INFO] [clean:clean]
[INFO] Deleting directory /x1/continuum/working-directory/216/tools/wsdlto/misc/target
[INFO] Deleting directory /x1/continuum/working-directory/216/tools/wsdlto/misc/target/classes
[INFO] Deleting directory /x1/continuum/working-directory/216/tools/wsdlto/misc/target/test-classes
[INFO] [checkstyle:checkstyle {execution: validate}]
[INFO] Starting audit...
Audit done.

[INFO] Preparing pmd:check
[INFO] [pmd:pmd]
[INFO] [pmd:check {execution: validate}]
[INFO] 
[INFO] [remote-resources:process {execution: default}]
[INFO] [resources:resources]
[INFO] Using default encoding to copy filtered resources.
[INFO] [compiler:compile]
[INFO] Compiling 14 source files to /x1/continuum/working-directory/216/tools/wsdlto/misc/target/classes
[INFO] [resources:testResources]
[INFO] Using default encoding to copy filtered resources.
[INFO] [compiler:testCompile]
[INFO] Compiling 4 source files to /x1/continuum/working-directory/216/tools/wsdlto/misc/target/test-classes
[INFO] [surefire:test]
[INFO] Surefire report directory: /x1/continuum/working-directory/216/tools/wsdlto/misc/target/surefire-reports

-------------------------------------------------------
 T E S T S
-------------------------------------------------------
Running org.apache.cxf.tools.misc.processor.WSDLToServiceProcessorTest
Tests run: 6, Failures: 0, Errors: 0, Skipped: 0, Time elapsed: 4.742 sec
Running org.apache.cxf.tools.misc.processor.WSDLToXMLProcessorTest
Tests run: 1, Failures: 0, Errors: 0, Skipped: 0, Time elapsed: 0.547 sec
Running org.apache.cxf.tools.misc.processor.XSDToWSDLProcessorTest
Tests run: 2, Failures: 0, Errors: 0, Skipped: 0, Time elapsed: 0.225 sec
Running org.apache.cxf.tools.misc.processor.WSDLToSoapProcessorTest
Tests run: 9, Failures: 0, Errors: 0, Skipped: 0, Time elapsed: 1.633 sec

Results :

Tests run: 18, Failures: 0, Errors: 0, Skipped: 0

[INFO] [jar:jar]
[INFO] Building jar: /x1/continuum/working-directory/216/tools/wsdlto/misc/target/cxf-tools-misctools-2.1-incubator-SNAPSHOT.jar
[INFO] [install:install]
[INFO] Installing /x1/continuum/working-directory/216/tools/wsdlto/misc/target/cxf-tools-misctools-2.1-incubator-SNAPSHOT.jar to /home/continuum/.m2/repository/org/apache/cxf/cxf-tools-misctools/2.1-incubator-SNAPSHOT/cxf-tools-misctools-2.1-incubator-SNAPSHOT.jar
[INFO] ----------------------------------------------------------------------------
[INFO] Building Apache CXF Command Line Tools
[INFO]    task-segment: [clean, install]
[INFO] ----------------------------------------------------------------------------
[INFO] [clean:clean]
[INFO] Deleting directory /x1/continuum/working-directory/216/tools/target
[INFO] Deleting directory /x1/continuum/working-directory/216/tools/target/classes
[INFO] Deleting directory /x1/continuum/working-directory/216/tools/target/test-classes
[INFO] [site:attach-descriptor]
[INFO] [install:install]
[INFO] Installing /x1/continuum/working-directory/216/tools/pom.xml to /home/continuum/.m2/repository/org/apache/cxf/cxf-tools/2.1-incubator-SNAPSHOT/cxf-tools-2.1-incubator-SNAPSHOT.pom
[INFO] ----------------------------------------------------------------------------
[INFO] Building Apache CXF Command Line Tools WSDLTo
[INFO]    task-segment: [clean, install]
[INFO] ----------------------------------------------------------------------------
[INFO] [clean:clean]
[INFO] Deleting directory /x1/continuum/working-directory/216/tools/wsdlto/target
[INFO] Deleting directory /x1/continuum/working-directory/216/tools/wsdlto/target/classes
[INFO] Deleting directory /x1/continuum/working-directory/216/tools/wsdlto/target/test-classes
[INFO] [site:attach-descriptor]
[INFO] [install:install]
[INFO] Installing /x1/continuum/working-directory/216/tools/wsdlto/pom.xml to /home/continuum/.m2/repository/org/apache/cxf/cxf-tools-wsdlto/2.1-incubator-SNAPSHOT/cxf-tools-wsdlto-2.1-incubator-SNAPSHOT.pom
[INFO] ----------------------------------------------------------------------------
[INFO] Building Apache CXF Runtime Local transport
[INFO]    task-segment: [clean, install]
[INFO] ----------------------------------------------------------------------------
[INFO] [clean:clean]
[INFO] Deleting directory /x1/continuum/working-directory/216/rt/transports/local/target
[INFO] Deleting directory /x1/continuum/working-directory/216/rt/transports/local/target/classes
[INFO] Deleting directory /x1/continuum/working-directory/216/rt/transports/local/target/test-classes
[INFO] [checkstyle:checkstyle {execution: validate}]
[INFO] Starting audit...
Audit done.

[INFO] Preparing pmd:check
[INFO] [pmd:pmd]
[INFO] [pmd:check {execution: validate}]
[INFO] 
[INFO] [remote-resources:process {execution: default}]
[INFO] [resources:resources]
[INFO] Using default encoding to copy filtered resources.
[INFO] [compiler:compile]
[INFO] Compiling 3 source files to /x1/continuum/working-directory/216/rt/transports/local/target/classes
[INFO] [resources:testResources]
[INFO] Using default encoding to copy filtered resources.
[INFO] [compiler:testCompile]
[INFO] Compiling 1 source file to /x1/continuum/working-directory/216/rt/transports/local/target/test-classes
[INFO] [surefire:test]
[INFO] Surefire report directory: /x1/continuum/working-directory/216/rt/transports/local/target/surefire-reports

-------------------------------------------------------
 T E S T S
-------------------------------------------------------
Running org.apache.cxf.transport.local.LocalTransportFactoryTest
Tests run: 2, Failures: 0, Errors: 0, Skipped: 0, Time elapsed: 0.217 sec

Results :

Tests run: 2, Failures: 0, Errors: 0, Skipped: 0

[INFO] [jar:jar]
[INFO] Building jar: /x1/continuum/working-directory/216/rt/transports/local/target/cxf-rt-transports-local-2.1-incubator-SNAPSHOT.jar
[INFO] [install:install]
[INFO] Installing /x1/continuum/working-directory/216/rt/transports/local/target/cxf-rt-transports-local-2.1-incubator-SNAPSHOT.jar to /home/continuum/.m2/repository/org/apache/cxf/cxf-rt-transports-local/2.1-incubator-SNAPSHOT/cxf-rt-transports-local-2.1-incubator-SNAPSHOT.jar
[INFO] ----------------------------------------------------------------------------
[INFO] Building Apache CXF Runtime Simple Frontend
[INFO]    task-segment: [clean, install]
[INFO] ----------------------------------------------------------------------------
[INFO] [clean:clean]
[INFO] Deleting directory /x1/continuum/working-directory/216/rt/frontend/simple/target
[INFO] Deleting directory /x1/continuum/working-directory/216/rt/frontend/simple/target/classes
[INFO] Deleting directory /x1/continuum/working-directory/216/rt/frontend/simple/target/test-classes
[INFO] [checkstyle:checkstyle {execution: validate}]
[INFO] Starting audit...
Audit done.

[INFO] Preparing pmd:check
[INFO] [pmd:pmd]
[INFO] [pmd:check {execution: validate}]
[INFO] 
[INFO] [remote-resources:process {execution: default}]
[INFO] [resources:resources]
[INFO] Using default encoding to copy filtered resources.
[INFO] [compiler:compile]
[INFO] Compiling 14 source files to /x1/continuum/working-directory/216/rt/frontend/simple/target/classes
[INFO] [resources:testResources]
[INFO] Using default encoding to copy filtered resources.
[INFO] [compiler:testCompile]
[INFO] Compiling 9 source files to /x1/continuum/working-directory/216/rt/frontend/simple/target/test-classes
[INFO] [surefire:test]
[INFO] Surefire report directory: /x1/continuum/working-directory/216/rt/frontend/simple/target/surefire-reports

-------------------------------------------------------
 T E S T S
-------------------------------------------------------
Running org.apache.cxf.frontend.spring.SpringBeansTest
Tests run: 2, Failures: 0, Errors: 0, Skipped: 0, Time elapsed: 5.036 sec
Running org.apache.cxf.service.factory.ClientFactoryBeanTest
Tests run: 2, Failures: 0, Errors: 0, Skipped: 0, Time elapsed: 1.848 sec
Running org.apache.cxf.frontend.soap.SoapBindingSelectionTest
Tests run: 1, Failures: 0, Errors: 0, Skipped: 0, Time elapsed: 1.074 sec
Running org.apache.cxf.service.factory.ServerFactoryTest
Tests run: 2, Failures: 0, Errors: 0, Skipped: 0, Time elapsed: 1.032 sec
Running org.apache.cxf.service.factory.ReflectionServiceFactoryTest
Tests run: 3, Failures: 0, Errors: 0, Skipped: 0, Time elapsed: 2.045 sec
Running org.apache.cxf.service.factory.RountripTest
Tests run: 1, Failures: 0, Errors: 0, Skipped: 0, Time elapsed: 0.779 sec

Results :

Tests run: 11, Failures: 0, Errors: 0, Skipped: 0

[INFO] [jar:jar]
[INFO] Building jar: /x1/continuum/working-directory/216/rt/frontend/simple/target/cxf-rt-frontend-simple-2.1-incubator-SNAPSHOT.jar
[INFO] [install:install]
[INFO] Installing /x1/continuum/working-directory/216/rt/frontend/simple/target/cxf-rt-frontend-simple-2.1-incubator-SNAPSHOT.jar to /home/continuum/.m2/repository/org/apache/cxf/cxf-rt-frontend-simple/2.1-incubator-SNAPSHOT/cxf-rt-frontend-simple-2.1-incubator-SNAPSHOT.jar
[INFO] ----------------------------------------------------------------------------
[INFO] Building Apache CXF Runtime JAX-WS Frontend
[INFO]    task-segment: [clean, install]
[INFO] ----------------------------------------------------------------------------
[INFO] [clean:clean]
[INFO] Deleting directory /x1/continuum/working-directory/216/rt/frontend/jaxws/target
[INFO] Deleting directory /x1/continuum/working-directory/216/rt/frontend/jaxws/target/classes
[INFO] Deleting directory /x1/continuum/working-directory/216/rt/frontend/jaxws/target/test-classes
[INFO] [checkstyle:checkstyle {execution: validate}]
[INFO] Starting audit...
Audit done.

[INFO] Preparing pmd:check
[INFO] [pmd:pmd]
[INFO] [pmd:check {execution: validate}]
[INFO] 
[INFO] [build-helper:add-source {execution: add-source}]
[INFO] Source directory: /x1/continuum/working-directory/216/rt/frontend/jaxws/src/main/generated added.
[INFO] [remote-resources:process {execution: default}]
[INFO] [resources:resources]
[INFO] Using default encoding to copy filtered resources.
[INFO] [compiler:compile]
[INFO] Compiling 136 source files to /x1/continuum/working-directory/216/rt/frontend/jaxws/target/classes
[INFO] [resources:testResources]
[INFO] Using default encoding to copy filtered resources.
[INFO] [compiler:testCompile]
[INFO] Compiling 57 source files to /x1/continuum/working-directory/216/rt/frontend/jaxws/target/test-classes
[INFO] [surefire:test]
[INFO] Surefire report directory: /x1/continuum/working-directory/216/rt/frontend/jaxws/target/surefire-reports

-------------------------------------------------------
 T E S T S
-------------------------------------------------------
Running org.apache.cxf.jaxws.JaxWsClientTest
Tests run: 3, Failures: 0, Errors: 0, Skipped: 0, Time elapsed: 7.801 sec
Running org.apache.cxf.jaxws.header.HeaderClientServerTest
Tests run: 9, Failures: 0, Errors: 0, Skipped: 0, Time elapsed: 8.707 sec
Running org.apache.cxf.jaxws.SOAPBindingTest
Tests run: 2, Failures: 0, Errors: 0, Skipped: 0, Time elapsed: 1.013 sec
Running org.apache.cxf.jaxws.holder.HolderTest
Tests run: 2, Failures: 0, Errors: 0, Skipped: 0, Time elapsed: 2.702 sec
Running org.apache.cxf.jaxws.provider.ProviderServiceFactoryTest
Tests run: 6, Failures: 0, Errors: 0, Skipped: 0, Time elapsed: 3.384 sec
Running org.apache.cxf.jaxws.javaee.WebservicesTypeTest
Tests run: 1, Failures: 0, Errors: 0, Skipped: 0, Time elapsed: 0.316 sec
Running org.apache.cxf.jaxws.ServiceModelUtilsTest
Tests run: 4, Failures: 0, Errors: 0, Skipped: 0, Time elapsed: 2.144 sec
Running org.apache.cxf.jaxws.handler.InitParamResourceResolverTest
Tests run: 9, Failures: 0, Errors: 0, Skipped: 0, Time elapsed: 0.049 sec
Running org.apache.cxf.jaxws.HeaderTest
Tests run: 1, Failures: 0, Errors: 0, Skipped: 0, Time elapsed: 0.545 sec
Running org.apache.cxf.jaxws.handler.AbstractProtocolHandlerInterceptorTest
Tests run: 2, Failures: 0, Errors: 0, Skipped: 0, Time elapsed: 0.704 sec
Running org.apache.cxf.jaxws.handler.soap.SOAPHandlerInterceptorTest
Tests run: 5, Failures: 0, Errors: 0, Skipped: 0, Time elapsed: 0.303 sec
Running org.apache.cxf.jaxws.GreeterTest
Tests run: 1, Failures: 0, Errors: 0, Skipped: 0, Time elapsed: 0.614 sec
Running org.apache.cxf.jaxws.CodeFirstTest
Tests run: 8, Failures: 0, Errors: 0, Skipped: 0, Time elapsed: 4.213 sec
Running org.apache.cxf.jaxws.spring.SpringBeansTest
Tests run: 3, Failures: 0, Errors: 0, Skipped: 0, Time elapsed: 3.251 sec
Running org.apache.cxf.jaxws.handler.LogicalHandlerInterceptorTest
Tests run: 1, Failures: 0, Errors: 0, Skipped: 0, Time elapsed: 0.043 sec
Running org.apache.cxf.jaxws.context.WebServiceContextImplTest
Tests run: 2, Failures: 0, Errors: 0, Skipped: 0, Time elapsed: 0.016 sec
Running org.apache.cxf.jaxws.JAXWSMethodInvokerTest
Tests run: 1, Failures: 0, Errors: 0, Skipped: 0, Time elapsed: 0.059 sec
Running org.apache.cxf.jaxws.SoapFaultTest
Tests run: 2, Failures: 0, Errors: 0, Skipped: 0, Time elapsed: 2.186 sec
Running org.apache.cxf.jaxws.provider.ProviderTest
Tests run: 1, Failures: 0, Errors: 0, Skipped: 0, Time elapsed: 0.267 sec
Running org.apache.cxf.jaxws.ServiceImplTest
Tests run: 10, Failures: 0, Errors: 0, Skipped: 0, Time elapsed: 3.938 sec
Running org.apache.cxf.jaxws.support.JaxWsServiceFactoryBeanTest
Tests run: 4, Failures: 0, Errors: 0, Skipped: 0, Time elapsed: 1.625 sec
Running org.apache.cxf.jaxws.dispatch.DispatchTest
Tests run: 5, Failures: 0, Errors: 0, Skipped: 0, Time elapsed: 1.719 sec
Running org.apache.cxf.jaxws.handler.AnnotationHandlerChainBuilderTest
Tests run: 2, Failures: 0, Errors: 0, Skipped: 0, Time elapsed: 1.202 sec
Running org.apache.cxf.jaxws.ConfiguredEndpointTest
Tests run: 8, Failures: 0, Errors: 0, Skipped: 2, Time elapsed: 2.658 sec
Running org.apache.cxf.jaxws.support.ContextPropertiesMappingTest
Tests run: 5, Failures: 0, Errors: 0, Skipped: 0, Time elapsed: 0.043 sec
Running org.apache.cxf.jaxws.JaxWsServerFactoryBeanTest
Tests run: 5, Failures: 0, Errors: 0, Skipped: 0, Time elapsed: 2.03 sec
Running org.apache.cxf.jaxws.CodeFirstWSDLTest
Tests run: 2, Failures: 0, Errors: 0, Skipped: 0, Time elapsed: 0.684 sec
Running org.apache.cxf.jaxws.URIMappingInterceptorDocLitTest
Tests run: 5, Failures: 0, Errors: 0, Skipped: 0, Time elapsed: 1.636 sec
Running org.apache.cxf.jaxws.support.JaxWsImplementorInfoTest
Tests run: 1, Failures: 0, Errors: 0, Skipped: 0, Time elapsed: 0.023 sec
Running org.apache.cxf.jaxws.support.JaxWsServiceConfigurationTest
Tests run: 6, Failures: 0, Errors: 0, Skipped: 0, Time elapsed: 0.122 sec
Running org.apache.cxf.jaxws.handler.HandlerChainInvokerTest
Tests run: 22, Failures: 0, Errors: 0, Skipped: 0, Time elapsed: 0.211 sec
Running org.apache.cxf.jaxws.handler.LogicalMessageImplTest
Tests run: 1, Failures: 0, Errors: 0, Skipped: 0, Time elapsed: 0.033 sec
Running org.apache.cxf.jaxws.EndpointImplTest
Tests run: 5, Failures: 0, Errors: 0, Skipped: 0, Time elapsed: 2.213 sec
Running org.apache.cxf.jaxws.handler.HandlerChainBuilderTest
Tests run: 5, Failures: 0, Errors: 0, Skipped: 0, Time elapsed: 0.033 sec
Running org.apache.cxf.jaxws.URIMappingInterceptorRPCTest
Tests run: 6, Failures: 0, Errors: 0, Skipped: 0, Time elapsed: 2.266 sec

Results :

Tests run: 155, Failures: 0, Errors: 0, Skipped: 2

[INFO] [jar:jar]
[INFO] Building jar: /x1/continuum/working-directory/216/rt/frontend/jaxws/target/cxf-rt-frontend-jaxws-2.1-incubator-SNAPSHOT.jar
[INFO] [install:install]
[INFO] Installing /x1/continuum/working-directory/216/rt/frontend/jaxws/target/cxf-rt-frontend-jaxws-2.1-incubator-SNAPSHOT.jar to /home/continuum/.m2/repository/org/apache/cxf/cxf-rt-frontend-jaxws/2.1-incubator-SNAPSHOT/cxf-rt-frontend-jaxws-2.1-incubator-SNAPSHOT.jar
[INFO] ----------------------------------------------------------------------------
[INFO] Building Apache CXF Command Line Tools JavaTo Test
[INFO]    task-segment: [clean, install]
[INFO] ----------------------------------------------------------------------------
[INFO] [clean:clean]
[INFO] Deleting directory /x1/continuum/working-directory/216/tools/javato/test/target
[INFO] Deleting directory /x1/continuum/working-directory/216/tools/javato/test/target/classes
[INFO] Deleting directory /x1/continuum/working-directory/216/tools/javato/test/target/test-classes
[INFO] [checkstyle:checkstyle {execution: validate}]
[INFO] Starting audit...
Audit done.

[INFO] Preparing pmd:check
[INFO] [pmd:pmd]
[INFO] [pmd:check {execution: validate}]
[INFO] 
[INFO] [remote-resources:process {execution: default}]
[INFO] [resources:resources]
[INFO] Using default encoding to copy filtered resources.
[INFO] [compiler:compile]
[INFO] No sources to compile
[INFO] [cxf-codegen:wsdl2java {execution: generate-test-sources}]
[INFO] [build-helper:add-test-source {execution: add-source}]
[INFO] Test Source directory: /x1/continuum/working-directory/216/tools/javato/test/src/test/generated added.
[INFO] [resources:testResources]
[INFO] Using default encoding to copy filtered resources.
[INFO] [compiler:testCompile]
[INFO] Compiling 140 source files to /x1/continuum/working-directory/216/tools/javato/test/target/test-classes
[INFO] [surefire:test]
[INFO] Surefire report directory: /x1/continuum/working-directory/216/tools/javato/test/target/surefire-reports

-------------------------------------------------------
 T E S T S
-------------------------------------------------------
Running org.apache.cxf.tools.java2wsdl.generator.WSDLGeneratorFactoryTest
Tests run: 1, Failures: 0, Errors: 0, Skipped: 0, Time elapsed: 0.14 sec
Running org.apache.cxf.tools.java2wsdl.processor.internal.jaxws.FaultBeanTest
Tests run: 1, Failures: 0, Errors: 0, Skipped: 0, Time elapsed: 0.106 sec
Running org.apache.cxf.tools.java2wsdl.processor.internal.jaxws.RequestWrapperTest
Tests run: 4, Failures: 0, Errors: 0, Skipped: 0, Time elapsed: 5.772 sec
Running org.apache.cxf.tools.java2wsdl.generator.wsdl11.annotator.WrapperBeanAnnotatorTest
Tests run: 1, Failures: 0, Errors: 0, Skipped: 0, Time elapsed: 0.012 sec
Running org.apache.cxf.tools.java2wsdl.generator.wsdl11.WrapperBeanGeneratorTest
Tests run: 2, Failures: 0, Errors: 0, Skipped: 0, Time elapsed: 6.569 sec
Running org.apache.cxf.tools.java2wsdl.generator.wsdl11.annotator.WrapperBeanFieldAnnotatorTest
Tests run: 1, Failures: 0, Errors: 0, Skipped: 0, Time elapsed: 0.023 sec
Running org.apache.cxf.tools.java2wsdl.processor.FrontendFactoryTest
Tests run: 3, Failures: 0, Errors: 0, Skipped: 0, Time elapsed: 0.315 sec
Running org.apache.cxf.tools.java2wsdl.processor.internal.jaxws.WrapperTest
Tests run: 3, Failures: 0, Errors: 0, Skipped: 0, Time elapsed: 0.064 sec
Running org.apache.cxf.tools.java2wsdl.processor.internal.jaxws.JaxwsServiceBuilderRPCTest
Tests run: 1, Failures: 0, Errors: 0, Skipped: 0, Time elapsed: 0.372 sec
Running org.apache.cxf.tools.java2wsdl.processor.internal.jaxws.JaxwsServiceBuilderTest
Tests run: 16, Failures: 0, Errors: 0, Skipped: 1, Time elapsed: 2.978 sec
Running org.apache.cxf.tools.java2wsdl.processor.JavaToProcessorTest
Tests run: 19, Failures: 0, Errors: 0, Skipped: 0, Time elapsed: 47.19 sec
Running org.apache.cxf.tools.java2wsdl.processor.internal.jaxws.WrapperUtilTest
Tests run: 2, Failures: 0, Errors: 0, Skipped: 0, Time elapsed: 0.068 sec
Running org.apache.cxf.tools.java2wsdl.processor.internal.jaxws.JaxwsServiceBuilderNoAnnoTest
Tests run: 3, Failures: 0, Errors: 0, Skipped: 0, Time elapsed: 0.207 sec
Running org.apache.cxf.tools.java2wsdl.processor.internal.ServiceBuilderFactoryTest
Tests run: 3, Failures: 0, Errors: 0, Skipped: 0, Time elapsed: 0.126 sec
Running org.apache.cxf.tools.java2wsdl.generator.wsdl11.FaultBeanGeneratorTest
Tests run: 3, Failures: 0, Errors: 0, Skipped: 0, Time elapsed: 4.171 sec
Running org.apache.cxf.tools.java2wsdl.JavaToWSDLTest
Tests run: 7, Failures: 0, Errors: 0, Skipped: 0, Time elapsed: 2.131 sec
Running org.apache.cxf.tools.java2wsdl.processor.internal.jaxws.ResponseWrapperTest
Tests run: 2, Failures: 0, Errors: 0, Skipped: 0, Time elapsed: 0.046 sec

Results :

Tests run: 72, Failures: 0, Errors: 0, Skipped: 1

[INFO] [jar:jar]
[INFO] Building jar: /x1/continuum/working-directory/216/tools/javato/test/target/cxf-tools-java2wsdl-test-2.1-incubator-SNAPSHOT.jar
[INFO] [install:install]
[INFO] Installing /x1/continuum/working-directory/216/tools/javato/test/target/cxf-tools-java2wsdl-test-2.1-incubator-SNAPSHOT.jar to /home/continuum/.m2/repository/org/apache/cxf/cxf-tools-java2wsdl-test/2.1-incubator-SNAPSHOT/cxf-tools-java2wsdl-test-2.1-incubator-SNAPSHOT.jar
[INFO] ----------------------------------------------------------------------------
[INFO] Building Apache CXF Command Line Tools JavaTo
[INFO]    task-segment: [clean, install]
[INFO] ----------------------------------------------------------------------------
[INFO] [clean:clean]
[INFO] Deleting directory /x1/continuum/working-directory/216/tools/javato/target
[INFO] Deleting directory /x1/continuum/working-directory/216/tools/javato/target/classes
[INFO] Deleting directory /x1/continuum/working-directory/216/tools/javato/target/test-classes
[INFO] [site:attach-descriptor]
[INFO] [install:install]
[INFO] Installing /x1/continuum/working-directory/216/tools/javato/pom.xml to /home/continuum/.m2/repository/org/apache/cxf/cxf-tools-javato/2.1-incubator-SNAPSHOT/cxf-tools-javato-2.1-incubator-SNAPSHOT.pom
[INFO] ----------------------------------------------------------------------------
[INFO] Building Apache CXF Runtime HTTP transport
[INFO]    task-segment: [clean, install]
[INFO] ----------------------------------------------------------------------------
[INFO] [clean:clean]
[INFO] Deleting directory /x1/continuum/working-directory/216/rt/transports/http/target
[INFO] Deleting directory /x1/continuum/working-directory/216/rt/transports/http/target/classes
[INFO] Deleting directory /x1/continuum/working-directory/216/rt/transports/http/target/test-classes
[INFO] [checkstyle:checkstyle {execution: validate}]
[INFO] Starting audit...
Audit done.

[INFO] Preparing pmd:check
[INFO] [pmd:pmd]
[INFO] [pmd:check {execution: validate}]
[INFO] 
[INFO] [cxf-common-xsd:xsdtojava {execution: generate-sources}]
[INFO] [remote-resources:process {execution: default}]
[INFO] [resources:resources]
[INFO] Using default encoding to copy filtered resources.
[INFO] [compiler:compile]
[INFO] Compiling 39 source files to /x1/continuum/working-directory/216/rt/transports/http/target/classes
[INFO] [resources:testResources]
[INFO] Using default encoding to copy filtered resources.
[INFO] [compiler:testCompile]
[INFO] Compiling 6 source files to /x1/continuum/working-directory/216/rt/transports/http/target/test-classes
[INFO] [surefire:test]
[INFO] Surefire report directory: /x1/continuum/working-directory/216/rt/transports/http/target/surefire-reports

-------------------------------------------------------
 T E S T S
-------------------------------------------------------
Running org.apache.cxf.transport.http.policy.PolicyUtilsTest
Tests run: 12, Failures: 0, Errors: 0, Skipped: 0, Time elapsed: 0.387 sec
Running org.apache.cxf.transport.http.policy.HTTPClientAssertionBuilderTest
Tests run: 3, Failures: 0, Errors: 0, Skipped: 0, Time elapsed: 0.061 sec
Running org.apache.cxf.transport.http.HTTPConduitTest
Tests run: 3, Failures: 0, Errors: 0, Skipped: 0, Time elapsed: 0.164 sec
Running org.apache.cxf.transport.http.HTTPConduitURLEasyMockTest
Tests run: 5, Failures: 0, Errors: 0, Skipped: 0, Time elapsed: 2.131 sec
Running org.apache.cxf.transport.http.HTTPConduitURLConnectionTest
Tests run: 3, Failures: 0, Errors: 0, Skipped: 0, Time elapsed: 2.123 sec
Running org.apache.cxf.transport.http.policy.HTTPServerAssertionBuilderTest
Tests run: 3, Failures: 0, Errors: 0, Skipped: 0, Time elapsed: 0.025 sec

Results :

Tests run: 29, Failures: 0, Errors: 0, Skipped: 0

[INFO] [jar:jar]
[INFO] Building jar: /x1/continuum/working-directory/216/rt/transports/http/target/cxf-rt-transports-http-2.1-incubator-SNAPSHOT.jar
[INFO] [install:install]
[INFO] Installing /x1/continuum/working-directory/216/rt/transports/http/target/cxf-rt-transports-http-2.1-incubator-SNAPSHOT.jar to /home/continuum/.m2/repository/org/apache/cxf/cxf-rt-transports-http/2.1-incubator-SNAPSHOT/cxf-rt-transports-http-2.1-incubator-SNAPSHOT.jar
[INFO] ----------------------------------------------------------------------------
[INFO] Building Apache CXF Runtime HTTP Jetty transport
[INFO]    task-segment: [clean, install]
[INFO] ----------------------------------------------------------------------------
[INFO] [clean:clean]
[INFO] Deleting directory /x1/continuum/working-directory/216/rt/transports/http-jetty/target
[INFO] Deleting directory /x1/continuum/working-directory/216/rt/transports/http-jetty/target/classes
[INFO] Deleting directory /x1/continuum/working-directory/216/rt/transports/http-jetty/target/test-classes
[INFO] [checkstyle:checkstyle {execution: validate}]
[INFO] Starting audit...
Audit done.

[INFO] Preparing pmd:check
[INFO] [pmd:pmd]
[INFO] [pmd:check {execution: validate}]
[INFO] 
[INFO] [cxf-common-xsd:xsdtojava {execution: generate-sources}]
[INFO] [remote-resources:process {execution: default}]
[INFO] [resources:resources]
[INFO] Using default encoding to copy filtered resources.
[INFO] [compiler:compile]
[INFO] Compiling 22 source files to /x1/continuum/working-directory/216/rt/transports/http-jetty/target/classes
[INFO] [resources:testResources]
[INFO] Using default encoding to copy filtered resources.
[INFO] [compiler:testCompile]
[INFO] Compiling 6 source files to /x1/continuum/working-directory/216/rt/transports/http-jetty/target/test-classes
[INFO] [surefire:test]
[INFO] Surefire report directory: /x1/continuum/working-directory/216/rt/transports/http-jetty/target/surefire-reports

-------------------------------------------------------
 T E S T S
-------------------------------------------------------
Running org.apache.cxf.transport.http_jetty.JettyHTTPServerEngineTest
Tests run: 2, Failures: 0, Errors: 0, Skipped: 0, Time elapsed: 0.509 sec
Running org.apache.cxf.transport.http_jetty.JettyHTTPDestinationTest
Tests run: 17, Failures: 0, Errors: 0, Skipped: 0, Time elapsed: 2.853 sec
Running org.apache.cxf.transport.http_jetty.JettyContextInspectorTest
Tests run: 1, Failures: 0, Errors: 0, Skipped: 0, Time elapsed: 0.528 sec
Running org.apache.cxf.transport.http_jetty.JettyHTTPServerEngineFactoryTest
Tests run: 2, Failures: 0, Errors: 0, Skipped: 0, Time elapsed: 5.399 sec
Running org.apache.cxf.transport.http_jetty.spring.BeanDefinitionParsersTest
Tests run: 3, Failures: 0, Errors: 0, Skipped: 0, Time elapsed: 0.91 sec
Running org.apache.cxf.transport.http_jetty.spring.ApplicationContextTest
Tests run: 2, Failures: 0, Errors: 0, Skipped: 0, Time elapsed: 3.479 sec

Results :

Tests run: 27, Failures: 0, Errors: 0, Skipped: 0

[INFO] [jar:jar]
[INFO] Building jar: /x1/continuum/working-directory/216/rt/transports/http-jetty/target/cxf-rt-transports-http-jetty-2.1-incubator-SNAPSHOT.jar
[INFO] [install:install]
[INFO] Installing /x1/continuum/working-directory/216/rt/transports/http-jetty/target/cxf-rt-transports-http-jetty-2.1-incubator-SNAPSHOT.jar to /home/continuum/.m2/repository/org/apache/cxf/cxf-rt-transports-http-jetty/2.1-incubator-SNAPSHOT/cxf-rt-transports-http-jetty-2.1-incubator-SNAPSHOT.jar
[INFO] ----------------------------------------------------------------------------
[INFO] Building Apache CXF Runtime Aegis Databinding
[INFO]    task-segment: [clean, install]
[INFO] ----------------------------------------------------------------------------
[INFO] [clean:clean]
[INFO] Deleting directory /x1/continuum/working-directory/216/rt/databinding/aegis/target
[INFO] Deleting directory /x1/continuum/working-directory/216/rt/databinding/aegis/target/classes
[INFO] Deleting directory /x1/continuum/working-directory/216/rt/databinding/aegis/target/test-classes
[INFO] [checkstyle:checkstyle {execution: validate}]
[INFO] Starting audit...
Audit done.

[INFO] Preparing pmd:check
[INFO] [pmd:pmd]
[INFO] [pmd:check {execution: validate}]
[INFO] 
[INFO] [build-helper:add-source {execution: add-source}]
[INFO] Source directory: /x1/continuum/working-directory/216/rt/databinding/aegis/src/main/generated added.
[INFO] [remote-resources:process {execution: default}]
[INFO] [resources:resources]
[INFO] Using default encoding to copy filtered resources.
[INFO] [compiler:compile]
[INFO] Compiling 90 source files to /x1/continuum/working-directory/216/rt/databinding/aegis/target/classes
[INFO] [resources:testResources]
[INFO] Using default encoding to copy filtered resources.
[INFO] [compiler:testCompile]
[INFO] Compiling 83 source files to /x1/continuum/working-directory/216/rt/databinding/aegis/target/test-classes
[INFO] [surefire:test]
[INFO] Surefire report directory: /x1/continuum/working-directory/216/rt/databinding/aegis/target/surefire-reports

-------------------------------------------------------
 T E S T S
-------------------------------------------------------
Running org.apache.cxf.aegis.xml.stax.WriterTest
Tests run: 2, Failures: 0, Errors: 0, Skipped: 0, Time elapsed: 5.341 sec
Running org.apache.cxf.aegis.type.basic.DynamicProxyTest
Tests run: 6, Failures: 0, Errors: 0, Skipped: 0, Time elapsed: 1.431 sec
Running org.apache.cxf.aegis.services.base64.BinaryDataTest
Tests run: 1, Failures: 0, Errors: 0, Skipped: 0, Time elapsed: 1.274 sec
Running org.codehaus.xfire.aegis.inheritance.intf.InterfaceInheritanceTest
Tests run: 1, Failures: 0, Errors: 0, Skipped: 0, Time elapsed: 1.162 sec
Running org.apache.cxf.aegis.type.java5.DualOutServiceTest
Tests run: 1, Failures: 0, Errors: 0, Skipped: 0, Time elapsed: 0.907 sec
Running org.codehaus.xfire.aegis.inheritance.ExceptionInheritanceTest
Tests run: 1, Failures: 0, Errors: 0, Skipped: 0, Time elapsed: 0.095 sec
Running org.apache.cxf.aegis.xml.stax.ReaderTest
Tests run: 2, Failures: 0, Errors: 0, Skipped: 0, Time elapsed: 1.443 sec
Running org.apache.cxf.aegis.type.java5.AnnotatedTypeTest
Tests run: 7, Failures: 0, Errors: 0, Skipped: 0, Time elapsed: 1.254 sec
Running org.apache.cxf.aegis.type.basic.BeanTest
Tests run: 11, Failures: 0, Errors: 0, Skipped: 0, Time elapsed: 1.705 sec
Running org.apache.cxf.aegis.type.java5.ConfigurationTest
Tests run: 6, Failures: 0, Errors: 0, Skipped: 0, Time elapsed: 0.714 sec
Running org.codehaus.xfire.aegis.inheritance.InheritancePOJOTest
Tests run: 3, Failures: 0, Errors: 0, Skipped: 0, Time elapsed: 0.64 sec
Running org.apache.cxf.aegis.type.java5.OperationNSTest
Tests run: 1, Failures: 0, Errors: 0, Skipped: 0, Time elapsed: 0.221 sec
Running org.apache.cxf.aegis.type.java5.CollectionTest
Tests run: 8, Failures: 0, Errors: 0, Skipped: 0, Time elapsed: 1.011 sec
Running org.apache.cxf.aegis.client.HeaderTest
Tests run: 1, Failures: 0, Errors: 0, Skipped: 1, Time elapsed: 0.006 sec
Running org.apache.cxf.aegis.type.java5.MapTest
Tests run: 6, Failures: 0, Errors: 0, Skipped: 0, Time elapsed: 0.664 sec
Running org.apache.cxf.aegis.type.java5.EnumTypeTest
Tests run: 6, Failures: 0, Errors: 0, Skipped: 0, Time elapsed: 0.698 sec
Running org.apache.cxf.aegis.type.basic.ByteDataTest
Tests run: 1, Failures: 0, Errors: 0, Skipped: 0, Time elapsed: 0.253 sec
Running org.apache.cxf.aegis.integration.WrappedTest
Tests run: 2, Failures: 0, Errors: 0, Skipped: 0, Time elapsed: 0.483 sec
Running org.apache.cxf.aegis.type.java5.XmlParamTypeTest
Tests run: 2, Failures: 0, Errors: 0, Skipped: 0, Time elapsed: 0.535 sec

Results :

Tests run: 68, Failures: 0, Errors: 0, Skipped: 1

[INFO] [jar:jar]
[INFO] Building jar: /x1/continuum/working-directory/216/rt/databinding/aegis/target/cxf-rt-databinding-aegis-2.1-incubator-SNAPSHOT.jar
[INFO] [install:install]
[INFO] Installing /x1/continuum/working-directory/216/rt/databinding/aegis/target/cxf-rt-databinding-aegis-2.1-incubator-SNAPSHOT.jar to /home/continuum/.m2/repository/org/apache/cxf/cxf-rt-databinding-aegis/2.1-incubator-SNAPSHOT/cxf-rt-databinding-aegis-2.1-incubator-SNAPSHOT.jar
[INFO] ----------------------------------------------------------------------------
[INFO] Building Apache CXF Runtime HTTP Binding
[INFO]    task-segment: [clean, install]
[INFO] ----------------------------------------------------------------------------
[INFO] [clean:clean]
[INFO] Deleting directory /x1/continuum/working-directory/216/rt/bindings/http/target
[INFO] Deleting directory /x1/continuum/working-directory/216/rt/bindings/http/target/classes
[INFO] Deleting directory /x1/continuum/working-directory/216/rt/bindings/http/target/test-classes
[INFO] [checkstyle:checkstyle {execution: validate}]
[INFO] Starting audit...
Audit done.

[INFO] Preparing pmd:check
[INFO] [pmd:pmd]
[INFO] [pmd:check {execution: validate}]
[INFO] 
[INFO] [remote-resources:process {execution: default}]
[INFO] [resources:resources]
[INFO] Using default encoding to copy filtered resources.
[INFO] [compiler:compile]
[INFO] Compiling 16 source files to /x1/continuum/working-directory/216/rt/bindings/http/target/classes
[INFO] [cxf-common-xsd:xsdtojava {execution: generate-sources}]
[INFO] [resources:testResources]
[INFO] Using default encoding to copy filtered resources.
[INFO] [compiler:testCompile]
[INFO] Compiling 16 source files to /x1/continuum/working-directory/216/rt/bindings/http/target/test-classes
[INFO] [surefire:test]
[INFO] Surefire report directory: /x1/continuum/working-directory/216/rt/bindings/http/target/surefire-reports

-------------------------------------------------------
 T E S T S
-------------------------------------------------------
Running org.apache.cxf.binding.http.InflectorTest
Tests run: 2, Failures: 0, Errors: 0, Skipped: 0, Time elapsed: 0.073 sec
Running org.apache.cxf.binding.http.mtom.MtomTest
Tests run: 1, Failures: 0, Errors: 0, Skipped: 0, Time elapsed: 7.513 sec
Running org.apache.cxf.binding.http.IriDecoderTest
Tests run: 1, Failures: 0, Errors: 0, Skipped: 0, Time elapsed: 0.02 sec
Running org.apache.cxf.binding.http.wrapped.WrappedServiceTest
Tests run: 2, Failures: 0, Errors: 0, Skipped: 0, Time elapsed: 2.258 sec
Running org.apache.cxf.binding.http.bare.ClientTest
Tests run: 1, Failures: 0, Errors: 0, Skipped: 0, Time elapsed: 1.043 sec
Running org.apache.cxf.binding.http.bare.BareServiceTest
Tests run: 4, Failures: 0, Errors: 0, Skipped: 0, Time elapsed: 2.549 sec

Results :

Tests run: 11, Failures: 0, Errors: 0, Skipped: 0

[INFO] [jar:jar]
[INFO] Building jar: /x1/continuum/working-directory/216/rt/bindings/http/target/cxf-rt-bindings-http-2.1-incubator-SNAPSHOT.jar
[INFO] [install:install]
[INFO] Installing /x1/continuum/working-directory/216/rt/bindings/http/target/cxf-rt-bindings-http-2.1-incubator-SNAPSHOT.jar to /home/continuum/.m2/repository/org/apache/cxf/cxf-rt-bindings-http/2.1-incubator-SNAPSHOT/cxf-rt-bindings-http-2.1-incubator-SNAPSHOT.jar
[INFO] ----------------------------------------------------------------------------
[INFO] Building Apache CXF Runtime Object Binding
[INFO]    task-segment: [clean, install]
[INFO] ----------------------------------------------------------------------------
[INFO] [clean:clean]
[INFO] Deleting directory /x1/continuum/working-directory/216/rt/bindings/object/target
[INFO] Deleting directory /x1/continuum/working-directory/216/rt/bindings/object/target/classes
[INFO] Deleting directory /x1/continuum/working-directory/216/rt/bindings/object/target/test-classes
[INFO] [checkstyle:checkstyle {execution: validate}]
[INFO] Starting audit...
Audit done.

[INFO] Preparing pmd:check
[INFO] [pmd:pmd]
[INFO] [pmd:check {execution: validate}]
[INFO] 
[INFO] [remote-resources:process {execution: default}]
[INFO] [resources:resources]
[INFO] Using default encoding to copy filtered resources.
[INFO] [compiler:compile]
[INFO] Compiling 7 source files to /x1/continuum/working-directory/216/rt/bindings/object/target/classes
[INFO] [resources:testResources]
[INFO] Using default encoding to copy filtered resources.
[INFO] [compiler:testCompile]
[INFO] Compiling 4 source files to /x1/continuum/working-directory/216/rt/bindings/object/target/test-classes
[INFO] [surefire:test]
[INFO] Surefire report directory: /x1/continuum/working-directory/216/rt/bindings/object/target/surefire-reports

-------------------------------------------------------
 T E S T S
-------------------------------------------------------
Running org.apache.cxf.binding.object.LocalServerRegistrationTest
Tests run: 1, Failures: 0, Errors: 0, Skipped: 0, Time elapsed: 6.633 sec
Running org.apache.cxf.binding.object.ObjectBindingTest
Tests run: 3, Failures: 0, Errors: 0, Skipped: 0, Time elapsed: 3.117 sec

Results :

Tests run: 4, Failures: 0, Errors: 0, Skipped: 0

[INFO] [jar:jar]
[INFO] Building jar: /x1/continuum/working-directory/216/rt/bindings/object/target/cxf-rt-bindings-object-2.1-incubator-SNAPSHOT.jar
[INFO] [install:install]
[INFO] Installing /x1/continuum/working-directory/216/rt/bindings/object/target/cxf-rt-bindings-object-2.1-incubator-SNAPSHOT.jar to /home/continuum/.m2/repository/org/apache/cxf/cxf-rt-bindings-object/2.1-incubator-SNAPSHOT/cxf-rt-bindings-object-2.1-incubator-SNAPSHOT.jar
[INFO] ----------------------------------------------------------------------------
[INFO] Building Apache CXF Colocated Binding
[INFO]    task-segment: [clean, install]
[INFO] ----------------------------------------------------------------------------
[INFO] [clean:clean]
[INFO] Deleting directory /x1/continuum/working-directory/216/rt/bindings/coloc/target
[INFO] Deleting directory /x1/continuum/working-directory/216/rt/bindings/coloc/target/classes
[INFO] Deleting directory /x1/continuum/working-directory/216/rt/bindings/coloc/target/test-classes
[INFO] [checkstyle:checkstyle {execution: validate}]
[INFO] Starting audit...
Audit done.

[INFO] Preparing pmd:check
[INFO] [pmd:pmd]
[INFO] [pmd:check {execution: validate}]
[INFO] 
[INFO] [remote-resources:process {execution: default}]
[INFO] [resources:resources]
[INFO] Using default encoding to copy filtered resources.
[INFO] [compiler:compile]
[INFO] Compiling 10 source files to /x1/continuum/working-directory/216/rt/bindings/coloc/target/classes
[INFO] [resources:testResources]
[INFO] Using default encoding to copy filtered resources.
[INFO] [compiler:testCompile]
[INFO] Compiling 3 source files to /x1/continuum/working-directory/216/rt/bindings/coloc/target/test-classes
[INFO] [surefire:test]
[INFO] Surefire report directory: /x1/continuum/working-directory/216/rt/bindings/coloc/target/surefire-reports

-------------------------------------------------------
 T E S T S
-------------------------------------------------------
Running org.apache.cxf.binding.coloc.ColocMessageObserverTest
Tests run: 2, Failures: 0, Errors: 0, Skipped: 0, Time elapsed: 1.541 sec
Running org.apache.cxf.binding.coloc.ColocUtilTest
Tests run: 6, Failures: 0, Errors: 0, Skipped: 0, Time elapsed: 0.1 sec
Running org.apache.cxf.binding.coloc.ColocOutInterceptorTest
Tests run: 8, Failures: 0, Errors: 0, Skipped: 0, Time elapsed: 0.604 sec

Results :

Tests run: 16, Failures: 0, Errors: 0, Skipped: 0

[INFO] [jar:jar]
[INFO] Building jar: /x1/continuum/working-directory/216/rt/bindings/coloc/target/cxf-rt-bindings-coloc-2.1-incubator-SNAPSHOT.jar
[INFO] [install:install]
[INFO] Installing /x1/continuum/working-directory/216/rt/bindings/coloc/target/cxf-rt-bindings-coloc-2.1-incubator-SNAPSHOT.jar to /home/continuum/.m2/repository/org/apache/cxf/cxf-rt-bindings-coloc/2.1-incubator-SNAPSHOT/cxf-rt-bindings-coloc-2.1-incubator-SNAPSHOT.jar
[INFO] ----------------------------------------------------------------------------
[INFO] Building Apache CXF Runtime JBI Binding
[INFO]    task-segment: [clean, install]
[INFO] ----------------------------------------------------------------------------
[INFO] [clean:clean]
[INFO] Deleting directory /x1/continuum/working-directory/216/rt/bindings/jbi/target
[INFO] Deleting directory /x1/continuum/working-directory/216/rt/bindings/jbi/target/classes
[INFO] Deleting directory /x1/continuum/working-directory/216/rt/bindings/jbi/target/test-classes
[INFO] [checkstyle:checkstyle {execution: validate}]
[INFO] Starting audit...
Audit done.

[INFO] Preparing pmd:check
[INFO] [pmd:pmd]
[INFO] [pmd:check {execution: validate}]
[INFO] 
[INFO] [cxf-common-xsd:xsdtojava {execution: generate-sources}]
[INFO] [remote-resources:process {execution: default}]
[INFO] [resources:resources]
[INFO] Using default encoding to copy filtered resources.
[INFO] [compiler:compile]
[INFO] Compiling 14 source files to /x1/continuum/working-directory/216/rt/bindings/jbi/target/classes
[INFO] [resources:testResources]
[INFO] Using default encoding to copy filtered resources.
[INFO] [compiler:testCompile]
[INFO] Compiling 3 source files to /x1/continuum/working-directory/216/rt/bindings/jbi/target/test-classes
[INFO] [surefire:test]
[INFO] Surefire report directory: /x1/continuum/working-directory/216/rt/bindings/jbi/target/surefire-reports

-------------------------------------------------------
 T E S T S
-------------------------------------------------------
Running org.apache.cxf.binding.jbi.JBIBindingFactoryTest
Tests run: 1, Failures: 0, Errors: 0, Skipped: 0, Time elapsed: 0.196 sec
Running org.apache.cxf.binding.jbi.interceptor.JBIOperationInInterceptorTest
Tests run: 2, Failures: 0, Errors: 0, Skipped: 0, Time elapsed: 2.7 sec
Running org.apache.cxf.binding.jbi.interceptor.JBIFaultOutInterceptorTest
Tests run: 5, Failures: 0, Errors: 0, Skipped: 0, Time elapsed: 0.232 sec

Results :

Tests run: 8, Failures: 0, Errors: 0, Skipped: 0

[INFO] [jar:jar]
[INFO] Building jar: /x1/continuum/working-directory/216/rt/bindings/jbi/target/cxf-rt-bindings-jbi-2.1-incubator-SNAPSHOT.jar
[INFO] [install:install]
[INFO] Installing /x1/continuum/working-directory/216/rt/bindings/jbi/target/cxf-rt-bindings-jbi-2.1-incubator-SNAPSHOT.jar to /home/continuum/.m2/repository/org/apache/cxf/cxf-rt-bindings-jbi/2.1-incubator-SNAPSHOT/cxf-rt-bindings-jbi-2.1-incubator-SNAPSHOT.jar
[INFO] ----------------------------------------------------------------------------
[INFO] Building Apache CXF Runtime
[INFO]    task-segment: [clean, install]
[INFO] ----------------------------------------------------------------------------
[INFO] [clean:clean]
[INFO] Deleting directory /x1/continuum/working-directory/216/rt/target
[INFO] Deleting directory /x1/continuum/working-directory/216/rt/target/classes
[INFO] Deleting directory /x1/continuum/working-directory/216/rt/target/test-classes
[INFO] [site:attach-descriptor]
[INFO] [install:install]
[INFO] Installing /x1/continuum/working-directory/216/rt/pom.xml to /home/continuum/.m2/repository/org/apache/cxf/cxf-rt/2.1-incubator-SNAPSHOT/cxf-rt-2.1-incubator-SNAPSHOT.pom
[INFO] ----------------------------------------------------------------------------
[INFO] Building Apache CXF Runtime Bindings
[INFO]    task-segment: [clean, install]
[INFO] ----------------------------------------------------------------------------
[INFO] [clean:clean]
[INFO] Deleting directory /x1/continuum/working-directory/216/rt/bindings/target
[INFO] Deleting directory /x1/continuum/working-directory/216/rt/bindings/target/classes
[INFO] Deleting directory /x1/continuum/working-directory/216/rt/bindings/target/test-classes
[INFO] [site:attach-descriptor]
[INFO] [install:install]
[INFO] Installing /x1/continuum/working-directory/216/rt/bindings/pom.xml to /home/continuum/.m2/repository/org/apache/cxf/cxf-rt-bindings/2.1-incubator-SNAPSHOT/cxf-rt-bindings-2.1-incubator-SNAPSHOT.pom
[INFO] ----------------------------------------------------------------------------
[INFO] Building Apache CXF Runtime JavaScript Frontend
[INFO]    task-segment: [clean, install]
[INFO] ----------------------------------------------------------------------------
[INFO] [clean:clean]
[INFO] Deleting directory /x1/continuum/working-directory/216/rt/frontend/js/target
[INFO] Deleting directory /x1/continuum/working-directory/216/rt/frontend/js/target/classes
[INFO] Deleting directory /x1/continuum/working-directory/216/rt/frontend/js/target/test-classes
[INFO] [checkstyle:checkstyle {execution: validate}]
[INFO] Starting audit...
Audit done.

[INFO] Preparing pmd:check
[INFO] [pmd:pmd]
[INFO] [pmd:check {execution: validate}]
[INFO] 
[INFO] [remote-resources:process {execution: default}]
[INFO] [resources:resources]
[INFO] Using default encoding to copy filtered resources.
[INFO] [compiler:compile]
[INFO] Compiling 6 source files to /x1/continuum/working-directory/216/rt/frontend/js/target/classes
[INFO] [resources:testResources]
[INFO] Using default encoding to copy filtered resources.
[INFO] [compiler:testCompile]
[INFO] Compiling 3 source files to /x1/continuum/working-directory/216/rt/frontend/js/target/test-classes
[INFO] [surefire:test]
[INFO] Surefire report directory: /x1/continuum/working-directory/216/rt/frontend/js/target/surefire-reports

-------------------------------------------------------
 T E S T S
-------------------------------------------------------
Running org.apache.cxf.js.rhino.AbstractDOMProviderTest
Tests run: 7, Failures: 0, Errors: 0, Skipped: 0, Time elapsed: 0.441 sec
Running org.apache.cxf.js.rhino.ServerAppTest
Tests run: 13, Failures: 0, Errors: 0, Skipped: 0, Time elapsed: 0.413 sec
Running org.apache.cxf.js.rhino.ProviderFactoryTest
Tests run: 7, Failures: 0, Errors: 0, Skipped: 0, Time elapsed: 0.581 sec

Results :

Tests run: 27, Failures: 0, Errors: 0, Skipped: 0

[INFO] [jar:jar]
[INFO] Building jar: /x1/continuum/working-directory/216/rt/frontend/js/target/cxf-rt-frontend-js-2.1-incubator-SNAPSHOT.jar
[INFO] [install:install]
[INFO] Installing /x1/continuum/working-directory/216/rt/frontend/js/target/cxf-rt-frontend-js-2.1-incubator-SNAPSHOT.jar to /home/continuum/.m2/repository/org/apache/cxf/cxf-rt-frontend-js/2.1-incubator-SNAPSHOT/cxf-rt-frontend-js-2.1-incubator-SNAPSHOT.jar
[INFO] ----------------------------------------------------------------------------
[INFO] Building Apache CXF Runtime JBI transport
[INFO]    task-segment: [clean, install]
[INFO] ----------------------------------------------------------------------------
[INFO] [clean:clean]
[INFO] Deleting directory /x1/continuum/working-directory/216/rt/transports/jbi/target
[INFO] Deleting directory /x1/continuum/working-directory/216/rt/transports/jbi/target/classes
[INFO] Deleting directory /x1/continuum/working-directory/216/rt/transports/jbi/target/test-classes
[INFO] [checkstyle:checkstyle {execution: validate}]
[INFO] Starting audit...
Audit done.

[INFO] Preparing pmd:check
[INFO] [pmd:pmd]
[INFO] [pmd:check {execution: validate}]
[INFO] 
[INFO] [cxf-common-xsd:xsdtojava {execution: generate-sources}]
[INFO] [remote-resources:process {execution: default}]
[INFO] [resources:resources]
[INFO] Using default encoding to copy filtered resources.
[INFO] [compiler:compile]
[INFO] Compiling 11 source files to /x1/continuum/working-directory/216/rt/transports/jbi/target/classes
[INFO] [resources:testResources]
[INFO] Using default encoding to copy filtered resources.
[INFO] [compiler:testCompile]
[INFO] Compiling 3 source files to /x1/continuum/working-directory/216/rt/transports/jbi/target/test-classes
[INFO] [surefire:test]
[INFO] Surefire report directory: /x1/continuum/working-directory/216/rt/transports/jbi/target/surefire-reports

-------------------------------------------------------
 T E S T S
-------------------------------------------------------
Running org.apache.cxf.transport.jbi.JBIConduitTest
Tests run: 2, Failures: 0, Errors: 0, Skipped: 0, Time elapsed: 4.396 sec
Running org.apache.cxf.transport.jbi.JBIDestinationTest
Tests run: 1, Failures: 0, Errors: 0, Skipped: 0, Time elapsed: 0.826 sec

Results :

Tests run: 3, Failures: 0, Errors: 0, Skipped: 0

[INFO] [jar:jar]
[INFO] Building jar: /x1/continuum/working-directory/216/rt/transports/jbi/target/cxf-rt-transports-jbi-2.1-incubator-SNAPSHOT.jar
[INFO] [install:install]
[INFO] Installing /x1/continuum/working-directory/216/rt/transports/jbi/target/cxf-rt-transports-jbi-2.1-incubator-SNAPSHOT.jar to /home/continuum/.m2/repository/org/apache/cxf/cxf-rt-transports-jbi/2.1-incubator-SNAPSHOT/cxf-rt-transports-jbi-2.1-incubator-SNAPSHOT.jar
[INFO] ----------------------------------------------------------------------------
[INFO] Building Apache CXF Runtime WS Policy
[INFO]    task-segment: [clean, install]
[INFO] ----------------------------------------------------------------------------
[INFO] [clean:clean]
[INFO] Deleting directory /x1/continuum/working-directory/216/rt/ws/policy/target
[INFO] Deleting directory /x1/continuum/working-directory/216/rt/ws/policy/target/classes
[INFO] Deleting directory /x1/continuum/working-directory/216/rt/ws/policy/target/test-classes
[INFO] [checkstyle:checkstyle {execution: validate}]
[INFO] Starting audit...
Audit done.

[INFO] Preparing pmd:check
[INFO] [pmd:pmd]
[INFO] [pmd:check {execution: validate}]
[INFO] 
[INFO] [cxf-common-xsd:xsdtojava {execution: generate-sources}]
[INFO] [remote-resources:process {execution: default}]
[INFO] [resources:resources]
[INFO] Using default encoding to copy filtered resources.
[INFO] [compiler:compile]
[INFO] Compiling 59 source files to /x1/continuum/working-directory/216/rt/ws/policy/target/classes
[INFO] [cxf-codegen:wsdl2java {execution: generate-test-sources}]
[INFO] [resources:testResources]
[INFO] Using default encoding to copy filtered resources.
[INFO] [compiler:testCompile]
[INFO] Compiling 32 source files to /x1/continuum/working-directory/216/rt/ws/policy/target/test-classes
[INFO] [surefire:test]
[INFO] Surefire report directory: /x1/continuum/working-directory/216/rt/ws/policy/target/surefire-reports

-------------------------------------------------------
 T E S T S
-------------------------------------------------------
Running org.apache.cxf.ws.policy.attachment.external.EndpointReferenceDomainExpressionTest
Tests run: 1, Failures: 0, Errors: 0, Skipped: 0, Time elapsed: 1.83 sec
Running org.apache.cxf.ws.policy.attachment.external.DomainExpressionBuilderRegistryTest
Tests run: 2, Failures: 0, Errors: 0, Skipped: 0, Time elapsed: 0.138 sec
Running org.apache.cxf.ws.policy.attachment.wsdl11.Wsdl11AttachmentPolicyProviderTest
Tests run: 7, Failures: 0, Errors: 0, Skipped: 0, Time elapsed: 3.266 sec
Running org.apache.cxf.ws.policy.PolicyVerificationInFaultInterceptorTest
Tests run: 1, Failures: 0, Errors: 0, Skipped: 0, Time elapsed: 0.693 sec
Running org.apache.cxf.ws.policy.PolicyInterceptorProviderRegistryImplTest
Tests run: 1, Failures: 0, Errors: 0, Skipped: 0, Time elapsed: 0.013 sec
Running org.apache.cxf.ws.policy.PolicyInterceptorsTest
Tests run: 8, Failures: 0, Errors: 0, Skipped: 0, Time elapsed: 0.517 sec
Running org.apache.cxf.ws.policy.spring.PolicyFeatureTest
Tests run: 4, Failures: 0, Errors: 0, Skipped: 0, Time elapsed: 10.199 sec
Running org.apache.cxf.ws.policy.PolicyTest
Tests run: 4, Failures: 0, Errors: 0, Skipped: 3, Time elapsed: 0.024 sec
Running org.apache.cxf.ws.policy.attachment.reference.ReferenceResolverTest
Tests run: 3, Failures: 0, Errors: 0, Skipped: 0, Time elapsed: 0.195 sec
Running org.apache.cxf.ws.policy.PolicyEngineTest
Tests run: 27, Failures: 0, Errors: 0, Skipped: 0, Time elapsed: 0.487 sec
Running org.apache.cxf.ws.policy.selector.MinimalMaximalAlternativeSelectorTest
Tests run: 2, Failures: 0, Errors: 0, Skipped: 0, Time elapsed: 0.016 sec
Running org.apache.cxf.ws.policy.EffectivePolicyImplTest
Tests run: 9, Failures: 0, Errors: 0, Skipped: 0, Time elapsed: 0.054 sec
Running org.apache.cxf.ws.policy.PolicyVerificationInInterceptorTest
Tests run: 2, Failures: 0, Errors: 0, Skipped: 0, Time elapsed: 0.059 sec
Running org.apache.cxf.ws.policy.PolicyExtensionsTest
Tests run: 1, Failures: 0, Errors: 0, Skipped: 0, Time elapsed: 0.436 sec
Running org.apache.cxf.ws.policy.selector.FirstAlternativeSelectorTest
Tests run: 1, Failures: 0, Errors: 0, Skipped: 0, Time elapsed: 0.006 sec
Running org.apache.cxf.ws.policy.builder.primitive.NestedPrimitiveAssertionTest
Tests run: 3, Failures: 0, Errors: 0, Skipped: 0, Time elapsed: 0.09 sec
Running org.apache.cxf.ws.policy.EndpointPolicyImplTest
Tests run: 8, Failures: 0, Errors: 0, Skipped: 0, Time elapsed: 0.095 sec
Running org.apache.cxf.ws.policy.attachment.external.ExternalAttachmentProviderTest
Tests run: 11, Failures: 0, Errors: 0, Skipped: 0, Time elapsed: 0.195 sec
Running org.apache.cxf.ws.policy.attachment.external.PolicyAttachmentTest
Tests run: 6, Failures: 0, Errors: 0, Skipped: 0, Time elapsed: 0.024 sec
Running org.apache.cxf.ws.policy.PolicyRegistryImplTest
Tests run: 1, Failures: 0, Errors: 0, Skipped: 0, Time elapsed: 0.006 sec
Running org.apache.cxf.ws.policy.PolicyVerificationOutInterceptorTest
Tests run: 1, Failures: 0, Errors: 0, Skipped: 0, Time elapsed: 0.063 sec
Running org.apache.cxf.ws.policy.PolicyBuilderTest
Tests run: 3, Failures: 0, Errors: 0, Skipped: 0, Time elapsed: 0.096 sec
Running org.apache.cxf.ws.policy.NormalizeTest
Tests run: 1, Failures: 0, Errors: 0, Skipped: 0, Time elapsed: 0.299 sec

Results :

Tests run: 107, Failures: 0, Errors: 0, Skipped: 3

[INFO] [jar:jar]
[INFO] Building jar: /x1/continuum/working-directory/216/rt/ws/policy/target/cxf-rt-ws-policy-2.1-incubator-SNAPSHOT.jar
[INFO] [install:install]
[INFO] Installing /x1/continuum/working-directory/216/rt/ws/policy/target/cxf-rt-ws-policy-2.1-incubator-SNAPSHOT.jar to /home/continuum/.m2/repository/org/apache/cxf/cxf-rt-ws-policy/2.1-incubator-SNAPSHOT/cxf-rt-ws-policy-2.1-incubator-SNAPSHOT.jar
[INFO] ----------------------------------------------------------------------------
[INFO] Building Apache CXF Runtime WS Addressing
[INFO]    task-segment: [clean, install]
[INFO] ----------------------------------------------------------------------------
[INFO] [clean:clean]
[INFO] Deleting directory /x1/continuum/working-directory/216/rt/ws/addr/target
[INFO] Deleting directory /x1/continuum/working-directory/216/rt/ws/addr/target/classes
[INFO] Deleting directory /x1/continuum/working-directory/216/rt/ws/addr/target/test-classes
[INFO] [checkstyle:checkstyle {execution: validate}]
[INFO] Starting audit...
Audit done.

[INFO] Preparing pmd:check
[INFO] [pmd:pmd]
[INFO] [pmd:check {execution: validate}]
[INFO] 
[INFO] [remote-resources:process {execution: default}]
[INFO] [resources:resources]
[INFO] Using default encoding to copy filtered resources.
[INFO] [compiler:compile]
[INFO] Compiling 15 source files to /x1/continuum/working-directory/216/rt/ws/addr/target/classes
[INFO] [resources:testResources]
[INFO] Using default encoding to copy filtered resources.
[INFO] [compiler:testCompile]
[INFO] Compiling 7 source files to /x1/continuum/working-directory/216/rt/ws/addr/target/test-classes
[INFO] [surefire:test]
[INFO] Surefire report directory: /x1/continuum/working-directory/216/rt/ws/addr/target/surefire-reports

-------------------------------------------------------
 T E S T S
-------------------------------------------------------
Running org.apache.cxf.ws.addressing.AddressingBuilderImplTest
Tests run: 2, Failures: 0, Errors: 0, Skipped: 0, Time elapsed: 0.174 sec
Running org.apache.cxf.ws.addressing.soap.MAPCodecTest
Tests run: 12, Failures: 0, Errors: 0, Skipped: 0, Time elapsed: 1.352 sec
Running org.apache.cxf.ws.addressing.spring.WSAFeatureXmlTest
Tests run: 1, Failures: 0, Errors: 0, Skipped: 0, Time elapsed: 7.954 sec
Running org.apache.cxf.ws.addressing.AddressingConstantsImplTest
Tests run: 31, Failures: 0, Errors: 0, Skipped: 0, Time elapsed: 0.306 sec
Running org.apache.cxf.ws.addressing.AddressingBuilderTest
Tests run: 1, Failures: 0, Errors: 0, Skipped: 0, Time elapsed: 0.012 sec
Running org.apache.cxf.ws.addressing.MAPAggregatorTest
Tests run: 24, Failures: 0, Errors: 0, Skipped: 0, Time elapsed: 1.347 sec
Running org.apache.cxf.ws.addressing.spring.WSAFeatureTest
Tests run: 1, Failures: 0, Errors: 0, Skipped: 0, Time elapsed: 1.376 sec

Results :

Tests run: 72, Failures: 0, Errors: 0, Skipped: 0

[INFO] [jar:jar]
[INFO] Building jar: /x1/continuum/working-directory/216/rt/ws/addr/target/cxf-rt-ws-addr-2.1-incubator-SNAPSHOT.jar
[INFO] [install:install]
[INFO] Installing /x1/continuum/working-directory/216/rt/ws/addr/target/cxf-rt-ws-addr-2.1-incubator-SNAPSHOT.jar to /home/continuum/.m2/repository/org/apache/cxf/cxf-rt-ws-addr/2.1-incubator-SNAPSHOT/cxf-rt-ws-addr-2.1-incubator-SNAPSHOT.jar
[INFO] ----------------------------------------------------------------------------
[INFO] Building Apache CXF Runtime WS Reliable Messaging
[INFO]    task-segment: [clean, install]
[INFO] ----------------------------------------------------------------------------
[INFO] [clean:clean]
[INFO] Deleting directory /x1/continuum/working-directory/216/rt/ws/rm/target
[INFO] Deleting directory /x1/continuum/working-directory/216/rt/ws/rm/target/classes
[INFO] Deleting directory /x1/continuum/working-directory/216/rt/ws/rm/target/test-classes
[INFO] [cobertura:clean {execution: default}]
[INFO] [checkstyle:checkstyle {execution: validate}]
[INFO] Starting audit...
Audit done.

[INFO] Preparing pmd:check
[INFO] [pmd:pmd]
[INFO] [pmd:check {execution: validate}]
[INFO] 
[INFO] [cxf-common-xsd:xsdtojava {execution: generate-sources}]
[INFO] [remote-resources:process {execution: default}]
[INFO] [resources:resources]
[INFO] Using default encoding to copy filtered resources.
[INFO] [compiler:compile]
[INFO] Compiling 65 source files to /x1/continuum/working-directory/216/rt/ws/rm/target/classes
[INFO] [resources:testResources]
[INFO] Using default encoding to copy filtered resources.
[INFO] [compiler:testCompile]
[INFO] Compiling 20 source files to /x1/continuum/working-directory/216/rt/ws/rm/target/test-classes
[INFO] [surefire:test]
[INFO] Surefire report directory: /x1/continuum/working-directory/216/rt/ws/rm/target/surefire-reports

-------------------------------------------------------
 T E S T S
-------------------------------------------------------
Running org.apache.cxf.ws.rm.RMUtilsTest
Tests run: 1, Failures: 0, Errors: 0, Skipped: 0, Time elapsed: 1.425 sec
Running org.apache.cxf.ws.rm.AbstractRMInterceptorTest
Tests run: 5, Failures: 0, Errors: 0, Skipped: 0, Time elapsed: 1.193 sec
Running org.apache.cxf.ws.rm.RMManagerConfigurationTest
Tests run: 1, Failures: 0, Errors: 0, Skipped: 0, Time elapsed: 5.503 sec
Running org.apache.cxf.ws.rm.persistence.PersistenceUtilsTest
Tests run: 1, Failures: 0, Errors: 0, Skipped: 0, Time elapsed: 0.622 sec
Running org.apache.cxf.ws.rm.AbstractEndpointTest
Tests run: 2, Failures: 0, Errors: 0, Skipped: 0, Time elapsed: 0.178 sec
Running org.apache.cxf.ws.rm.DestinationSequenceTest
Tests run: 25, Failures: 0, Errors: 0, Skipped: 0, Time elapsed: 3.575 sec
Running org.apache.cxf.ws.rm.RMContextUtilsTest
Tests run: 10, Failures: 0, Errors: 0, Skipped: 0, Time elapsed: 0.145 sec
Running org.apache.cxf.ws.rm.RMManagerTest
Tests run: 19, Failures: 0, Errors: 0, Skipped: 0, Time elapsed: 1.17 sec
Running org.apache.cxf.ws.rm.AbstractSequenceTest
Tests run: 1, Failures: 0, Errors: 0, Skipped: 0, Time elapsed: 0.01 sec
Running org.apache.cxf.ws.rm.policy.PolicyUtilsTest
Tests run: 3, Failures: 0, Errors: 0, Skipped: 0, Time elapsed: 0.013 sec
Running org.apache.cxf.ws.rm.soap.SoapFaultFactoryTest
Tests run: 6, Failures: 0, Errors: 0, Skipped: 0, Time elapsed: 0.762 sec
Running org.apache.cxf.ws.rm.RMEndpointTest
Tests run: 18, Failures: 0, Errors: 0, Skipped: 0, Time elapsed: 1.173 sec
Running org.apache.cxf.ws.rm.soap.RMSoapInterceptorTest
Tests run: 8, Failures: 0, Errors: 0, Skipped: 0, Time elapsed: 0.996 sec
Running org.apache.cxf.ws.rm.ProxyTest
Tests run: 12, Failures: 0, Errors: 0, Skipped: 0, Time elapsed: 0.404 sec
Running org.apache.cxf.ws.rm.DestinationTest
Tests run: 7, Failures: 0, Errors: 0, Skipped: 0, Time elapsed: 0.301 sec
Running org.apache.cxf.ws.rm.RMInInterceptorTest
Tests run: 13, Failures: 0, Errors: 0, Skipped: 0, Time elapsed: 0.197 sec
Running org.apache.cxf.ws.rm.RMOutInterceptorTest
Tests run: 5, Failures: 0, Errors: 0, Skipped: 0, Time elapsed: 0.073 sec
Running org.apache.cxf.ws.rm.persistence.jdbc.RMTxStoreTest
Tests run: 9, Failures: 0, Errors: 0, Skipped: 0, Time elapsed: 10.929 sec
Running org.apache.cxf.ws.rm.soap.RetransmissionQueueImplTest
Tests run: 10, Failures: 0, Errors: 0, Skipped: 0, Time elapsed: 0.307 sec
Running org.apache.cxf.ws.rm.SourceSequenceTest
Tests run: 8, Failures: 0, Errors: 0, Skipped: 0, Time elapsed: 1.093 sec

Results :

Tests run: 164, Failures: 0, Errors: 0, Skipped: 0

[INFO] [jar:jar]
[INFO] Building jar: /x1/continuum/working-directory/216/rt/ws/rm/target/cxf-rt-ws-rm-2.1-incubator-SNAPSHOT.jar
[INFO] [install:install]
[INFO] Installing /x1/continuum/working-directory/216/rt/ws/rm/target/cxf-rt-ws-rm-2.1-incubator-SNAPSHOT.jar to /home/continuum/.m2/repository/org/apache/cxf/cxf-rt-ws-rm/2.1-incubator-SNAPSHOT/cxf-rt-ws-rm-2.1-incubator-SNAPSHOT.jar
[INFO] ----------------------------------------------------------------------------
[INFO] Building Apache CXF Runtime WS Security
[INFO]    task-segment: [clean, install]
[INFO] ----------------------------------------------------------------------------
[INFO] [clean:clean]
[INFO] Deleting directory /x1/continuum/working-directory/216/rt/ws/security/target
[INFO] Deleting directory /x1/continuum/working-directory/216/rt/ws/security/target/classes
[INFO] Deleting directory /x1/continuum/working-directory/216/rt/ws/security/target/test-classes
[INFO] [checkstyle:checkstyle {execution: validate}]
[INFO] Starting audit...
Audit done.

[INFO] Preparing pmd:check
[INFO] [pmd:pmd]
[INFO] [pmd:check {execution: validate}]
[INFO] 
Downloading: http://repo1.maven.org/maven2/wss4j/wss4j/1.5.1/wss4j-1.5.1.pom
Downloading: http://repo1.maven.org/maven2/xml-security/xmlsec/1.3.0/xmlsec-1.3.0.pom
[INFO] [remote-resources:process {execution: default}]
[INFO] [resources:resources]
[INFO] Using default encoding to copy filtered resources.
[INFO] [compiler:compile]
[INFO] Compiling 3 source files to /x1/continuum/working-directory/216/rt/ws/security/target/classes
[INFO] [resources:testResources]
[INFO] Using default encoding to copy filtered resources.
[INFO] [compiler:testCompile]
[INFO] Compiling 7 source files to /x1/continuum/working-directory/216/rt/ws/security/target/test-classes
[INFO] [surefire:test]
[INFO] Surefire report directory: /x1/continuum/working-directory/216/rt/ws/security/target/surefire-reports

-------------------------------------------------------
 T E S T S
-------------------------------------------------------
Running org.apache.cxf.ws.security.wss4j.RoundTripTest
Tests run: 3, Failures: 0, Errors: 0, Skipped: 0, Time elapsed: 21.276 sec
Running org.apache.cxf.ws.security.wss4j.WSS4JInOutTest
Tests run: 3, Failures: 0, Errors: 0, Skipped: 0, Time elapsed: 2.252 sec
Running org.apache.cxf.ws.security.wss4j.WSS4JOutInterceptorTest
Tests run: 5, Failures: 0, Errors: 0, Skipped: 0, Time elapsed: 3.272 sec

Results :

Tests run: 11, Failures: 0, Errors: 0, Skipped: 0

[INFO] [jar:jar]
[INFO] Building jar: /x1/continuum/working-directory/216/rt/ws/security/target/cxf-rt-ws-security-2.1-incubator-SNAPSHOT.jar
[INFO] [install:install]
[INFO] Installing /x1/continuum/working-directory/216/rt/ws/security/target/cxf-rt-ws-security-2.1-incubator-SNAPSHOT.jar to /home/continuum/.m2/repository/org/apache/cxf/cxf-rt-ws-security/2.1-incubator-SNAPSHOT/cxf-rt-ws-security-2.1-incubator-SNAPSHOT.jar
[INFO] ----------------------------------------------------------------------------
[INFO] Building Apache CXF JBI Integration
[INFO]    task-segment: [clean, install]
[INFO] ----------------------------------------------------------------------------
[INFO] [clean:clean]
[INFO] Deleting directory /x1/continuum/working-directory/216/integration/jbi/target
[INFO] Deleting directory /x1/continuum/working-directory/216/integration/jbi/target/classes
[INFO] Deleting directory /x1/continuum/working-directory/216/integration/jbi/target/test-classes
[INFO] [checkstyle:checkstyle {execution: validate}]
[INFO] Starting audit...
Audit done.

[INFO] Preparing pmd:check
[INFO] [pmd:pmd]
[INFO] [pmd:check {execution: validate}]
[INFO] 
[INFO] [remote-resources:process {execution: default}]
[INFO] [resources:resources]
[INFO] Using default encoding to copy filtered resources.
[INFO] [compiler:compile]
[INFO] Compiling 16 source files to /x1/continuum/working-directory/216/integration/jbi/target/classes
[INFO] [resources:testResources]
[INFO] Using default encoding to copy filtered resources.
[INFO] [compiler:testCompile]
[INFO] Compiling 6 source files to /x1/continuum/working-directory/216/integration/jbi/target/test-classes
[INFO] [surefire:test]
[INFO] Surefire report directory: /x1/continuum/working-directory/216/integration/jbi/target/surefire-reports

-------------------------------------------------------
 T E S T S
-------------------------------------------------------
Running org.apache.cxf.jbi.se.CXFServiceUnitManagerTest
Tests run: 20, Failures: 0, Errors: 0, Skipped: 0, Time elapsed: 16.028 sec
Running org.apache.cxf.jbi.se.CXFServiceUnitTest
Tests run: 6, Failures: 0, Errors: 0, Skipped: 0, Time elapsed: 3.836 sec
Running org.apache.cxf.jbi.se.state.ServiceEngineShutdownTest
Tests run: 4, Failures: 0, Errors: 0, Skipped: 0, Time elapsed: 0.046 sec
Running org.apache.cxf.jbi.se.state.ServiceEngineStartTest
Tests run: 4, Failures: 0, Errors: 0, Skipped: 0, Time elapsed: 0.033 sec
Running org.apache.cxf.jbi.se.state.ServiceEngineStateFactoryTest
Tests run: 2, Failures: 0, Errors: 0, Skipped: 0, Time elapsed: 0.023 sec
Running org.apache.cxf.jbi.se.state.ServiceEngineStopTest
Tests run: 4, Failures: 0, Errors: 0, Skipped: 0, Time elapsed: 0.044 sec

Results :

Tests run: 40, Failures: 0, Errors: 0, Skipped: 0

[INFO] [jar:jar]
[INFO] Building jar: /x1/continuum/working-directory/216/integration/jbi/target/cxf-integration-jbi-2.1-incubator-SNAPSHOT.jar
[INFO] [install:install]
[INFO] Installing /x1/continuum/working-directory/216/integration/jbi/target/cxf-integration-jbi-2.1-incubator-SNAPSHOT.jar to /home/continuum/.m2/repository/org/apache/cxf/cxf-integration-jbi/2.1-incubator-SNAPSHOT/cxf-integration-jbi-2.1-incubator-SNAPSHOT.jar
[INFO] ----------------------------------------------------------------------------
[INFO] Building Apache CXF JCA Connection
[INFO]    task-segment: [clean, install]
[INFO] ----------------------------------------------------------------------------
[INFO] [clean:clean]
[INFO] Deleting directory /x1/continuum/working-directory/216/integration/jca/target
[INFO] Deleting directory /x1/continuum/working-directory/216/integration/jca/target/classes
[INFO] Deleting directory /x1/continuum/working-directory/216/integration/jca/target/test-classes
[INFO] [checkstyle:checkstyle {execution: validate}]
[INFO] Starting audit...
Audit done.

[INFO] Preparing pmd:check
[INFO] [pmd:pmd]
[INFO] [pmd:check {execution: validate}]
[INFO] 
[INFO] [remote-resources:process {execution: default}]
[INFO] [resources:resources]
[INFO] Using default encoding to copy filtered resources.
[INFO] [compiler:compile]
[INFO] Compiling 35 source files to /x1/continuum/working-directory/216/integration/jca/target/classes
[INFO] [resources:testResources]
[INFO] Using default encoding to copy filtered resources.
[INFO] [compiler:testCompile]
[INFO] Compiling 35 source files to /x1/continuum/working-directory/216/integration/jca/target/test-classes
[INFO] [surefire:test]
[INFO] Surefire report directory: /x1/continuum/working-directory/216/integration/jca/target/surefire-reports

-------------------------------------------------------
 T E S T S
-------------------------------------------------------
Running org.apache.cxf.jca.servant.CXFConnectEJBServantTest
Tests run: 2, Failures: 0, Errors: 0, Skipped: 0, Time elapsed: 1.667 sec
Running org.apache.cxf.jca.core.logging.LoggerHelperTest
Tests run: 3, Failures: 0, Errors: 0, Skipped: 0, Time elapsed: 0.177 sec
Running org.apache.cxf.jca.cxf.handlers.ObjectMethodInvocationHandlerTest
Tests run: 10, Failures: 0, Errors: 0, Skipped: 0, Time elapsed: 0.705 sec
Running org.apache.cxf.jca.core.classloader.PlugInClassLoaderTest
Tests run: 10, Failures: 0, Errors: 0, Skipped: 0, Time elapsed: 0.214 sec
Running org.apache.cxf.jca.cxf.handlers.InvocationHandlerFactoryTest
Tests run: 2, Failures: 0, Errors: 0, Skipped: 0, Time elapsed: 0.023 sec
Running org.apache.cxf.jca.cxf.ConnectionFactoryImplTest
Tests run: 7, Failures: 0, Errors: 0, Skipped: 0, Time elapsed: 0.216 sec
Running org.apache.cxf.jca.cxf.AssociatedManagedConnectionFactoryImplTest
Tests run: 22, Failures: 0, Errors: 0, Skipped: 0, Time elapsed: 7.241 sec
Running org.apache.cxf.jca.core.resourceadapter.HandlerTest
Tests run: 2, Failures: 0, Errors: 0, Skipped: 0, Time elapsed: 0.03 sec
Running org.apache.cxf.jca.core.resourceadapter.ResourceAdapterInternalExceptionTest
Tests run: 9, Failures: 0, Errors: 0, Skipped: 0, Time elapsed: 0.097 sec
Running org.apache.cxf.jca.cxf.handlers.ProxyInvocationHandlerTest
Tests run: 6, Failures: 0, Errors: 0, Skipped: 0, Time elapsed: 1.043 sec
Running org.apache.cxf.jca.cxf.ManagedConnectionFactoryImplTest
Tests run: 18, Failures: 0, Errors: 0, Skipped: 0, Time elapsed: 1.331 sec
Running org.apache.cxf.jca.core.resourceadapter.ResourceBeanTest
Tests run: 1, Failures: 0, Errors: 0, Skipped: 0, Time elapsed: 0.026 sec
Running org.apache.cxf.jca.cxf.handlers.InvokingInvocationHandlerTest
Tests run: 6, Failures: 0, Errors: 0, Skipped: 0, Time elapsed: 0.046 sec
Running org.apache.cxf.jca.jarloader.JarLoaderTest
Tests run: 2, Failures: 0, Errors: 0, Skipped: 0, Time elapsed: 0.021 sec
Running org.apache.cxf.jca.core.resourceadapter.ManagedConnectionFactoryImplTest
Tests run: 8, Failures: 0, Errors: 0, Skipped: 0, Time elapsed: 0.376 sec
Running org.apache.cxf.jca.cxf.JCABusFactoryTest
Tests run: 13, Failures: 0, Errors: 0, Skipped: 0, Time elapsed: 9.547 sec
Running org.apache.cxf.jca.core.resourceadapter.ManagedConnectionImplTest
Tests run: 13, Failures: 0, Errors: 0, Skipped: 0, Time elapsed: 0.083 sec
Running org.apache.cxf.jca.core.resourceadapter.UriHandlerInitTest
Tests run: 1, Failures: 0, Errors: 0, Skipped: 0, Time elapsed: 0.006 sec
Running org.apache.cxf.jca.cxf.ManagedConnectionImplTest
Jul 3, 2007 7:27:17 AM org.apache.cxf.jca.core.resourceadapter.ResourceAdapterInternalException <init>
WARNING: javax.xml.ws.WebServiceException: Service endpoint interface class org.apache.cxf.jca.cxf.Foo does not have a javax.jws.WebService annotation.
Jul 3, 2007 7:27:25 AM org.apache.cxf.jca.core.resourceadapter.ResourceAdapterInternalException <init>
WARNING: java.lang.ClassCastException: $Proxy55
Tests run: 12, Failures: 0, Errors: 0, Skipped: 0, Time elapsed: 10.294 sec
Running org.apache.cxf.jca.cxf.CXFConnectionRequestInfoTest
Tests run: 1, Failures: 0, Errors: 0, Skipped: 0, Time elapsed: 0.018 sec
Running org.apache.cxf.jca.cxf.ResourceAdapterImplTest
Tests run: 9, Failures: 0, Errors: 0, Skipped: 0, Time elapsed: 0.146 sec

Results :

Tests run: 157, Failures: 0, Errors: 0, Skipped: 0

[INFO] [jar:jar]
[INFO] Building jar: /x1/continuum/working-directory/216/integration/jca/target/cxf-integration-jca-2.1-incubator-SNAPSHOT.jar
[INFO] [install:install]
[INFO] Installing /x1/continuum/working-directory/216/integration/jca/target/cxf-integration-jca-2.1-incubator-SNAPSHOT.jar to /home/continuum/.m2/repository/org/apache/cxf/cxf-integration-jca/2.1-incubator-SNAPSHOT/cxf-integration-jca-2.1-incubator-SNAPSHOT.jar
[INFO] ----------------------------------------------------------------------------
[INFO] Building Apache CXF Integration
[INFO]    task-segment: [clean, install]
[INFO] ----------------------------------------------------------------------------
[INFO] [clean:clean]
[INFO] Deleting directory /x1/continuum/working-directory/216/integration/target
[INFO] Deleting directory /x1/continuum/working-directory/216/integration/target/classes
[INFO] Deleting directory /x1/continuum/working-directory/216/integration/target/test-classes
[INFO] [site:attach-descriptor]
[INFO] [install:install]
[INFO] Installing /x1/continuum/working-directory/216/integration/pom.xml to /home/continuum/.m2/repository/org/apache/cxf/cxf-integration/2.1-incubator-SNAPSHOT/cxf-integration-2.1-incubator-SNAPSHOT.pom
[INFO] ----------------------------------------------------------------------------
[INFO] Building Apache CXF System Tests
[INFO]    task-segment: [clean, install]
[INFO] ----------------------------------------------------------------------------
[INFO] [clean:clean]
[INFO] Deleting directory /x1/continuum/working-directory/216/systests/target
[INFO] Deleting directory /x1/continuum/working-directory/216/systests/target/classes
[INFO] Deleting directory /x1/continuum/working-directory/216/systests/target/test-classes
[INFO] [checkstyle:checkstyle {execution: validate}]
[INFO] Starting audit...
Audit done.

[INFO] Preparing pmd:check
[INFO] [pmd:pmd]
[INFO] [pmd:check {execution: validate}]
[INFO] 
[INFO] [remote-resources:process {execution: default}]
[INFO] [resources:resources]
[INFO] Using default encoding to copy filtered resources.
[INFO] [compiler:compile]
[INFO] No sources to compile
[INFO] [resources:testResources]
[INFO] Using default encoding to copy filtered resources.
[INFO] [compiler:testCompile]
[INFO] Compiling 215 source files to /x1/continuum/working-directory/216/systests/target/test-classes
[INFO] [surefire:test]
[INFO] Surefire report directory: /x1/continuum/working-directory/216/systests/target/surefire-reports

-------------------------------------------------------
 T E S T S
-------------------------------------------------------
Running org.apache.cxf.systest.provider.AttachmentProviderXMLClientServerTest
Tests run: 1, Failures: 0, Errors: 0, Skipped: 0, Time elapsed: 10.15 sec

Results :

Tests run: 1, Failures: 0, Errors: 0, Skipped: 0


-------------------------------------------------------
 T E S T S
-------------------------------------------------------
Running org.apache.cxf.systest.jaxws.ClientServerMiscTest
Tests run: 4, Failures: 0, Errors: 0, Skipped: 0, Time elapsed: 49.384 sec

Results :

Tests run: 5, Failures: 0, Errors: 0, Skipped: 0


-------------------------------------------------------
 T E S T S
-------------------------------------------------------
Running org.apache.cxf.systest.ws.addressing.MAPTest
Tests run: 9, Failures: 0, Errors: 0, Skipped: 2, Time elapsed: 69.378 sec

Results :

Tests run: 14, Failures: 0, Errors: 0, Skipped: 2


-------------------------------------------------------
 T E S T S
-------------------------------------------------------
Running org.apache.cxf.systest.management.CountersClientServerTest
*********  greetMeOneWay: hello
Tests run: 1, Failures: 0, Errors: 0, Skipped: 0, Time elapsed: 40.524 sec

Results :

Tests run: 15, Failures: 0, Errors: 0, Skipped: 2


-------------------------------------------------------
 T E S T S
-------------------------------------------------------
Running org.apache.cxf.systest.coloc.ColocWrappedDocLitTest
*********  greetMeOneWay: oneWay
*********  greetMeOneWay: oneWay
Tests run: 4, Failures: 0, Errors: 0, Skipped: 0, Time elapsed: 48.281 sec

Results :

Tests run: 19, Failures: 0, Errors: 0, Skipped: 2


-------------------------------------------------------
 T E S T S
-------------------------------------------------------
Running org.apache.cxf.systest.dispatch.DispatchClientServerTest
Tests run: 8, Failures: 0, Errors: 0, Skipped: 0, Time elapsed: 40.875 sec

Results :

Tests run: 27, Failures: 0, Errors: 0, Skipped: 2


-------------------------------------------------------
 T E S T S
-------------------------------------------------------
Running org.apache.cxf.systest.factory_pattern.ManualHttpMulitplexClientServerTest
Tests run: 2, Failures: 0, Errors: 0, Skipped: 0, Time elapsed: 38.913 sec

Results :

Tests run: 29, Failures: 0, Errors: 0, Skipped: 2


-------------------------------------------------------
 T E S T S
-------------------------------------------------------
Running org.apache.cxf.systest.mtom.MtomServerTest
Tests run: 2, Failures: 0, Errors: 0, Skipped: 0, Time elapsed: 24.369 sec

Results :

Tests run: 31, Failures: 0, Errors: 0, Skipped: 2


-------------------------------------------------------
 T E S T S
-------------------------------------------------------
Running org.apache.cxf.systest.jaxws.ClientServerXMLTest
Tests run: 7, Failures: 0, Errors: 0, Skipped: 0, Time elapsed: 58.205 sec

Results :

Tests run: 38, Failures: 0, Errors: 0, Skipped: 2


-------------------------------------------------------
 T E S T S
-------------------------------------------------------
Running org.apache.cxf.systest.jaxb.TestServiceTest
Class: class org.apache.cxf.systest.jaxb.model.ExtendedWidget
Class: class org.apache.cxf.systest.jaxb.model.ExtendedWidget
org.apache.cxf.systest.jaxb.model.ExtendedWidget@11c55bb[id=42,name=blah,serialNumber=blah,broken=true,extended=true]
Tests run: 1, Failures: 0, Errors: 0, Skipped: 0, Time elapsed: 22.73 sec

Results :

Tests run: 39, Failures: 0, Errors: 0, Skipped: 2


-------------------------------------------------------
 T E S T S
-------------------------------------------------------
Running org.apache.cxf.systest.coloc.ColocHeaderRpcLitTest
Tests run: 7, Failures: 0, Errors: 0, Skipped: 0, Time elapsed: 51.946 sec

Results :

Tests run: 46, Failures: 0, Errors: 0, Skipped: 2


-------------------------------------------------------
 T E S T S
-------------------------------------------------------
Running org.apache.cxf.systest.jaxws.ClientServerMixedStyleTest
Tests run: 1, Failures: 0, Errors: 0, Skipped: 0, Time elapsed: 35.219 sec

Results :

Tests run: 47, Failures: 0, Errors: 0, Skipped: 2


-------------------------------------------------------
 T E S T S
-------------------------------------------------------
Running org.apache.cxf.systest.rest.RestClientServerBookTest
Tests run: 2, Failures: 0, Errors: 0, Skipped: 0, Time elapsed: 33.82 sec

Results :

Tests run: 49, Failures: 0, Errors: 0, Skipped: 2


-------------------------------------------------------
 T E S T S
-------------------------------------------------------
Running org.apache.cxf.systest.servlet.SpringServletTest
Tests run: 3, Failures: 0, Errors: 0, Skipped: 0, Time elapsed: 15.439 sec

Results :

Tests run: 52, Failures: 0, Errors: 0, Skipped: 2


-------------------------------------------------------
 T E S T S
-------------------------------------------------------
Running org.apache.cxf.systest.type_test.soap.SOAPRpcLitClientTypeTest
Tests run: 176, Failures: 0, Errors: 0, Skipped: 0, Time elapsed: 51.506 sec

Results :

Tests run: 228, Failures: 0, Errors: 0, Skipped: 2


-------------------------------------------------------
 T E S T S
-------------------------------------------------------
Running org.apache.cxf.systest.coloc.ColocHeaderDocLitTest
Tests run: 5, Failures: 0, Errors: 0, Skipped: 0, Time elapsed: 25.358 sec

Results :

Tests run: 233, Failures: 0, Errors: 0, Skipped: 2


-------------------------------------------------------
 T E S T S
-------------------------------------------------------
Running org.apache.cxf.systest.mtom.MtomPolicyTest
Tests run: 2, Failures: 0, Errors: 0, Skipped: 0, Time elapsed: 14.314 sec

Results :

Tests run: 235, Failures: 0, Errors: 0, Skipped: 2


-------------------------------------------------------
 T E S T S
-------------------------------------------------------
Running org.apache.cxf.systest.ws.rm.ServerPersistenceTest
Tests run: 1, Failures: 0, Errors: 0, Skipped: 0, Time elapsed: 79.926 sec

Results :

Tests run: 236, Failures: 0, Errors: 0, Skipped: 2


-------------------------------------------------------
 T E S T S
-------------------------------------------------------
Running org.apache.cxf.systest.ws.policy.HTTPClientPolicyTest
Tests run: 1, Failures: 0, Errors: 0, Skipped: 0, Time elapsed: 28.54 sec

Results :

Tests run: 237, Failures: 0, Errors: 0, Skipped: 2


-------------------------------------------------------
 T E S T S
-------------------------------------------------------
Running org.apache.cxf.systest.handlers.DispatchHandlerInvocationTest
-------------
<?xml version="1.0" encoding="utf-8"?><!--
  Licensed to the Apache Software Foundation (ASF) under one
  or more contributor license agreements. See the NOTICE file
  distributed with this work for additional information
  regarding copyright ownership. The ASF licenses this file
  to you under the Apache License, Version 2.0 (the
  "License"); you may not use this file except in compliance
  with the License. You may obtain a copy of the License at

  http://www.apache.org/licenses/LICENSE-2.0

  Unless required by applicable law or agreed to in writing,
  software distributed under the License is distributed on an
  "AS IS" BASIS, WITHOUT WARRANTIES OR CONDITIONS OF ANY
  KIND, either express or implied. See the License for the
  specific language governing permissions and limitations
  under the License.
--><ns2:greetMe xmlns:ns2="http://apache.org/hello_world_xml_http/wrapped/types" xmlns="http://www.w3.org/2005/02/addressing/wsdl">
	<ns2:requestType>tli</ns2:requestType>
</ns2:greetMe>-------------
<?xml version="1.0" encoding="utf-8"?><greetMeResponse xmlns="http://apache.org/hello_world_xml_http/wrapped/types"><responseType>Hello tli</responseType></greetMeResponse>-------------
<?xml version="1.0" encoding="utf-8"?><!--
  Licensed to the Apache Software Foundation (ASF) under one
  or more contributor license agreements. See the NOTICE file
  distributed with this work for additional information
  regarding copyright ownership. The ASF licenses this file
  to you under the Apache License, Version 2.0 (the
  "License"); you may not use this file except in compliance
  with the License. You may obtain a copy of the License at

  http://www.apache.org/licenses/LICENSE-2.0

  Unless required by applicable law or agreed to in writing,
  software distributed under the License is distributed on an
  "AS IS" BASIS, WITHOUT WARRANTIES OR CONDITIONS OF ANY
  KIND, either express or implied. See the License for the
  specific language governing permissions and limitations
  under the License.
--><ns2:greetMe xmlns:ns2="http://apache.org/hello_world_xml_http/wrapped/types" xmlns="http://www.w3.org/2005/02/addressing/wsdl">
	<ns2:requestType>tli</ns2:requestType>
</ns2:greetMe>-------------
<?xml version="1.0" encoding="utf-8"?><greetMeResponse xmlns="http://apache.org/hello_world_xml_http/wrapped/types"><responseType>Hello tli</responseType></greetMeResponse>-------------
<?xml version="1.0" encoding="utf-8"?><greetMe xmlns="http://apache.org/hello_world_xml_http/wrapped/types"><requestType>tli</requestType></greetMe>-------------
<?xml version="1.0" encoding="utf-8"?><greetMeResponse xmlns="http://apache.org/hello_world_xml_http/wrapped/types"><responseType>Hello tli</responseType></greetMeResponse>-------------
<?xml version="1.0" encoding="utf-8"?><greetMe xmlns="http://apache.org/hello_world_xml_http/wrapped/types"><requestType>tli</requestType></greetMe>-------------
<?xml version="1.0" encoding="utf-8"?><greetMeResponse xmlns="http://apache.org/hello_world_xml_http/wrapped/types"><responseType>Hello tli</responseType></greetMeResponse>Tests run: 11, Failures: 0, Errors: 0, Skipped: 0, Time elapsed: 42.646 sec

Results :

Tests run: 248, Failures: 0, Errors: 0, Skipped: 2


-------------------------------------------------------
 T E S T S
-------------------------------------------------------
Running org.apache.cxf.systest.basicDOCBare.DOCBareClientServerTest
Tests run: 2, Failures: 0, Errors: 0, Skipped: 0, Time elapsed: 28.152 sec

Results :

Tests run: 250, Failures: 0, Errors: 0, Skipped: 2


-------------------------------------------------------
 T E S T S
-------------------------------------------------------
Running org.apache.cxf.systest.provider.datasource.DataSourceProviderTest
Tests run: 2, Failures: 0, Errors: 0, Skipped: 0, Time elapsed: 37.901 sec

Results :

Tests run: 252, Failures: 0, Errors: 0, Skipped: 2


-------------------------------------------------------
 T E S T S
-------------------------------------------------------
Running org.apache.cxf.systest.ws.policy.AddressingInlinePolicyTest
Tests run: 1, Failures: 0, Errors: 0, Skipped: 0, Time elapsed: 71.411 sec

Results :

Tests run: 253, Failures: 0, Errors: 0, Skipped: 2


-------------------------------------------------------
 T E S T S
-------------------------------------------------------
Running org.apache.cxf.systest.dispatch.DispatchXMLClientServerTest
Tests run: 3, Failures: 0, Errors: 0, Skipped: 0, Time elapsed: 27.784 sec

Results :

Tests run: 256, Failures: 0, Errors: 0, Skipped: 2


-------------------------------------------------------
 T E S T S
-------------------------------------------------------
Running org.apache.cxf.systest.handlers.HandlerInvocationUsingAddNumbersTest
Tests run: 5, Failures: 0, Errors: 0, Skipped: 0, Time elapsed: 48.634 sec

Results :

Tests run: 261, Failures: 0, Errors: 0, Skipped: 2


-------------------------------------------------------
 T E S T S
-------------------------------------------------------
Running org.apache.cxf.systest.type_test.soap.SOAPDocLitClientTypeTest
Tests run: 176, Failures: 0, Errors: 0, Skipped: 0, Time elapsed: 77.458 sec

Results :

Tests run: 437, Failures: 0, Errors: 0, Skipped: 2


-------------------------------------------------------
 T E S T S
-------------------------------------------------------
Running org.apache.cxf.systest.ws.rm.DecoupledBareTest
Tests run: 1, Failures: 0, Errors: 0, Skipped: 0, Time elapsed: 64.591 sec

Results :

Tests run: 438, Failures: 0, Errors: 0, Skipped: 2


-------------------------------------------------------
 T E S T S
-------------------------------------------------------
Running org.apache.cxf.systest.jaxws.LocatorClientServerTest
Tests run: 1, Failures: 0, Errors: 0, Skipped: 0, Time elapsed: 56.096 sec

Results :

Tests run: 439, Failures: 0, Errors: 0, Skipped: 2


-------------------------------------------------------
 T E S T S
-------------------------------------------------------
Running org.apache.cxf.systest.provider.ProviderXMLClientServerTest
Tests run: 1, Failures: 0, Errors: 0, Skipped: 0, Time elapsed: 30.714 sec

Results :

Tests run: 440, Failures: 0, Errors: 0, Skipped: 2


-------------------------------------------------------
 T E S T S
-------------------------------------------------------
Running org.apache.cxf.systest.management.ManagedClientServerTest
the size is 1
Tests run: 1, Failures: 0, Errors: 0, Skipped: 0, Time elapsed: 40.797 sec

Results :

Tests run: 441, Failures: 0, Errors: 0, Skipped: 2


-------------------------------------------------------
 T E S T S
-------------------------------------------------------
Running org.apache.cxf.systest.handlers.HandlerInvocationTest
Tests run: 31, Failures: 0, Errors: 0, Skipped: 1, Time elapsed: 86.007 sec

Results :

Tests run: 472, Failures: 0, Errors: 0, Skipped: 3


-------------------------------------------------------
 T E S T S
-------------------------------------------------------
Running org.apache.cxf.systest.jaxws.ClientServerRPCLitTest
Tests run: 2, Failures: 0, Errors: 0, Skipped: 0, Time elapsed: 24.319 sec

Results :

Tests run: 474, Failures: 0, Errors: 0, Skipped: 3


-------------------------------------------------------
 T E S T S
-------------------------------------------------------
Running org.apache.cxf.systest.servlet.HttpBindingServletTest
Tests run: 2, Failures: 0, Errors: 0, Skipped: 0, Time elapsed: 12.002 sec

Results :

Tests run: 476, Failures: 0, Errors: 0, Skipped: 3


-------------------------------------------------------
 T E S T S
-------------------------------------------------------
Running org.apache.cxf.systest.management.ManagedBusTest
Tests run: 2, Failures: 0, Errors: 0, Skipped: 0, Time elapsed: 10.145 sec

Results :

Tests run: 478, Failures: 0, Errors: 0, Skipped: 3


-------------------------------------------------------
 T E S T S
-------------------------------------------------------
Running org.apache.cxf.systest.ws.policy.AddressingOptionalPolicyTest
Tests run: 2, Failures: 0, Errors: 0, Skipped: 0, Time elapsed: 67.814 sec

Results :

Tests run: 480, Failures: 0, Errors: 0, Skipped: 3


-------------------------------------------------------
 T E S T S
-------------------------------------------------------
Running org.apache.cxf.systest.bus.SpringBusFactoryTest
Tests run: 1, Failures: 0, Errors: 0, Skipped: 0, Time elapsed: 6.698 sec

Results :

Tests run: 481, Failures: 0, Errors: 0, Skipped: 3


-------------------------------------------------------
 T E S T S
-------------------------------------------------------
Running org.apache.cxf.systest.jaxws.ClientServerGreeterNoWsdlTest
Tests run: 2, Failures: 0, Errors: 0, Skipped: 0, Time elapsed: 39.989 sec

Results :

Tests run: 483, Failures: 0, Errors: 0, Skipped: 3


-------------------------------------------------------
 T E S T S
-------------------------------------------------------
Running org.apache.cxf.systest.ws.rm.ClientPersistenceTest
Tests run: 1, Failures: 0, Errors: 0, Skipped: 0, Time elapsed: 65.605 sec

Results :

Tests run: 484, Failures: 0, Errors: 0, Skipped: 3


-------------------------------------------------------
 T E S T S
-------------------------------------------------------
Running org.apache.cxf.systest.servlet.JsFrontEndServletTest
Tests run: 1, Failures: 0, Errors: 0, Skipped: 0, Time elapsed: 11.192 sec

Results :

Tests run: 485, Failures: 0, Errors: 0, Skipped: 3


-------------------------------------------------------
 T E S T S
-------------------------------------------------------
Running org.apache.cxf.systest.jaxws.ClientServerGreeterBaseTest
Tests run: 1, Failures: 0, Errors: 0, Skipped: 0, Time elapsed: 26.113 sec

Results :

Tests run: 486, Failures: 0, Errors: 0, Skipped: 3


-------------------------------------------------------
 T E S T S
-------------------------------------------------------
Running org.apache.cxf.systest.jbi.ClientServerTest
Tests run: 1, Failures: 0, Errors: 0, Skipped: 0, Time elapsed: 13.028 sec

Results :

Tests run: 487, Failures: 0, Errors: 0, Skipped: 3


-------------------------------------------------------
 T E S T S
-------------------------------------------------------
Running org.apache.cxf.systest.jaxws.JaxwsExecutorTest
Tests run: 1, Failures: 0, Errors: 0, Skipped: 0, Time elapsed: 27.87 sec

Results :

Tests run: 488, Failures: 0, Errors: 0, Skipped: 3


-------------------------------------------------------
 T E S T S
-------------------------------------------------------
Running org.apache.cxf.systest.ws.policy.RMPolicyTest
Tests run: 1, Failures: 0, Errors: 0, Skipped: 0, Time elapsed: 72.042 sec

Results :

Tests run: 489, Failures: 0, Errors: 0, Skipped: 3


-------------------------------------------------------
 T E S T S
-------------------------------------------------------
Running org.apache.cxf.systest.http.ClientServerSessionTest
Tests run: 2, Failures: 0, Errors: 0, Skipped: 0, Time elapsed: 61.714 sec

Results :

Tests run: 491, Failures: 0, Errors: 0, Skipped: 3


-------------------------------------------------------
 T E S T S
-------------------------------------------------------
Running org.apache.cxf.systest.ws.rm.SequenceTest
Tests run: 24, Failures: 0, Errors: 0, Skipped: 1, Time elapsed: 178.685 sec

Results :

Tests run: 515, Failures: 0, Errors: 0, Skipped: 4


-------------------------------------------------------
 T E S T S
-------------------------------------------------------
Running org.apache.cxf.systest.versioning.ClientServerVersioningTest
Tests run: 1, Failures: 0, Errors: 0, Skipped: 0, Time elapsed: 40.405 sec

Results :

Tests run: 516, Failures: 0, Errors: 0, Skipped: 4


-------------------------------------------------------
 T E S T S
-------------------------------------------------------
Running org.apache.cxf.systest.schema_validation.ValidationClientServerTest
Tests run: 1, Failures: 0, Errors: 0, Skipped: 0, Time elapsed: 42.933 sec

Results :

Tests run: 517, Failures: 0, Errors: 0, Skipped: 4


-------------------------------------------------------
 T E S T S
-------------------------------------------------------
Running org.apache.cxf.systest.js.JSClientServerTest
Tests run: 2, Failures: 0, Errors: 0, Skipped: 0, Time elapsed: 40.33 sec

Results :

Tests run: 519, Failures: 0, Errors: 0, Skipped: 4


-------------------------------------------------------
 T E S T S
-------------------------------------------------------
Running org.apache.cxf.systest.jaxws.ClientServerRPCLitDefatulAnnoTest
Tests run: 1, Failures: 0, Errors: 0, Skipped: 0, Time elapsed: 34.551 sec

Results :

Tests run: 520, Failures: 0, Errors: 0, Skipped: 4


-------------------------------------------------------
 T E S T S
-------------------------------------------------------
Running org.apache.cxf.systest.lifecycle.LifeCycleTest
Tests run: 2, Failures: 0, Errors: 0, Skipped: 0, Time elapsed: 29.311 sec

Results :

Tests run: 522, Failures: 0, Errors: 0, Skipped: 4


-------------------------------------------------------
 T E S T S
-------------------------------------------------------
Running org.apache.cxf.systest.ws.policy.HTTPServerPolicyTest
Tests run: 1, Failures: 0, Errors: 0, Skipped: 0, Time elapsed: 59.601 sec

Results :

Tests run: 523, Failures: 0, Errors: 0, Skipped: 4


-------------------------------------------------------
 T E S T S
-------------------------------------------------------
Running org.apache.cxf.systest.provider.ProviderRPCClientServerTest
Tests run: 6, Failures: 0, Errors: 0, Skipped: 0, Time elapsed: 40.216 sec

Results :

Tests run: 529, Failures: 0, Errors: 0, Skipped: 4


-------------------------------------------------------
 T E S T S
-------------------------------------------------------
Running org.apache.cxf.systest.jca.OutBoundConnectionTest
Tests run: 1, Failures: 0, Errors: 0, Skipped: 0, Time elapsed: 39.174 sec

Results :

Tests run: 530, Failures: 0, Errors: 0, Skipped: 4


-------------------------------------------------------
 T E S T S
-------------------------------------------------------
Running org.apache.cxf.systest.interceptor.InterceptorFaultTest
Tests run: 2, Failures: 0, Errors: 0, Skipped: 0, Time elapsed: 25.478 sec

Results :

Tests run: 532, Failures: 0, Errors: 0, Skipped: 4


-------------------------------------------------------
 T E S T S
-------------------------------------------------------
Running org.apache.cxf.systest.handlers.TrivialSOAPHandlerTest
Tests run: 1, Failures: 0, Errors: 0, Skipped: 0, Time elapsed: 48.738 sec

Results :

Tests run: 533, Failures: 0, Errors: 0, Skipped: 4


-------------------------------------------------------
 T E S T S
-------------------------------------------------------
Running org.apache.cxf.systest.callback.CallbackClientServerTest
Tests run: 1, Failures: 0, Errors: 0, Skipped: 0, Time elapsed: 85.515 sec

Results :

Tests run: 534, Failures: 0, Errors: 0, Skipped: 4


-------------------------------------------------------
 T E S T S
-------------------------------------------------------
Running org.apache.cxf.systest.mtom.ClientMtomXopTest
Tests run: 1, Failures: 0, Errors: 0, Skipped: 0, Time elapsed: 63.354 sec

Results :

Tests run: 535, Failures: 0, Errors: 0, Skipped: 4


-------------------------------------------------------
 T E S T S
-------------------------------------------------------
Running org.apache.cxf.systest.clustering.FailoverTest
Tests run: 10, Failures: 0, Errors: 0, Skipped: 0, Time elapsed: 60.247 sec

Results :

Tests run: 545, Failures: 0, Errors: 0, Skipped: 4


-------------------------------------------------------
 T E S T S
-------------------------------------------------------
Running org.apache.cxf.systest.multitransport.MultiTransportClientServerTest
Tests run: 1, Failures: 0, Errors: 0, Skipped: 0, Time elapsed: 54.434 sec

Results :

Tests run: 546, Failures: 0, Errors: 0, Skipped: 4


-------------------------------------------------------
 T E S T S
-------------------------------------------------------
Running org.apache.cxf.systest.jms.JMSClientServerTest
Tests run: 5, Failures: 0, Errors: 0, Skipped: 0, Time elapsed: 43.717 sec

Results :

Tests run: 551, Failures: 0, Errors: 0, Skipped: 4


-------------------------------------------------------
 T E S T S
-------------------------------------------------------
Running org.apache.cxf.systest.jaxws.ClientServerGreeterBaseNoWsdlTest
Tests run: 1, Failures: 0, Errors: 0, Skipped: 0, Time elapsed: 33.565 sec

Results :

Tests run: 552, Failures: 0, Errors: 0, Skipped: 4


-------------------------------------------------------
 T E S T S
-------------------------------------------------------
Running org.apache.cxf.systest.factory_pattern.MultiplexClientServerTest
Tests run: 2, Failures: 0, Errors: 0, Skipped: 0, Time elapsed: 58.109 sec

Results :

Tests run: 554, Failures: 0, Errors: 0, Skipped: 4


-------------------------------------------------------
 T E S T S
-------------------------------------------------------
Running org.apache.cxf.systest.rest.RestClientServerTest
Tests run: 3, Failures: 0, Errors: 0, Skipped: 0, Time elapsed: 33.657 sec

Results :

Tests run: 557, Failures: 0, Errors: 0, Skipped: 4


-------------------------------------------------------
 T E S T S
-------------------------------------------------------
Running org.apache.cxf.systest.ws.rm.DecoupledClientServerTest
Tests run: 1, Failures: 0, Errors: 0, Skipped: 0, Time elapsed: 94.32 sec

Results :

Tests run: 558, Failures: 0, Errors: 0, Skipped: 4


-------------------------------------------------------
 T E S T S
-------------------------------------------------------
Running org.apache.cxf.systest.type_test.xml.XMLClientTypeTest
Tests run: 174, Failures: 0, Errors: 0, Skipped: 2, Time elapsed: 87.519 sec

Results :

Tests run: 732, Failures: 0, Errors: 0, Skipped: 6


-------------------------------------------------------
 T E S T S
-------------------------------------------------------
Running org.apache.cxf.systest.jaxws.AnyClientServerTest
Tests run: 2, Failures: 0, Errors: 0, Skipped: 0, Time elapsed: 33.79 sec

Results :

Tests run: 734, Failures: 0, Errors: 0, Skipped: 6


-------------------------------------------------------
 T E S T S
-------------------------------------------------------
Running org.apache.cxf.systest.jaxws.ClientServerTest
Bonjour
Tests run: 24, Failures: 0, Errors: 0, Skipped: 0, Time elapsed: 57.046 sec

Results :

Tests run: 758, Failures: 0, Errors: 0, Skipped: 6


-------------------------------------------------------
 T E S T S
-------------------------------------------------------
Running org.apache.cxf.systest.provider.ProviderClientServerTest
Tests run: 1, Failures: 0, Errors: 0, Skipped: 0, Time elapsed: 25.036 sec

Results :

Tests run: 759, Failures: 0, Errors: 0, Skipped: 6


-------------------------------------------------------
 T E S T S
-------------------------------------------------------
Running org.apache.cxf.systest.outofband.header.OOBHeaderTest
Tests run: 1, Failures: 0, Errors: 0, Skipped: 0, Time elapsed: 28.364 sec

Results :

Tests run: 760, Failures: 0, Errors: 0, Skipped: 6


-------------------------------------------------------
 T E S T S
-------------------------------------------------------
Running org.apache.cxf.systest.ws.policy.RMPolicyWsdlTest
Tests run: 1, Failures: 0, Errors: 0, Skipped: 0, Time elapsed: 104.167 sec

Results :

Tests run: 761, Failures: 0, Errors: 0, Skipped: 6


-------------------------------------------------------
 T E S T S
-------------------------------------------------------
Running org.apache.cxf.systest.soap12.Soap12ClientServerTest
Tests run: 5, Failures: 0, Errors: 0, Skipped: 0, Time elapsed: 37.623 sec

Results :

Tests run: 766, Failures: 0, Errors: 0, Skipped: 6


-------------------------------------------------------
 T E S T S
-------------------------------------------------------
Running org.apache.cxf.systest.ws.policy.AddressingPolicyTest
Tests run: 1, Failures: 0, Errors: 0, Skipped: 0, Time elapsed: 86.929 sec

Results :

Tests run: 767, Failures: 0, Errors: 0, Skipped: 6


-------------------------------------------------------
 T E S T S
-------------------------------------------------------
Running org.apache.cxf.systest.jaxws.OASISCatalogTest
Tests run: 4, Failures: 0, Errors: 0, Skipped: 0, Time elapsed: 9.943 sec

Results :

Tests run: 771, Failures: 0, Errors: 0, Skipped: 6


-------------------------------------------------------
 T E S T S
-------------------------------------------------------
Running org.apache.cxf.systest.ws.addressing.NonDecoupledTest
Tests run: 7, Failures: 0, Errors: 0, Skipped: 2, Time elapsed: 45.727 sec

Results :

Tests run: 778, Failures: 0, Errors: 0, Skipped: 8


-------------------------------------------------------
 T E S T S
-------------------------------------------------------
Running org.apache.cxf.systest.servlet.CXFServletTest
Tests run: 7, Failures: 0, Errors: 0, Skipped: 0, Time elapsed: 25.035 sec

Results :

Tests run: 785, Failures: 0, Errors: 0, Skipped: 8


-------------------------------------------------------
 T E S T S
-------------------------------------------------------
Running org.apache.cxf.systest.factory_pattern.MultiplexHttpAddressClientServerTest
Tests run: 2, Failures: 0, Errors: 0, Skipped: 0, Time elapsed: 29.488 sec

Results :

Tests run: 787, Failures: 0, Errors: 0, Skipped: 8


-------------------------------------------------------
 T E S T S
-------------------------------------------------------
Running org.apache.cxf.systest.rest.RestClientServerHttpBindingTest
Tests run: 2, Failures: 0, Errors: 0, Skipped: 0, Time elapsed: 38.253 sec

Results :

Tests run: 789, Failures: 0, Errors: 0, Skipped: 8


-------------------------------------------------------
 T E S T S
-------------------------------------------------------
Running org.apache.cxf.systest.http.HTTPConduitTest
Tests run: 10, Failures: 0, Errors: 0, Skipped: 0, Time elapsed: 54.531 sec

Results :

Tests run: 799, Failures: 0, Errors: 0, Skipped: 8


-------------------------------------------------------
 T E S T S
-------------------------------------------------------
Running org.apache.cxf.systest.servlet.ExternalServicesServletTest
Tests run: 1, Failures: 0, Errors: 0, Skipped: 0, Time elapsed: 11.09 sec

Results :

Tests run: 800, Failures: 0, Errors: 0, Skipped: 8


-------------------------------------------------------
 T E S T S
-------------------------------------------------------
Running org.apache.cxf.systest.swa.ClientServerSwaTest
Tests run: 4, Failures: 0, Errors: 0, Skipped: 0, Time elapsed: 48.246 sec

Results :

Tests run: 804, Failures: 0, Errors: 0, Skipped: 8

[INFO] [jar:jar]
[INFO] Building jar: /x1/continuum/working-directory/216/systests/target/cxf-systests-2.1-incubator-SNAPSHOT.jar
[INFO] [jar:test-jar {execution: attach-sources}]
[INFO] Building jar: /x1/continuum/working-directory/216/systests/target/cxf-systests-2.1-incubator-SNAPSHOT-tests.jar
[INFO] [install:install]
[INFO] Installing /x1/continuum/working-directory/216/systests/target/cxf-systests-2.1-incubator-SNAPSHOT.jar to /home/continuum/.m2/repository/org/apache/cxf/cxf-systests/2.1-incubator-SNAPSHOT/cxf-systests-2.1-incubator-SNAPSHOT.jar
[INFO] Installing /x1/continuum/working-directory/216/systests/target/cxf-systests-2.1-incubator-SNAPSHOT-tests.jar to /home/continuum/.m2/repository/org/apache/cxf/cxf-systests/2.1-incubator-SNAPSHOT/cxf-systests-2.1-incubator-SNAPSHOT-tests.jar
[INFO] ----------------------------------------------------------------------------
[INFO] Building Apache CXF Archetype - cxf-http-basic
[INFO]    task-segment: [clean, install]
[INFO] ----------------------------------------------------------------------------
[INFO] [clean:clean]
[INFO] Deleting directory /x1/continuum/working-directory/216/maven-plugins/archetypes/cxf-http-basic/target
[INFO] Deleting directory /x1/continuum/working-directory/216/maven-plugins/archetypes/cxf-http-basic/target/classes
[INFO] Deleting directory /x1/continuum/working-directory/216/maven-plugins/archetypes/cxf-http-basic/target/test-classes
[INFO] [checkstyle:checkstyle {execution: validate}]
[INFO] Starting audit...
Audit done.

[INFO] Preparing pmd:check
[INFO] [pmd:pmd]
[INFO] [pmd:check {execution: validate}]
[INFO] 
[INFO] [remote-resources:process {execution: default}]
[INFO] [resources:resources]
[INFO] Using default encoding to copy filtered resources.
[INFO] [compiler:compile]
[INFO] No sources to compile
[INFO] [resources:testResources]
[INFO] Using default encoding to copy filtered resources.
[INFO] [compiler:testCompile]
[INFO] Not compiling test sources
[INFO] [surefire:test]
[INFO] Tests are skipped.
[INFO] [jar:jar]
[INFO] Building jar: /x1/continuum/working-directory/216/maven-plugins/archetypes/cxf-http-basic/target/cxf-http-basic-2.1-incubator-SNAPSHOT.jar
[INFO] [install:install]
[INFO] Installing /x1/continuum/working-directory/216/maven-plugins/archetypes/cxf-http-basic/target/cxf-http-basic-2.1-incubator-SNAPSHOT.jar to /home/continuum/.m2/repository/org/apache/cxf/cxf-http-basic/2.1-incubator-SNAPSHOT/cxf-http-basic-2.1-incubator-SNAPSHOT.jar
[INFO] ----------------------------------------------------------------------------
[INFO] Building Apache CXF Maven Archetypes
[INFO]    task-segment: [clean, install]
[INFO] ----------------------------------------------------------------------------
[INFO] [clean:clean]
[INFO] Deleting directory /x1/continuum/working-directory/216/maven-plugins/archetypes/target
[INFO] Deleting directory /x1/continuum/working-directory/216/maven-plugins/archetypes/target/classes
[INFO] Deleting directory /x1/continuum/working-directory/216/maven-plugins/archetypes/target/test-classes
[INFO] [site:attach-descriptor]
[INFO] [install:install]
[INFO] Installing /x1/continuum/working-directory/216/maven-plugins/archetypes/pom.xml to /home/continuum/.m2/repository/org/apache/cxf/cxf-archetypes/2.1-incubator-SNAPSHOT/cxf-archetypes-2.1-incubator-SNAPSHOT.pom
[INFO] ----------------------------------------------------------------------------
[INFO] Building Apache CXF Eclipse Plugin Generator Maven2 Plugin
[INFO]    task-segment: [clean, install]
[INFO] ----------------------------------------------------------------------------
[INFO] [clean:clean]
[INFO] Deleting directory /x1/continuum/working-directory/216/maven-plugins/eclipse-plugin-generator/target
[INFO] Deleting directory /x1/continuum/working-directory/216/maven-plugins/eclipse-plugin-generator/target/classes
[INFO] Deleting directory /x1/continuum/working-directory/216/maven-plugins/eclipse-plugin-generator/target/test-classes
[INFO] [checkstyle:checkstyle {execution: validate}]
[INFO] Starting audit...
Audit done.

[INFO] Preparing pmd:check
[INFO] [pmd:pmd]
[INFO] [pmd:check {execution: validate}]
[INFO] 
[INFO] [plugin:descriptor]
[INFO] Using 2 extractors.
[INFO] Applying extractor for language: java
[INFO] Extractor for language: java found 1 mojo descriptors.
[INFO] Applying extractor for language: bsh
[INFO] Extractor for language: bsh found 0 mojo descriptors.
[INFO] [remote-resources:process {execution: default}]
[INFO] [resources:resources]
[INFO] Using default encoding to copy filtered resources.
[INFO] [compiler:compile]
[INFO] Compiling 1 source file to /x1/continuum/working-directory/216/maven-plugins/eclipse-plugin-generator/target/classes
[INFO] [resources:testResources]
[INFO] Using default encoding to copy filtered resources.
[INFO] [compiler:testCompile]
[INFO] Nothing to compile - all classes are up to date
[INFO] [surefire:test]
[INFO] Surefire report directory: /x1/continuum/working-directory/216/maven-plugins/eclipse-plugin-generator/target/surefire-reports

-------------------------------------------------------
 T E S T S
-------------------------------------------------------
There are no tests to run.

Results :

Tests run: 0, Failures: 0, Errors: 0, Skipped: 0

[INFO] [jar:jar]
[INFO] Building jar: /x1/continuum/working-directory/216/maven-plugins/eclipse-plugin-generator/target/cxf-eclipse-plugin-generator-2.1-incubator-SNAPSHOT.jar
[INFO] [plugin:addPluginArtifactMetadata]
[INFO] [install:install]
[INFO] Installing /x1/continuum/working-directory/216/maven-plugins/eclipse-plugin-generator/target/cxf-eclipse-plugin-generator-2.1-incubator-SNAPSHOT.jar to /home/continuum/.m2/repository/org/apache/cxf/cxf-eclipse-plugin-generator/2.1-incubator-SNAPSHOT/cxf-eclipse-plugin-generator-2.1-incubator-SNAPSHOT.jar
[INFO] [plugin:updateRegistry]
[INFO] 
[INFO] 
[INFO] ------------------------------------------------------------------------
[INFO] Reactor Summary:
[INFO] ------------------------------------------------------------------------
[INFO] Apache CXF ............................................ SUCCESS [3.295s]
[INFO] Apache CXF Buildtools ................................. SUCCESS [7.980s]
[INFO] Apache CXF Parent ..................................... SUCCESS [10.108s]
[INFO] Apache CXF Common Utilities ........................... SUCCESS [41.094s]
[INFO] Apache CXF Common XSD2Java  Plugins ................... SUCCESS [9.383s]
[INFO] Apache CXF Common Schemas ............................. SUCCESS [4.031s]
[INFO] Apache CXF XJC Default Value Plugin ................... SUCCESS [6.121s]
[INFO] Apache CXF XJC Default Value Plugin Tests ............. SUCCESS [12.952s]
[INFO] Apache CXF XJC Plugins ................................ SUCCESS [0.806s]
[INFO] Apache CXF Common ..................................... SUCCESS [0.023s]
[INFO] Apache CXF API ........................................ SUCCESS [59.389s]
[INFO] Apache CXF Command Line Tools Common .................. SUCCESS [21.128s]
[INFO] Apache CXF Runtime Core ............................... SUCCESS [48.574s]
[INFO] Apache CXF Command Line Tools Validator ............... SUCCESS [20.733s]
[INFO] Apache CXF Command Line Tools WSDLTo Core ............. SUCCESS [12.604s]
[INFO] Apache CXF Command Line Tools WSDLTo JAXWS Frontend ... SUCCESS [19.445s]
[INFO] Apache CXF Command Line Tools WSDLTo JAXB Databinding . SUCCESS [7.794s]
[INFO] Apache CXF Command Line Tools JavaTo Core ............. SUCCESS [9.139s]
[INFO] Apache CXF Code Generation Maven2 Plugins ............. SUCCESS [7.483s]
[INFO] Apache CXF Test Utilities ............................. SUCCESS [2:00.057s]
[INFO] Apache CXF Runtime JAXB DataBinding ................... SUCCESS [29.317s]
[INFO] Apache CXF Runtime SOAP Binding ....................... SUCCESS [25.915s]
[INFO] Apache CXF Runtime Management ......................... SUCCESS [29.078s]
[INFO] Apache CXF Runtime JMS Transport ...................... SUCCESS [1:00.806s]
[INFO] Apache CXF Runtime XML Binding ........................ SUCCESS [22.063s]
[INFO] Apache CXF Command Line Tools WSDLTo Test ............. SUCCESS [3:19.252s]
[INFO] Apache CXF Command Line Tools WSDLTo Misctools ........ SUCCESS [23.010s]
[INFO] Apache CXF Command Line Tools ......................... SUCCESS [0.043s]
[INFO] Apache CXF Command Line Tools WSDLTo .................. SUCCESS [0.041s]
[INFO] Apache CXF Runtime Local transport .................... SUCCESS [12.846s]
[INFO] Apache CXF Runtime Simple Frontend .................... SUCCESS [28.759s]
[INFO] Apache CXF Runtime JAX-WS Frontend .................... SUCCESS [1:33.566s]
[INFO] Apache CXF Command Line Tools JavaTo Test ............. SUCCESS [1:33.190s]
[INFO] Apache CXF Command Line Tools JavaTo .................. SUCCESS [0.047s]
[INFO] Apache CXF Runtime HTTP transport ..................... SUCCESS [24.481s]
[INFO] Apache CXF Runtime HTTP Jetty transport ............... SUCCESS [30.583s]
[INFO] Apache CXF Runtime Aegis Databinding .................. SUCCESS [48.422s]
[INFO] Apache CXF Runtime HTTP Binding ....................... SUCCESS [29.598s]
[INFO] Apache CXF Runtime Object Binding ..................... SUCCESS [22.308s]
[INFO] Apache CXF Colocated Binding .......................... SUCCESS [17.200s]
[INFO] Apache CXF Runtime JBI Binding ........................ SUCCESS [17.372s]
[INFO] Apache CXF Runtime .................................... SUCCESS [0.050s]
[INFO] Apache CXF Runtime Bindings ........................... SUCCESS [0.046s]
[INFO] Apache CXF Runtime JavaScript Frontend ................ SUCCESS [15.176s]
[INFO] Apache CXF Runtime JBI transport ...................... SUCCESS [16.770s]
[INFO] Apache CXF Runtime WS Policy .......................... SUCCESS [54.940s]
[INFO] Apache CXF Runtime WS Addressing ...................... SUCCESS [34.985s]
[INFO] Apache CXF Runtime WS Reliable Messaging .............. SUCCESS [1:05.773s]
[INFO] Apache CXF Runtime WS Security ........................ SUCCESS [42.818s]
[INFO] Apache CXF JBI Integration ............................ SUCCESS [41.279s]
[INFO] Apache CXF JCA Connection ............................. SUCCESS [58.815s]
[INFO] Apache CXF Integration ................................ SUCCESS [0.047s]
[INFO] Apache CXF System Tests ............................... SUCCESS [1:08:46.284s]
[INFO] Apache CXF Archetype - cxf-http-basic ................. SUCCESS [6.271s]
[INFO] Apache CXF Maven Archetypes ........................... SUCCESS [0.089s]
[INFO] Apache CXF Eclipse Plugin Generator Maven2 Plugin ..... SUCCESS [15.487s]
[INFO] ------------------------------------------------------------------------
[INFO] ------------------------------------------------------------------------
[INFO] BUILD SUCCESSFUL
[INFO] ------------------------------------------------------------------------
[INFO] Total time: 95 minutes 19 seconds
[INFO] Finished at: Tue Jul 03 08:36:35 PDT 2007
[INFO] Final Memory: 55M/63M
[INFO] ------------------------------------------------------------------------

****************************************************************************



Mime
View raw message