cxf-notifications mailing list archives

Site index · List index
Message view « Date » · « Thread »
Top « Date » · « Thread »
From "Continuum@vmbuild.apache.org" <cxf-notificati...@incubator.apache.org>
Subject [continuum] BUILD FAILURE: Apache CXF
Date Tue, 12 Jun 2007 11:30:19 GMT
Online report : http://vmbuild.apache.org/continuum/servlet/continuum/target/ProjectBuild.vm/view/ProjectBuild/id/216/buildId/180745
Build statistics:
  State: Failed
  Previous State: Failed
  Started at: Tue, 12 Jun 2007 03:01:43 -0700
  Finished at: Tue, 12 Jun 2007 04:30:18 -0700
  Total time: 1h 28m 34s
  Build Trigger: Schedule
  Exit code: 1
  Building machine hostname: vmbuild.apache.org
  Operating system : Linux(unknown)
  Java version : 1.5.0_06(Sun Microsystems Inc.)

Changes
         ffang          [CXF-720] update many tests to junit4.0

             /incubator/cxf/trunk/integration/jbi/src/test/java/org/apache/cxf/jbi/se/CXFServiceUnitManagerTest.java
            /incubator/cxf/trunk/integration/jbi/src/test/java/org/apache/cxf/jbi/se/CXFServiceUnitTest.java
            /incubator/cxf/trunk/integration/jbi/src/test/java/org/apache/cxf/jbi/se/state/ServiceEngineShutdownTest.java
            /incubator/cxf/trunk/integration/jbi/src/test/java/org/apache/cxf/jbi/se/state/ServiceEngineStartTest.java
            /incubator/cxf/trunk/integration/jbi/src/test/java/org/apache/cxf/jbi/se/state/ServiceEngineStateFactoryTest.java
            /incubator/cxf/trunk/integration/jbi/src/test/java/org/apache/cxf/jbi/se/state/ServiceEngineStopTest.java
            /incubator/cxf/trunk/integration/jca/src/test/java/org/apache/cxf/jca/core/classloader/PlugInClassLoaderTest.java
            /incubator/cxf/trunk/integration/jca/src/test/java/org/apache/cxf/jca/core/logging/LoggerHelperTest.java
            /incubator/cxf/trunk/integration/jca/src/test/java/org/apache/cxf/jca/core/resourceadapter/HandlerTest.java
            /incubator/cxf/trunk/integration/jca/src/test/java/org/apache/cxf/jca/core/resourceadapter/ManagedConnectionFactoryImplTest.java
            /incubator/cxf/trunk/integration/jca/src/test/java/org/apache/cxf/jca/core/resourceadapter/ManagedConnectionImplTest.java
            /incubator/cxf/trunk/integration/jca/src/test/java/org/apache/cxf/jca/core/resourceadapter/ResourceAdapterInternalExceptionTest.java
            /incubator/cxf/trunk/integration/jca/src/test/java/org/apache/cxf/jca/core/resourceadapter/ResourceBeanTest.java
            /incubator/cxf/trunk/integration/jca/src/test/java/org/apache/cxf/jca/core/resourceadapter/UriHandlerInitTest.java
            /incubator/cxf/trunk/integration/jca/src/test/java/org/apache/cxf/jca/cxf/AssociatedManagedConnectionFactoryImplTest.java
            /incubator/cxf/trunk/integration/jca/src/test/java/org/apache/cxf/jca/cxf/CXFConnectionRequestInfoTest.java
            /incubator/cxf/trunk/integration/jca/src/test/java/org/apache/cxf/jca/cxf/ConnectionFactoryImplTest.java
            /incubator/cxf/trunk/integration/jca/src/test/java/org/apache/cxf/jca/cxf/ManagedConnectionFactoryImplTest.java
            /incubator/cxf/trunk/integration/jca/src/test/java/org/apache/cxf/jca/cxf/ManagedConnectionImplTest.java
            /incubator/cxf/trunk/integration/jca/src/test/java/org/apache/cxf/jca/cxf/ManagedConnectionTestBase.java
            /incubator/cxf/trunk/integration/jca/src/test/java/org/apache/cxf/jca/cxf/ResourceAdapterImplTest.java
            /incubator/cxf/trunk/integration/jca/src/test/java/org/apache/cxf/jca/cxf/handlers/AbstractInvocationHandlerTest.java
            /incubator/cxf/trunk/integration/jca/src/test/java/org/apache/cxf/jca/cxf/handlers/HandlerTestBase.java
            /incubator/cxf/trunk/integration/jca/src/test/java/org/apache/cxf/jca/cxf/handlers/InvocationHandlerFactoryTest.java
            /incubator/cxf/trunk/integration/jca/src/test/java/org/apache/cxf/jca/cxf/handlers/InvokingInvocationHandlerTest.java
            /incubator/cxf/trunk/integration/jca/src/test/java/org/apache/cxf/jca/cxf/handlers/ObjectMethodInvocationHandlerTest.java
            /incubator/cxf/trunk/integration/jca/src/test/java/org/apache/cxf/jca/cxf/handlers/ProxyInvocationHandlerTest.java
            /incubator/cxf/trunk/integration/jca/src/test/java/org/apache/cxf/jca/jarloader/JarLoaderTest.java
            /incubator/cxf/trunk/integration/jca/src/test/java/org/apache/cxf/jca/servant/CXFConnectEJBServantTest.java
            /incubator/cxf/trunk/integration/jca/src/test/java/org/apache/cxf/jca/servant/ThreadContextCheckerHome.java
            /incubator/cxf/trunk/rt/bindings/http/src/test/java/org/apache/cxf/binding/http/InflectorTest.java
            /incubator/cxf/trunk/rt/bindings/http/src/test/java/org/apache/cxf/binding/http/IriDecoderTest.java
            /incubator/cxf/trunk/rt/bindings/soap/src/test/java/org/apache/cxf/binding/soap/MustUnderstandInterceptorTest.java
            /incubator/cxf/trunk/rt/bindings/soap/src/test/java/org/apache/cxf/binding/soap/RPCInInterceptorTest.java
            /incubator/cxf/trunk/rt/bindings/soap/src/test/java/org/apache/cxf/binding/soap/RPCOutInterceptorTest.java
            /incubator/cxf/trunk/rt/bindings/soap/src/test/java/org/apache/cxf/binding/soap/ReadHeaderInterceptorTest.java
            /incubator/cxf/trunk/rt/bindings/soap/src/test/java/org/apache/cxf/binding/soap/ServiceModelUtilTest.java
            /incubator/cxf/trunk/rt/bindings/soap/src/test/java/org/apache/cxf/binding/soap/SoapActionInterceptorTest.java
            /incubator/cxf/trunk/rt/bindings/soap/src/test/java/org/apache/cxf/binding/soap/SoapBindingFactoryTest.java
            /incubator/cxf/trunk/rt/bindings/soap/src/test/java/org/apache/cxf/binding/soap/SoapBindingTest.java
            /incubator/cxf/trunk/rt/bindings/soap/src/test/java/org/apache/cxf/binding/soap/SoapDestinationFactoryTest.java
            /incubator/cxf/trunk/rt/bindings/soap/src/test/java/org/apache/cxf/binding/soap/SoapOutInterceptorTest.java
            /incubator/cxf/trunk/rt/bindings/soap/src/test/java/org/apache/cxf/binding/soap/TestBase.java
            /incubator/cxf/trunk/rt/bindings/soap/src/test/java/org/apache/cxf/binding/soap/saaj/SAAJInInterceptorTest.java
            /incubator/cxf/trunk/rt/bindings/xml/src/test/java/org/apache/cxf/binding/xml/XMLBindingFactoryTest.java
            /incubator/cxf/trunk/rt/bindings/xml/src/test/java/org/apache/cxf/binding/xml/interceptor/TestBase.java
            /incubator/cxf/trunk/rt/bindings/xml/src/test/java/org/apache/cxf/binding/xml/interceptor/XMLFaultInterceptorsTest.java
            /incubator/cxf/trunk/rt/bindings/xml/src/test/java/org/apache/cxf/binding/xml/interceptor/XMLFaultOutInterceptorTest.java
            /incubator/cxf/trunk/rt/bindings/xml/src/test/java/org/apache/cxf/binding/xml/interceptor/XMLMessageInInterceptorTest.java
            /incubator/cxf/trunk/rt/bindings/xml/src/test/java/org/apache/cxf/binding/xml/interceptor/XMLMessageOutInterceptorTest.java
            /incubator/cxf/trunk/rt/databinding/jaxb/src/test/java/org/apache/cxf/jaxb/BareInInterceptorTest.java
            /incubator/cxf/trunk/rt/databinding/jaxb/src/test/java/org/apache/cxf/jaxb/BareOutInterceptorTest.java
            /incubator/cxf/trunk/rt/databinding/jaxb/src/test/java/org/apache/cxf/jaxb/DocLiteralInInterceptorTest.java
            /incubator/cxf/trunk/rt/databinding/jaxb/src/test/java/org/apache/cxf/jaxb/JAXBDataBindingTest.java
            /incubator/cxf/trunk/rt/databinding/jaxb/src/test/java/org/apache/cxf/jaxb/JAXBEncoderDecoderTest.java
            /incubator/cxf/trunk/rt/databinding/jaxb/src/test/java/org/apache/cxf/jaxb/TestBase.java
            /incubator/cxf/trunk/rt/databinding/jaxb/src/test/java/org/apache/cxf/jaxb/WrappedInInterceptorTest.java
            /incubator/cxf/trunk/rt/databinding/jaxb/src/test/java/org/apache/cxf/jaxb/io/XMLStreamDataReaderTest.java
            /incubator/cxf/trunk/rt/databinding/jaxb/src/test/java/org/apache/cxf/jaxb/io/XMLStreamDataWriterTest.java
            /incubator/cxf/trunk/rt/frontend/jaxws/src/test/java/org/apache/cxf/jaxws/context/WebServiceContextImplTest.java
            /incubator/cxf/trunk/rt/frontend/jaxws/src/test/java/org/apache/cxf/jaxws/handler/AbstractProtocolHandlerInterceptorTest.java
            /incubator/cxf/trunk/rt/frontend/jaxws/src/test/java/org/apache/cxf/jaxws/handler/AnnotationHandlerChainBuilderTest.java
            /incubator/cxf/trunk/rt/frontend/jaxws/src/test/java/org/apache/cxf/jaxws/handler/HandlerChainBuilderTest.java
            /incubator/cxf/trunk/rt/frontend/jaxws/src/test/java/org/apache/cxf/jaxws/handler/HandlerChainInvokerTest.java
            /incubator/cxf/trunk/rt/frontend/jaxws/src/test/java/org/apache/cxf/jaxws/handler/InitParamResourceResolverTest.java
            /incubator/cxf/trunk/rt/frontend/jaxws/src/test/java/org/apache/cxf/jaxws/handler/LogicalHandlerInterceptorTest.java
            /incubator/cxf/trunk/rt/frontend/jaxws/src/test/java/org/apache/cxf/jaxws/handler/LogicalMessageImplTest.java
            /incubator/cxf/trunk/rt/frontend/jaxws/src/test/java/org/apache/cxf/jaxws/handler/soap/SOAPHandlerInterceptorTest.java
            /incubator/cxf/trunk/rt/frontend/jaxws/src/test/java/org/apache/cxf/jaxws/javaee/WebservicesTypeTest.java
            /incubator/cxf/trunk/rt/frontend/jaxws/src/test/java/org/apache/cxf/jaxws/support/ContextPropertiesMappingTest.java
            /incubator/cxf/trunk/rt/frontend/jaxws/src/test/java/org/apache/cxf/jaxws/support/JaxWsImplementorInfoTest.java
            /incubator/cxf/trunk/rt/frontend/jaxws/src/test/java/org/apache/cxf/jaxws/support/JaxWsServiceConfigurationTest.java
            /incubator/cxf/trunk/rt/frontend/js/src/test/java/org/apache/cxf/js/rhino/AbstractDOMProviderTest.java
            /incubator/cxf/trunk/rt/frontend/js/src/test/java/org/apache/cxf/js/rhino/ProviderFactoryTest.java
            /incubator/cxf/trunk/rt/frontend/js/src/test/java/org/apache/cxf/js/rhino/ServerAppTest.java
            /incubator/cxf/trunk/rt/transports/local/src/test/java/org/apache/cxf/transport/local/LocalTransportFactoryTest.java
            /incubator/cxf/trunk/rt/ws/addr/src/test/java/org/apache/cxf/ws/addressing/AddressingBuilderImplTest.java
            /incubator/cxf/trunk/rt/ws/addr/src/test/java/org/apache/cxf/ws/addressing/AddressingBuilderTest.java
            /incubator/cxf/trunk/rt/ws/addr/src/test/java/org/apache/cxf/ws/addressing/AddressingConstantsImplTest.java
            /incubator/cxf/trunk/rt/ws/addr/src/test/java/org/apache/cxf/ws/addressing/MAPAggregatorTest.java
            /incubator/cxf/trunk/rt/ws/addr/src/test/java/org/apache/cxf/ws/addressing/soap/MAPCodecTest.java
            /incubator/cxf/trunk/systests/src/test/java/org/apache/cxf/systest/mtom/ClientMtomXopTest.java
            /incubator/cxf/trunk/systests/src/test/java/org/apache/cxf/systest/mtom/TestAttachmentOutInterceptor.java
            /incubator/cxf/trunk/systests/src/test/java/org/apache/cxf/systest/mtom/TestMultipartMessageInterceptor.java
            /incubator/cxf/trunk/testutils/src/test/java/org/apache/header_test/rpc/TestRPCHeaderTest.java
            /incubator/cxf/trunk/tools/common/src/test/java/org/apache/cxf/tools/common/ToolContextTest.java
            /incubator/cxf/trunk/tools/common/src/test/java/org/apache/cxf/tools/util/BuiltInTypesJavaMappingUtilTest.java
            /incubator/cxf/trunk/tools/common/src/test/java/org/apache/cxf/tools/util/FileWriterUtilTest.java
            /incubator/cxf/trunk/tools/common/src/test/java/org/apache/cxf/tools/util/NameUtilTest.java
            /incubator/cxf/trunk/tools/common/src/test/java/org/apache/cxf/tools/util/URIParserUtilTest.java
            /incubator/cxf/trunk/tools/javato/test/src/test/java/org/apache/cxf/tools/java2wsdl/generator/WSDLGeneratorFactoryTest.java
            /incubator/cxf/trunk/tools/javato/test/src/test/java/org/apache/cxf/tools/java2wsdl/generator/wsdl11/annotator/WrapperBeanAnnotatorTest.java
            /incubator/cxf/trunk/tools/javato/test/src/test/java/org/apache/cxf/tools/java2wsdl/generator/wsdl11/annotator/WrapperBeanFieldAnnotatorTest.java
            /incubator/cxf/trunk/tools/wsdlto/core/src/test/java/org/apache/cxf/tools/wsdlto/WSDLToJavaContainerTest.java
            /incubator/cxf/trunk/tools/wsdlto/frontend/jaxws/src/test/java/org/apache/cxf/tools/wsdlto/frontend/jaxws/JAXWSProfileTest.java
            /incubator/cxf/trunk/tools/wsdlto/frontend/jaxws/src/test/java/org/apache/cxf/tools/wsdlto/frontend/jaxws/processor/internal/PortTypeProcessorTest.java
            /incubator/cxf/trunk/tools/wsdlto/frontend/jaxws/src/test/java/org/apache/cxf/tools/wsdlto/frontend/jaxws/processor/internal/ProcessorUtilTest.java
            /incubator/cxf/trunk/tools/wsdlto/frontend/jaxws/src/test/java/org/apache/cxf/tools/wsdlto/frontend/jaxws/processor/internal/annotator/WebMethodAnnotatorTest.java
            /incubator/cxf/trunk/tools/wsdlto/frontend/jaxws/src/test/java/org/apache/cxf/tools/wsdlto/frontend/jaxws/processor/internal/annotator/WebParamAnnotatorTest.java
            /incubator/cxf/trunk/tools/wsdlto/frontend/jaxws/src/test/java/org/apache/cxf/tools/wsdlto/frontend/jaxws/processor/internal/mapper/InterfaceMapperTest.java
            /incubator/cxf/trunk/tools/wsdlto/frontend/jaxws/src/test/java/org/apache/cxf/tools/wsdlto/frontend/jaxws/processor/internal/mapper/MethodMapperTest.java
            /incubator/cxf/trunk/tools/wsdlto/frontend/jaxws/src/test/java/org/apache/cxf/tools/wsdlto/frontend/jaxws/wsdl11/JAXWSDefinitionBuilderTest.java
            /incubator/cxf/trunk/tools/wsdlto/test/src/test/java/org/apache/cxf/tools/wsdlto/WSDLToJavaTest.java
            /incubator/cxf/trunk/tools/wsdlto/test/src/test/java/org/apache/cxf/tools/wsdlto/core/PluginLoaderTest.java
            /incubator/cxf/trunk/tools/wsdlto/test/src/test/java/org/apache/cxf/tools/wsdlto/jaxws/wsdl11/JAXWSDefinitionBuilderTest.java
           ffang          [CXF-700] MTOM sample doesn't show how mtom work

             /incubator/cxf/trunk/distribution/src/main/release/samples/mtom/src/demo/mtom/client/Client.java
            /incubator/cxf/trunk/distribution/src/main/release/samples/mtom/src/demo/mtom/server/TestMtomImpl.java
            /incubator/cxf/trunk/distribution/src/main/release/samples/mtom/wsdl/mtom_xop.wsdl
           ningjiang          CXF-719 Fixed the memory leak of Endpoint.stop()
             /incubator/cxf/trunk/rt/core/src/main/java/org/apache/cxf/endpoint/ManagedEndpoint.java
        
****************************************************************************
Output:
****************************************************************************
[INFO] Scanning for projects...
[INFO] Reactor build order: 
[INFO]   Apache CXF
[INFO]   Apache CXF Buildtools
[INFO]   Apache CXF Parent
[INFO]   Apache CXF Common Utilities
[INFO]   Apache CXF Common XSD2Java  Plugins
[INFO]   Apache CXF Common Schemas
[INFO]   Apache CXF XJC Default Value Plugin
[INFO]   Apache CXF XJC Default Value Plugin Tests
[INFO]   Apache CXF XJC Plugins
[INFO]   Apache CXF Common
[INFO]   Apache CXF API
[INFO]   Apache CXF Command Line Tools Common
[INFO]   Apache CXF Runtime Core
[INFO]   Apache CXF Command Line Tools Validator
[INFO]   Apache CXF Command Line Tools WSDLTo Core
[INFO]   Apache CXF Command Line Tools WSDLTo JAXWS Frontend
[INFO]   Apache CXF Command Line Tools WSDLTo JAXB Databinding
[INFO]   Apache CXF Command Line Tools JavaTo Core
[INFO]   Apache CXF Code Generation Maven2 Plugins
[INFO]   Apache CXF Test Utilities
[INFO]   Apache CXF Runtime JAXB DataBinding
[INFO]   Apache CXF Runtime SOAP Binding
[INFO]   Apache CXF Runtime Management
[INFO]   Apache CXF Runtime JMS Transport
[INFO]   Apache CXF Runtime XML Binding
[INFO]   Apache CXF Command Line Tools WSDLTo Test
[INFO]   Apache CXF Command Line Tools WSDLTo Misctools
[INFO]   Apache CXF Command Line Tools
[INFO]   Apache CXF Command Line Tools WSDLTo
[INFO]   Apache CXF Runtime Local transport
[INFO]   Apache CXF Runtime Simple Frontend
[INFO]   Apache CXF Runtime JAX-WS Frontend
[INFO]   Apache CXF Command Line Tools JavaTo Test
[INFO]   Apache CXF Command Line Tools JavaTo
[INFO]   Apache CXF Runtime HTTP transport
[INFO]   Apache CXF Runtime HTTP Jetty transport
[INFO]   Apache CXF Runtime Aegis Databinding
[INFO]   Apache CXF Runtime HTTP Binding
[INFO]   Apache CXF Runtime Object Binding
[INFO]   Apache CXF Colocated Binding
[INFO]   Apache CXF Runtime JBI Binding
[INFO]   Apache CXF Runtime
[INFO]   Apache CXF Runtime Bindings
[INFO]   Apache CXF Runtime JavaScript Frontend
[INFO]   Apache CXF Runtime JBI transport
[INFO]   Apache CXF Runtime WS Policy
[INFO]   Apache CXF Runtime WS Addressing
[INFO]   Apache CXF Runtime WS Reliable Messaging
[INFO]   Apache CXF Runtime WS Security
[INFO]   Apache CXF JBI Integration
[INFO]   Apache CXF JCA Connection
[INFO]   Apache CXF Integration
[INFO]   Apache CXF System Tests
[INFO] ----------------------------------------------------------------------------
[INFO] Building Apache CXF
[INFO]    task-segment: [clean, install]
[INFO] ----------------------------------------------------------------------------
[INFO] [clean:clean]
[INFO] Deleting directory /x1/continuum/working-directory/216/target
[INFO] Deleting directory /x1/continuum/working-directory/216/target/classes
[INFO] Deleting directory /x1/continuum/working-directory/216/target/test-classes
[INFO] [site:attach-descriptor]
[INFO] [install:install]
[INFO] Installing /x1/continuum/working-directory/216/pom.xml to /home/continuum/.m2/repository/org/apache/cxf/cxf/2.0-incubator-SNAPSHOT/cxf-2.0-incubator-SNAPSHOT.pom
[INFO] ----------------------------------------------------------------------------
[INFO] Building Apache CXF Buildtools
[INFO]    task-segment: [clean, install]
[INFO] ----------------------------------------------------------------------------
[INFO] [clean:clean]
[INFO] Deleting directory /x1/continuum/working-directory/216/buildtools/target
[INFO] Deleting directory /x1/continuum/working-directory/216/buildtools/target/classes
[INFO] Deleting directory /x1/continuum/working-directory/216/buildtools/target/test-classes
[INFO] [resources:resources]
[INFO] Using default encoding to copy filtered resources.
[INFO] [compiler:compile]
[INFO] Compiling 1 source file to /x1/continuum/working-directory/216/buildtools/target/classes
[INFO] [resources:testResources]
[INFO] Using default encoding to copy filtered resources.
[INFO] [compiler:testCompile]
[INFO] Not compiling test sources
[INFO] [surefire:test]
[INFO] Tests are skipped.
[INFO] [jar:jar]
[INFO] Building jar: /x1/continuum/working-directory/216/buildtools/target/cxf-buildtools-2.0-incubator-SNAPSHOT.jar
[INFO] [install:install]
[INFO] Installing /x1/continuum/working-directory/216/buildtools/target/cxf-buildtools-2.0-incubator-SNAPSHOT.jar to /home/continuum/.m2/repository/org/apache/cxf/cxf-buildtools/2.0-incubator-SNAPSHOT/cxf-buildtools-2.0-incubator-SNAPSHOT.jar
[INFO] ----------------------------------------------------------------------------
[INFO] Building Apache CXF Parent
[INFO]    task-segment: [clean, install]
[INFO] ----------------------------------------------------------------------------
[INFO] [clean:clean]
[INFO] Deleting directory /x1/continuum/working-directory/216/parent/target
[INFO] Deleting directory /x1/continuum/working-directory/216/parent/target/classes
[INFO] Deleting directory /x1/continuum/working-directory/216/parent/target/test-classes
[INFO] Setting property: classpath.resource.loader.class => 'org.codehaus.plexus.velocity.ContextClassLoaderResourceLoader'.
[INFO] Setting property: velocimacro.messages.on => 'false'.
[INFO] Setting property: resource.loader => 'classpath'.
[INFO] Setting property: resource.manager.logwhenfound => 'false'.
[INFO] ************************************************************** 
[INFO] Starting Jakarta Velocity v1.4
[INFO] RuntimeInstance initializing.
[INFO] Default Properties File: org/apache/velocity/runtime/defaults/velocity.properties
[INFO] Default ResourceManager initializing. (class org.apache.velocity.runtime.resource.ResourceManagerImpl)
[INFO] Resource Loader Instantiated: org.codehaus.plexus.velocity.ContextClassLoaderResourceLoader
[INFO] ClasspathResourceLoader : initialization starting.
[INFO] ClasspathResourceLoader : initialization complete.
[INFO] ResourceCache : initialized. (class org.apache.velocity.runtime.resource.ResourceCacheImpl)
[INFO] Default ResourceManager initialization complete.
[INFO] Loaded System Directive: org.apache.velocity.runtime.directive.Literal
[INFO] Loaded System Directive: org.apache.velocity.runtime.directive.Macro
[INFO] Loaded System Directive: org.apache.velocity.runtime.directive.Parse
[INFO] Loaded System Directive: org.apache.velocity.runtime.directive.Include
[INFO] Loaded System Directive: org.apache.velocity.runtime.directive.Foreach
[INFO] Created: 20 parsers.
[INFO] Velocimacro : initialization starting.
[INFO] Velocimacro : adding VMs from VM library template : VM_global_library.vm
[ERROR] ResourceManager : unable to find resource 'VM_global_library.vm' in any resource loader.
[INFO] Velocimacro : error using  VM library template VM_global_library.vm : org.apache.velocity.exception.ResourceNotFoundException: Unable to find resource 'VM_global_library.vm'
[INFO] Velocimacro :  VM library template macro registration complete.
[INFO] Velocimacro : allowInline = true : VMs can be defined inline in templates
[INFO] Velocimacro : allowInlineToOverride = false : VMs defined inline may NOT replace previous VM definitions
[INFO] Velocimacro : allowInlineLocal = false : VMs defined inline will be  global in scope if allowed.
[INFO] Velocimacro : initialization complete.
[INFO] Velocity successfully started.
[INFO] [checkstyle:checkstyle {execution: validate}]
[INFO] Source directory does not exist - skipping report.
[INFO] Preparing pmd:check
[INFO] [pmd:pmd]
[INFO] [pmd:check {execution: validate}]
[INFO] Setting property: classpath.resource.loader.class => 'org.codehaus.plexus.velocity.ContextClassLoaderResourceLoader'.
[INFO] Setting property: velocimacro.messages.on => 'false'.
[INFO] Setting property: resource.loader => 'classpath'.
[INFO] Setting property: resource.manager.logwhenfound => 'false'.
[INFO] [remote-resources:process {execution: default}]
[INFO] [site:attach-descriptor]
[INFO] [install:install]
[INFO] Installing /x1/continuum/working-directory/216/parent/pom.xml to /home/continuum/.m2/repository/org/apache/cxf/cxf-parent/2.0-incubator-SNAPSHOT/cxf-parent-2.0-incubator-SNAPSHOT.pom
[INFO] ----------------------------------------------------------------------------
[INFO] Building Apache CXF Common Utilities
[INFO]    task-segment: [clean, install]
[INFO] ----------------------------------------------------------------------------
[INFO] [clean:clean]
[INFO] Deleting directory /x1/continuum/working-directory/216/common/common/target
[INFO] Deleting directory /x1/continuum/working-directory/216/common/common/target/classes
[INFO] Deleting directory /x1/continuum/working-directory/216/common/common/target/test-classes
[INFO] [checkstyle:checkstyle {execution: validate}]
[INFO] Starting audit...
Audit done.

[INFO] Preparing pmd:check
[INFO] [pmd:pmd]
[INFO] [pmd:check {execution: validate}]
[INFO] 
[INFO] [remote-resources:process {execution: default}]
[INFO] [resources:resources]
[INFO] Using default encoding to copy filtered resources.
[INFO] [compiler:compile]
[INFO] Compiling 98 source files to /x1/continuum/working-directory/216/common/common/target/classes
[INFO] [resources:testResources]
[INFO] Using default encoding to copy filtered resources.
[INFO] [compiler:testCompile]
[INFO] Compiling 36 source files to /x1/continuum/working-directory/216/common/common/target/test-classes
[INFO] [surefire:test]
[INFO] Surefire report directory: /x1/continuum/working-directory/216/common/common/target/surefire-reports

-------------------------------------------------------
 T E S T S
-------------------------------------------------------
Running org.apache.cxf.helpers.ServiceUtilsTest
Tests run: 1, Failures: 0, Errors: 0, Skipped: 0, Time elapsed: 0.075 sec
Running org.apache.cxf.common.commands.ForkedCommandTest
Tests run: 4, Failures: 0, Errors: 0, Skipped: 0, Time elapsed: 2.297 sec
Running org.apache.cxf.common.classloader.FireWallClassLoaderTest
Tests run: 4, Failures: 0, Errors: 0, Skipped: 0, Time elapsed: 0.1 sec
Running org.apache.cxf.common.util.Base64UtilityTest
Tests run: 3, Failures: 0, Errors: 0, Skipped: 0, Time elapsed: 0.061 sec
Running org.apache.cxf.version.VersionTest
Tests run: 2, Failures: 0, Errors: 0, Skipped: 0, Time elapsed: 0.06 sec
Running org.apache.cxf.common.util.CollectionUtilsTest
Tests run: 2, Failures: 0, Errors: 0, Skipped: 0, Time elapsed: 0.028 sec
Running org.apache.cxf.common.util.PackageUtilsTest
Tests run: 2, Failures: 0, Errors: 0, Skipped: 0, Time elapsed: 0.027 sec
Running org.apache.cxf.configuration.spring.SpringBeanMapTest
Tests run: 1, Failures: 0, Errors: 0, Skipped: 0, Time elapsed: 2.309 sec
Running org.apache.cxf.common.annotation.AnnotationProcessorTest
Tests run: 5, Failures: 0, Errors: 0, Skipped: 0, Time elapsed: 0.416 sec
Running org.apache.cxf.resource.ClassLoaderResolverTest
Tests run: 2, Failures: 0, Errors: 0, Skipped: 0, Time elapsed: 0.036 sec
Running org.apache.cxf.helpers.XMLUtilsTest
Tests run: 1, Failures: 0, Errors: 0, Skipped: 0, Time elapsed: 0.253 sec
Running org.apache.cxf.helpers.NameSpaceTest
Tests run: 2, Failures: 0, Errors: 0, Skipped: 0, Time elapsed: 0.231 sec
Running org.apache.cxf.common.util.TwoStageCacheTest
Tests run: 4, Failures: 0, Errors: 0, Skipped: 0, Time elapsed: 5.048 sec
Running org.apache.cxf.common.i18n.BundleUtilsTest
Tests run: 2, Failures: 0, Errors: 0, Skipped: 0, Time elapsed: 0.029 sec
Running org.apache.cxf.jaxb.JAXBUtilsTest
Tests run: 4, Failures: 0, Errors: 0, Skipped: 0, Time elapsed: 0.134 sec
Running org.apache.cxf.resource.URIResolverTest
Tests run: 2, Failures: 0, Errors: 0, Skipped: 0, Time elapsed: 0.028 sec
Running org.apache.cxf.common.injection.ResourceInjectorTest
Tests run: 8, Failures: 0, Errors: 0, Skipped: 0, Time elapsed: 0.255 sec
Running org.apache.cxf.staxutils.FragmentStreamReaderTest
Tests run: 1, Failures: 0, Errors: 0, Skipped: 0, Time elapsed: 0.521 sec
Running org.apache.cxf.staxutils.W3CDOMStreamReaderTest
Tests run: 1, Failures: 0, Errors: 0, Skipped: 0, Time elapsed: 0.511 sec
Running org.apache.cxf.configuration.spring.SpringBeanQNameMapTest
Tests run: 1, Failures: 0, Errors: 0, Skipped: 0, Time elapsed: 0.37 sec
Running org.apache.cxf.staxutils.StaxUtilsTest
Tests run: 5, Failures: 0, Errors: 0, Skipped: 0, Time elapsed: 0.131 sec
Running org.apache.cxf.jaxb.DatatypeFactoryTest
Tests run: 1, Failures: 0, Errors: 0, Skipped: 0, Time elapsed: 0.097 sec
Running org.apache.cxf.common.i18n.MessageTest
Tests run: 2, Failures: 0, Errors: 0, Skipped: 0, Time elapsed: 0.019 sec
Running org.apache.cxf.common.logging.LogUtilsTest
Tests run: 7, Failures: 0, Errors: 0, Skipped: 0, Time elapsed: 0.225 sec
Running org.apache.cxf.staxutils.DepthXMLStreamReaderTest
Tests run: 1, Failures: 0, Errors: 0, Skipped: 0, Time elapsed: 0.022 sec
Running org.apache.cxf.common.util.PropertiesLoaderUtilsTest
Tests run: 2, Failures: 0, Errors: 0, Skipped: 0, Time elapsed: 0.157 sec
Running org.apache.cxf.common.util.StringUtilsTest
Tests run: 6, Failures: 0, Errors: 0, Skipped: 0, Time elapsed: 0.044 sec
Running org.apache.cxf.jaxb.WrapperHelperTest
Tests run: 1, Failures: 0, Errors: 0, Skipped: 0, Time elapsed: 0.046 sec
Running org.apache.cxf.common.commands.ResultBufferedCommandTest
Tests run: 2, Failures: 0, Errors: 0, Skipped: 0, Time elapsed: 1.435 sec
Running org.apache.cxf.staxutils.StaxStreamFilterTest
Tests run: 2, Failures: 0, Errors: 0, Skipped: 0, Time elapsed: 0.056 sec

Results :

Tests run: 81, Failures: 0, Errors: 0, Skipped: 0

[INFO] [jar:jar]
[INFO] Building jar: /x1/continuum/working-directory/216/common/common/target/cxf-common-utilities-2.0-incubator-SNAPSHOT.jar
[INFO] [install:install]
[INFO] Installing /x1/continuum/working-directory/216/common/common/target/cxf-common-utilities-2.0-incubator-SNAPSHOT.jar to /home/continuum/.m2/repository/org/apache/cxf/cxf-common-utilities/2.0-incubator-SNAPSHOT/cxf-common-utilities-2.0-incubator-SNAPSHOT.jar
[INFO] ----------------------------------------------------------------------------
[INFO] Building Apache CXF Common XSD2Java  Plugins
[INFO]    task-segment: [clean, install]
[INFO] ----------------------------------------------------------------------------
[INFO] [clean:clean]
[INFO] Deleting directory /x1/continuum/working-directory/216/common/xsd/target
[INFO] Deleting directory /x1/continuum/working-directory/216/common/xsd/target/classes
[INFO] Deleting directory /x1/continuum/working-directory/216/common/xsd/target/test-classes
[INFO] [checkstyle:checkstyle {execution: validate}]
[INFO] Starting audit...
Audit done.

[INFO] Preparing pmd:check
[INFO] [pmd:pmd]
[INFO] [pmd:check {execution: validate}]
[INFO] 
[INFO] [plugin:descriptor]
[INFO] Using 2 extractors.
[INFO] Applying extractor for language: java
[INFO] Extractor for language: java found 1 mojo descriptors.
[INFO] Applying extractor for language: bsh
[INFO] Extractor for language: bsh found 0 mojo descriptors.
[INFO] [remote-resources:process {execution: default}]
[INFO] [resources:resources]
[INFO] Using default encoding to copy filtered resources.
[INFO] [compiler:compile]
[INFO] Compiling 3 source files to /x1/continuum/working-directory/216/common/xsd/target/classes
[INFO] [resources:testResources]
[INFO] Using default encoding to copy filtered resources.
[INFO] [compiler:testCompile]
[INFO] No sources to compile
[INFO] [surefire:test]
[INFO] Surefire report directory: /x1/continuum/working-directory/216/common/xsd/target/surefire-reports

-------------------------------------------------------
 T E S T S
-------------------------------------------------------
There are no tests to run.

Results :

Tests run: 0, Failures: 0, Errors: 0, Skipped: 0

[INFO] [jar:jar]
[INFO] Building jar: /x1/continuum/working-directory/216/common/xsd/target/cxf-common-xsd-2.0-incubator-SNAPSHOT.jar
[INFO] [plugin:addPluginArtifactMetadata]
[INFO] [install:install]
[INFO] Installing /x1/continuum/working-directory/216/common/xsd/target/cxf-common-xsd-2.0-incubator-SNAPSHOT.jar to /home/continuum/.m2/repository/org/apache/cxf/cxf-common-xsd/2.0-incubator-SNAPSHOT/cxf-common-xsd-2.0-incubator-SNAPSHOT.jar
[INFO] [plugin:updateRegistry]
[INFO] ----------------------------------------------------------------------------
[INFO] Building Apache CXF Common Schemas
[INFO]    task-segment: [clean, install]
[INFO] ----------------------------------------------------------------------------
[INFO] [clean:clean]
[INFO] Deleting directory /x1/continuum/working-directory/216/common/schemas/target
[INFO] Deleting directory /x1/continuum/working-directory/216/common/schemas/target/classes
[INFO] Deleting directory /x1/continuum/working-directory/216/common/schemas/target/test-classes
[INFO] [checkstyle:checkstyle {execution: validate}]
[INFO] Starting audit...
Audit done.

[INFO] Preparing pmd:check
[INFO] [pmd:pmd]
[INFO] [pmd:check {execution: validate}]
[INFO] 
[INFO] [remote-resources:process {execution: default}]
[INFO] [resources:resources]
[INFO] Using default encoding to copy filtered resources.
[INFO] [compiler:compile]
[INFO] No sources to compile
[INFO] [resources:testResources]
[INFO] Using default encoding to copy filtered resources.
[INFO] [compiler:testCompile]
[INFO] Not compiling test sources
[INFO] [surefire:test]
[INFO] Tests are skipped.
[INFO] [jar:jar]
[INFO] Building jar: /x1/continuum/working-directory/216/common/schemas/target/cxf-common-schemas-2.0-incubator-SNAPSHOT.jar
[INFO] [install:install]
[INFO] Installing /x1/continuum/working-directory/216/common/schemas/target/cxf-common-schemas-2.0-incubator-SNAPSHOT.jar to /home/continuum/.m2/repository/org/apache/cxf/cxf-common-schemas/2.0-incubator-SNAPSHOT/cxf-common-schemas-2.0-incubator-SNAPSHOT.jar
[INFO] ----------------------------------------------------------------------------
[INFO] Building Apache CXF XJC Default Value Plugin
[INFO]    task-segment: [clean, install]
[INFO] ----------------------------------------------------------------------------
[INFO] [clean:clean]
[INFO] Deleting directory /x1/continuum/working-directory/216/common/xjc/dv/target
[INFO] Deleting directory /x1/continuum/working-directory/216/common/xjc/dv/target/classes
[INFO] Deleting directory /x1/continuum/working-directory/216/common/xjc/dv/target/test-classes
[INFO] [checkstyle:checkstyle {execution: validate}]
[INFO] Starting audit...
Audit done.

[INFO] Preparing pmd:check
[INFO] [pmd:pmd]
[INFO] [pmd:check {execution: validate}]
[INFO] 
[INFO] [remote-resources:process {execution: default}]
[INFO] [resources:resources]
[INFO] Using default encoding to copy filtered resources.
[INFO] [compiler:compile]
[INFO] Compiling 1 source file to /x1/continuum/working-directory/216/common/xjc/dv/target/classes
[INFO] [resources:testResources]
[INFO] Using default encoding to copy filtered resources.
[INFO] [compiler:testCompile]
[INFO] Not compiling test sources
[INFO] [surefire:test]
[INFO] Tests are skipped.
[INFO] [jar:jar]
[INFO] Building jar: /x1/continuum/working-directory/216/common/xjc/dv/target/cxf-xjc-dv-2.0-incubator-SNAPSHOT.jar
[INFO] [install:install]
[INFO] Installing /x1/continuum/working-directory/216/common/xjc/dv/target/cxf-xjc-dv-2.0-incubator-SNAPSHOT.jar to /home/continuum/.m2/repository/org/apache/cxf/cxf-xjc-dv/2.0-incubator-SNAPSHOT/cxf-xjc-dv-2.0-incubator-SNAPSHOT.jar
[INFO] ----------------------------------------------------------------------------
[INFO] Building Apache CXF XJC Default Value Plugin Tests
[INFO]    task-segment: [clean, install]
[INFO] ----------------------------------------------------------------------------
[INFO] [clean:clean]
[INFO] Deleting directory /x1/continuum/working-directory/216/common/xjc/dv-test/target
[INFO] Deleting directory /x1/continuum/working-directory/216/common/xjc/dv-test/target/classes
[INFO] Deleting directory /x1/continuum/working-directory/216/common/xjc/dv-test/target/test-classes
[INFO] [checkstyle:checkstyle {execution: validate}]
[INFO] Starting audit...
Audit done.

[INFO] Preparing pmd:check
[INFO] [pmd:pmd]
[INFO] [pmd:check {execution: validate}]
[INFO] 
[INFO] [jaxb:generate {execution: default}]
[INFO] Compiling file:/x1/continuum/working-directory/216/common/xjc/dv-test/src/test/resources/schemas/configuration/foo.xsd
[INFO] Writing output to /x1/continuum/working-directory/216/common/xjc/dv-test/target/generated/src/test/java
[INFO] [remote-resources:process {execution: default}]
[INFO] [resources:resources]
[INFO] Using default encoding to copy filtered resources.
[INFO] [compiler:compile]
[INFO] Compiling 4 source files to /x1/continuum/working-directory/216/common/xjc/dv-test/target/classes
[INFO] [resources:testResources]
[INFO] Using default encoding to copy filtered resources.
[INFO] [compiler:testCompile]
[INFO] Compiling 1 source file to /x1/continuum/working-directory/216/common/xjc/dv-test/target/test-classes
[INFO] [surefire:test]
[INFO] Surefire report directory: /x1/continuum/working-directory/216/common/xjc/dv-test/target/surefire-reports

-------------------------------------------------------
 T E S T S
-------------------------------------------------------
Running org.apache.cxf.xjc.dv.DefaultValueTest
Tests run: 1, Failures: 0, Errors: 0, Skipped: 0, Time elapsed: 0.304 sec

Results :

Tests run: 1, Failures: 0, Errors: 0, Skipped: 0

[INFO] [jar:jar]
[INFO] Building jar: /x1/continuum/working-directory/216/common/xjc/dv-test/target/cxf-xjc-dv-test-2.0-incubator-SNAPSHOT.jar
[INFO] [install:install]
[INFO] Installing /x1/continuum/working-directory/216/common/xjc/dv-test/target/cxf-xjc-dv-test-2.0-incubator-SNAPSHOT.jar to /home/continuum/.m2/repository/org/apache/cxf/cxf-xjc-dv-test/2.0-incubator-SNAPSHOT/cxf-xjc-dv-test-2.0-incubator-SNAPSHOT.jar
[INFO] ----------------------------------------------------------------------------
[INFO] Building Apache CXF XJC Plugins
[INFO]    task-segment: [clean, install]
[INFO] ----------------------------------------------------------------------------
[INFO] [clean:clean]
[INFO] Deleting directory /x1/continuum/working-directory/216/common/xjc/target
[INFO] Deleting directory /x1/continuum/working-directory/216/common/xjc/target/classes
[INFO] Deleting directory /x1/continuum/working-directory/216/common/xjc/target/test-classes
[INFO] [checkstyle:checkstyle {execution: validate}]
[INFO] Source directory does not exist - skipping report.
[INFO] Preparing pmd:check
[INFO] [pmd:pmd]
[INFO] [pmd:check {execution: validate}]
[INFO] [remote-resources:process {execution: default}]
[INFO] [site:attach-descriptor]
[INFO] [install:install]
[INFO] Installing /x1/continuum/working-directory/216/common/xjc/pom.xml to /home/continuum/.m2/repository/org/apache/cxf/cxf-xjc/2.0-incubator-SNAPSHOT/cxf-xjc-2.0-incubator-SNAPSHOT.pom
[INFO] ----------------------------------------------------------------------------
[INFO] Building Apache CXF Common
[INFO]    task-segment: [clean, install]
[INFO] ----------------------------------------------------------------------------
[INFO] [clean:clean]
[INFO] Deleting directory /x1/continuum/working-directory/216/common/target
[INFO] Deleting directory /x1/continuum/working-directory/216/common/target/classes
[INFO] Deleting directory /x1/continuum/working-directory/216/common/target/test-classes
[INFO] [site:attach-descriptor]
[INFO] [install:install]
[INFO] Installing /x1/continuum/working-directory/216/common/pom.xml to /home/continuum/.m2/repository/org/apache/cxf/cxf-common/2.0-incubator-SNAPSHOT/cxf-common-2.0-incubator-SNAPSHOT.pom
[INFO] ----------------------------------------------------------------------------
[INFO] Building Apache CXF API
[INFO]    task-segment: [clean, install]
[INFO] ----------------------------------------------------------------------------
[INFO] [clean:clean]
[INFO] Deleting directory /x1/continuum/working-directory/216/api/target
[INFO] Deleting directory /x1/continuum/working-directory/216/api/target/classes
[INFO] Deleting directory /x1/continuum/working-directory/216/api/target/test-classes
[INFO] [checkstyle:checkstyle {execution: validate}]
[INFO] Starting audit...
Audit done.

[INFO] Preparing pmd:check
[INFO] [pmd:pmd]
[INFO] [pmd:check {execution: validate}]
[INFO] 
[INFO] [dependency:unpack {execution: unpack-schemas}]
[INFO] Configured Artifact: org.apache.cxf:cxf-common-schemas:2.0-incubator-SNAPSHOT:jar
[INFO] Expanding: /home/continuum/.m2/repository/org/apache/cxf/cxf-common-schemas/2.0-incubator-SNAPSHOT/cxf-common-schemas-2.0-incubator-SNAPSHOT.jar into /x1/continuum/working-directory/216/api/target/schemas
[INFO] [cxf-common-xsd:xsdtojava {execution: generate-sources}]
[INFO] [remote-resources:process {execution: default}]
[INFO] [resources:resources]
[INFO] Using default encoding to copy filtered resources.
[INFO] [compiler:compile]
[INFO] Compiling 219 source files to /x1/continuum/working-directory/216/api/target/classes
[INFO] [cxf-common-xsd:xsdtojava {execution: generate-test-sources}]
[INFO] [resources:testResources]
[INFO] Using default encoding to copy filtered resources.
[INFO] [compiler:testCompile]
[INFO] Compiling 28 source files to /x1/continuum/working-directory/216/api/target/test-classes
[INFO] [surefire:test]
[INFO] Surefire report directory: /x1/continuum/working-directory/216/api/target/surefire-reports

-------------------------------------------------------
 T E S T S
-------------------------------------------------------
Running org.apache.cxf.wsdl.JAXBExtensionHelperTest
Tests run: 2, Failures: 0, Errors: 0, Skipped: 0, Time elapsed: 4.129 sec
Running org.apache.cxf.service.model.BindingMessageInfoTest
Tests run: 1, Failures: 0, Errors: 0, Skipped: 0, Time elapsed: 0.091 sec
Running org.apache.cxf.ws.policy.IntersectorTest
Tests run: 3, Failures: 0, Errors: 0, Skipped: 0, Time elapsed: 0.161 sec
Running org.apache.cxf.ws.policy.builder.jaxb.JaxbAssertionTest
Tests run: 3, Failures: 0, Errors: 0, Skipped: 0, Time elapsed: 0.475 sec
Running org.apache.cxf.ws.policy.builder.jaxb.JaxbAssertionBuilderTest
Tests run: 3, Failures: 0, Errors: 0, Skipped: 0, Time elapsed: 0.121 sec
Running org.apache.cxf.service.model.OperationInfoTest
Tests run: 5, Failures: 0, Errors: 0, Skipped: 0, Time elapsed: 0.13 sec
Running org.apache.cxf.ws.policy.AssertionInfoMapTest
Tests run: 3, Failures: 0, Errors: 0, Skipped: 0, Time elapsed: 0.053 sec
Running org.apache.cxf.BusFactoryTest
Tests run: 1, Failures: 0, Errors: 0, Skipped: 0, Time elapsed: 0.028 sec
Running org.apache.cxf.service.model.FaultInfoTest
Tests run: 1, Failures: 0, Errors: 0, Skipped: 0, Time elapsed: 0.016 sec
Running org.apache.cxf.service.model.SchemaInfoTest
Tests run: 2, Failures: 0, Errors: 0, Skipped: 0, Time elapsed: 0.022 sec
Running org.apache.cxf.service.model.MessagePartInfoTest
Tests run: 3, Failures: 0, Errors: 0, Skipped: 0, Time elapsed: 0.026 sec
Running org.apache.cxf.ws.policy.builder.primitive.NestedPrimitiveAssertionTest
Tests run: 1, Failures: 0, Errors: 0, Skipped: 0, Time elapsed: 0.031 sec
Running org.apache.cxf.service.model.BindingFaultInfoTest
Tests run: 1, Failures: 0, Errors: 0, Skipped: 0, Time elapsed: 0.026 sec
Running org.apache.cxf.ws.policy.builder.primitive.NestedPrimitiveAssertionBuilderTest
Tests run: 5, Failures: 0, Errors: 0, Skipped: 0, Time elapsed: 0.2 sec
Running org.apache.cxf.service.model.InterfaceInfoTest
Tests run: 2, Failures: 0, Errors: 0, Skipped: 0, Time elapsed: 0.028 sec
Running org.apache.cxf.phase.PhaseInterceptorChainTest
Tests run: 16, Failures: 0, Errors: 0, Skipped: 0, Time elapsed: 0.409 sec
Running org.apache.cxf.service.model.BindingOperationInfoTest
Tests run: 6, Failures: 0, Errors: 0, Skipped: 0, Time elapsed: 0.034 sec
Running org.apache.cxf.service.model.MessageInfoTest
Tests run: 2, Failures: 0, Errors: 0, Skipped: 0, Time elapsed: 0.013 sec

Results :

Tests run: 60, Failures: 0, Errors: 0, Skipped: 0

[INFO] [jar:jar]
[INFO] Building jar: /x1/continuum/working-directory/216/api/target/cxf-api-2.0-incubator-SNAPSHOT.jar
[INFO] Preparing javadoc:jar
[WARNING] Removing: check from forked lifecycle, to prevent recursive invocation.
[WARNING] Removing: jar from forked lifecycle, to prevent recursive invocation.
[INFO] [checkstyle:checkstyle {execution: validate}]
[INFO] Starting audit...
Audit done.

[INFO] [dependency:unpack {execution: unpack-schemas}]
[INFO] Configured Artifact: org.apache.cxf:cxf-common-schemas:2.0-incubator-SNAPSHOT:jar
[INFO] cxf-common-schemas-2.0-incubator-SNAPSHOT.jar already unpacked.
[INFO] [cxf-common-xsd:xsdtojava {execution: generate-sources}]
[INFO] [javadoc:jar {execution: package}]
11 warnings
[INFO] Javadoc Warnings
[WARNING] javadoc: warning - Multiple sources of package comments found for package "org.apache.cxf.endpoint"
[WARNING] javadoc: warning - Multiple sources of package comments found for package "org.apache.cxf.transport"
[WARNING] javadoc: warning - Multiple sources of package comments found for package "org.apache.cxf.interceptor"
[WARNING] javadoc: warning - Multiple sources of package comments found for package "org.apache.cxf.service"
[WARNING] javadoc: warning - Multiple sources of package comments found for package "org.apache.cxf.phase"
[WARNING] javadoc: warning - Multiple sources of package comments found for package "org.apache.cxf.binding"
[WARNING] javadoc: warning - Multiple sources of package comments found for package "org.apache.cxf"
[WARNING] /x1/continuum/working-directory/216/api/src/main/java/org/apache/cxf/endpoint/EndpointResolver.java:72: warning - @param argument "serviceName" is not a parameter name.
[WARNING] /x1/continuum/working-directory/216/api/src/main/java/org/apache/cxf/endpoint/EndpointResolverRegistry.java:99: warning - @param argument "serviceName" is not a parameter name.
[WARNING] /x1/continuum/working-directory/216/api/src/main/java/org/apache/cxf/clustering/FailoverStrategy.java:39: warning - @param argument "invocation" is not a parameter name.
[WARNING] /x1/continuum/working-directory/216/api/src/main/java/org/apache/cxf/clustering/FailoverStrategy.java:47: warning - @param argument "a" is not a parameter name.
[INFO] Building jar: /x1/continuum/working-directory/216/api/target/cxf-api-2.0-incubator-SNAPSHOT-javadoc.jar
[INFO] [install:install]
[INFO] Installing /x1/continuum/working-directory/216/api/target/cxf-api-2.0-incubator-SNAPSHOT.jar to /home/continuum/.m2/repository/org/apache/cxf/cxf-api/2.0-incubator-SNAPSHOT/cxf-api-2.0-incubator-SNAPSHOT.jar
[INFO] Installing /x1/continuum/working-directory/216/api/target/cxf-api-2.0-incubator-SNAPSHOT-javadoc.jar to /home/continuum/.m2/repository/org/apache/cxf/cxf-api/2.0-incubator-SNAPSHOT/cxf-api-2.0-incubator-SNAPSHOT-javadoc.jar
[INFO] ----------------------------------------------------------------------------
[INFO] Building Apache CXF Command Line Tools Common
[INFO]    task-segment: [clean, install]
[INFO] ----------------------------------------------------------------------------
[INFO] [clean:clean]
[INFO] Deleting directory /x1/continuum/working-directory/216/tools/common/target
[INFO] Deleting directory /x1/continuum/working-directory/216/tools/common/target/classes
[INFO] Deleting directory /x1/continuum/working-directory/216/tools/common/target/test-classes
[INFO] [checkstyle:checkstyle {execution: validate}]
[INFO] Starting audit...
Audit done.

[INFO] Preparing pmd:check
[INFO] [pmd:pmd]
[INFO] [pmd:check {execution: validate}]
[INFO] 
[INFO] [remote-resources:process {execution: default}]
[INFO] [resources:resources]
[INFO] Using default encoding to copy filtered resources.
[INFO] [compiler:compile]
[INFO] Compiling 70 source files to /x1/continuum/working-directory/216/tools/common/target/classes
[INFO] [resources:testResources]
[INFO] Using default encoding to copy filtered resources.
[INFO] [compiler:testCompile]
[INFO] Compiling 20 source files to /x1/continuum/working-directory/216/tools/common/target/test-classes
[INFO] [surefire:test]
[INFO] Surefire report directory: /x1/continuum/working-directory/216/tools/common/target/surefire-reports

-------------------------------------------------------
 T E S T S
-------------------------------------------------------
Running org.apache.cxf.tools.common.ToolContextTest
Tests run: 1, Failures: 0, Errors: 0, Skipped: 0, Time elapsed: 0.127 sec
Running org.apache.cxf.tools.common.toolspec.parser.CommandLineParserTest
Tests run: 16, Failures: 0, Errors: 0, Skipped: 0, Time elapsed: 6.994 sec
Running org.apache.cxf.tools.common.ProcessorEnvironmentTest
Tests run: 7, Failures: 0, Errors: 0, Skipped: 0, Time elapsed: 0.163 sec
Running org.apache.cxf.tools.common.model.JavaClassTest
Tests run: 2, Failures: 0, Errors: 0, Skipped: 0, Time elapsed: 0.111 sec
Running org.apache.cxf.tools.common.toolspec.ToolSupportTest
Tests run: 1, Failures: 0, Errors: 0, Skipped: 0, Time elapsed: 0.058 sec
Running org.apache.cxf.tools.common.model.JavaParameterTest
Tests run: 1, Failures: 0, Errors: 0, Skipped: 0, Time elapsed: 0.018 sec
Running org.apache.cxf.tools.util.URIParserUtilTest
Tests run: 3, Failures: 0, Errors: 0, Skipped: 0, Time elapsed: 0.061 sec
Running org.apache.cxf.tools.common.model.JavaTypeTest
Tests run: 3, Failures: 0, Errors: 0, Skipped: 0, Time elapsed: 0.041 sec
Running org.apache.cxf.tools.common.toolspec.AbstractToolContainerTest
Tests run: 3, Failures: 0, Errors: 0, Skipped: 0, Time elapsed: 0.393 sec
Running org.apache.cxf.tools.common.dom.SchemaValidatingSAXParserTest
Tests run: 1, Failures: 0, Errors: 0, Skipped: 0, Time elapsed: 0.055 sec
Running org.apache.cxf.tools.common.dom.ExtendedDocumentBuilderTest
Tests run: 2, Failures: 0, Errors: 0, Skipped: 0, Time elapsed: 0.099 sec
Running org.apache.cxf.tools.common.WSDLVersionTest
Tests run: 1, Failures: 0, Errors: 0, Skipped: 0, Time elapsed: 0.072 sec
Running org.apache.cxf.tools.util.BuiltInTypesJavaMappingUtilTest
Tests run: 1, Failures: 0, Errors: 0, Skipped: 0, Time elapsed: 0.034 sec
Running org.apache.cxf.tools.util.NameUtilTest
Tests run: 3, Failures: 0, Errors: 0, Skipped: 0, Time elapsed: 0.033 sec
Running org.apache.cxf.tools.util.FileWriterUtilTest
Tests run: 2, Failures: 0, Errors: 0, Skipped: 0, Time elapsed: 0.036 sec
Running org.apache.cxf.tools.common.toolspec.ToolExceptionTest
Tests run: 1, Failures: 0, Errors: 0, Skipped: 0, Time elapsed: 0.035 sec
Running org.apache.cxf.tools.common.dom.DocumentTest
Tests run: 1, Failures: 0, Errors: 0, Skipped: 1, Time elapsed: 0.036 sec
Running org.apache.cxf.tools.common.model.JavaInterfaceTest
Tests run: 1, Failures: 0, Errors: 0, Skipped: 0, Time elapsed: 0.016 sec
Running org.apache.cxf.tools.common.toolspec.ToolSpecTest
Tests run: 8, Failures: 0, Errors: 0, Skipped: 0, Time elapsed: 0.227 sec

Results :

Tests run: 58, Failures: 0, Errors: 0, Skipped: 1

[INFO] [jar:jar]
[INFO] Building jar: /x1/continuum/working-directory/216/tools/common/target/cxf-tools-common-2.0-incubator-SNAPSHOT.jar
[INFO] [install:install]
[INFO] Installing /x1/continuum/working-directory/216/tools/common/target/cxf-tools-common-2.0-incubator-SNAPSHOT.jar to /home/continuum/.m2/repository/org/apache/cxf/cxf-tools-common/2.0-incubator-SNAPSHOT/cxf-tools-common-2.0-incubator-SNAPSHOT.jar
[INFO] ----------------------------------------------------------------------------
[INFO] Building Apache CXF Runtime Core
[INFO]    task-segment: [clean, install]
[INFO] ----------------------------------------------------------------------------
[INFO] [clean:clean]
[INFO] Deleting directory /x1/continuum/working-directory/216/rt/core/target
[INFO] Deleting directory /x1/continuum/working-directory/216/rt/core/target/classes
[INFO] Deleting directory /x1/continuum/working-directory/216/rt/core/target/test-classes
[INFO] [checkstyle:checkstyle {execution: validate}]
[INFO] Starting audit...
Audit done.

[INFO] Preparing pmd:check
[INFO] [pmd:pmd]
[INFO] [pmd:check {execution: validate}]
[INFO] 
[INFO] [remote-resources:process {execution: default}]
[INFO] [resources:resources]
[INFO] Using default encoding to copy filtered resources.
[INFO] [compiler:compile]
[INFO] Compiling 132 source files to /x1/continuum/working-directory/216/rt/core/target/classes
[INFO] [resources:testResources]
[INFO] Using default encoding to copy filtered resources.
[INFO] [compiler:testCompile]
[INFO] Compiling 30 source files to /x1/continuum/working-directory/216/rt/core/target/test-classes
[INFO] [surefire:test]
[INFO] Surefire report directory: /x1/continuum/working-directory/216/rt/core/target/surefire-reports

-------------------------------------------------------
 T E S T S
-------------------------------------------------------
Running org.apache.cxf.interceptor.OutgoingChainInterceptorTest
Tests run: 1, Failures: 0, Errors: 0, Skipped: 0, Time elapsed: 2.346 sec
Running org.apache.cxf.test.XPathAssertTest
Tests run: 2, Failures: 0, Errors: 0, Skipped: 0, Time elapsed: 0.883 sec
Running org.apache.cxf.buslifecycle.CXFBusLifeCycleManagerTest
Tests run: 5, Failures: 0, Errors: 0, Skipped: 0, Time elapsed: 0.135 sec
Running org.apache.cxf.endpoint.EndpointResolverRegistryImplTest
Tests run: 6, Failures: 0, Errors: 0, Skipped: 0, Time elapsed: 0.244 sec
Running org.apache.cxf.bus.extension.ExtensionTest
Tests run: 3, Failures: 0, Errors: 0, Skipped: 0, Time elapsed: 0.063 sec
Running org.apache.cxf.attachment.AttachmentSerializerTest
Tests run: 2, Failures: 0, Errors: 0, Skipped: 0, Time elapsed: 0.626 sec
Running org.apache.cxf.wsdl11.WSDLManagerImplTest
Tests run: 2, Failures: 0, Errors: 0, Skipped: 0, Time elapsed: 1.142 sec
Running org.apache.cxf.configuration.spring.ConfigurerImplTest
Tests run: 4, Failures: 0, Errors: 0, Skipped: 0, Time elapsed: 3.555 sec
Running org.apache.cxf.transport.CachedOutputStreamTest
Tests run: 1, Failures: 0, Errors: 0, Skipped: 0, Time elapsed: 0.232 sec
Running org.apache.cxf.workqueue.AutomaticWorkQueueTest
Tests run: 10, Failures: 0, Errors: 0, Skipped: 1, Time elapsed: 11.507 sec
Running org.apache.cxf.bus.CXFBusImplTest
Tests run: 7, Failures: 0, Errors: 0, Skipped: 0, Time elapsed: 1.236 sec
Running org.apache.cxf.endpoint.ServerRegistryImpTest
Tests run: 1, Failures: 0, Errors: 0, Skipped: 0, Time elapsed: 0.007 sec
Running org.apache.cxf.bus.spring.SpringBusFactoryTest
Tests run: 7, Failures: 0, Errors: 0, Skipped: 0, Time elapsed: 3.713 sec
Running org.apache.cxf.interceptor.ServiceInvokerInterceptorTest
Tests run: 1, Failures: 0, Errors: 0, Skipped: 0, Time elapsed: 0.032 sec
Running org.apache.cxf.wsdl11.WSDLDefinitionBuilderTest
Tests run: 2, Failures: 0, Errors: 0, Skipped: 0, Time elapsed: 0.16 sec
Running org.apache.cxf.bus.spring.BusApplicationContextTest
Tests run: 1, Failures: 0, Errors: 0, Skipped: 0, Time elapsed: 1.223 sec
Running org.apache.cxf.bus.extension.ExtensionFragmentParserTest
Tests run: 1, Failures: 0, Errors: 0, Skipped: 0, Time elapsed: 0.015 sec
Running org.apache.cxf.transport.HttpUriMapperTest
Tests run: 2, Failures: 0, Errors: 0, Skipped: 0, Time elapsed: 0.013 sec
Running org.apache.cxf.bus.extension.ExtensionManagerTest
Tests run: 2, Failures: 0, Errors: 0, Skipped: 0, Time elapsed: 0.053 sec
Running org.apache.cxf.wsdl11.ServiceWSDLBuilderTest
Tests run: 8, Failures: 0, Errors: 0, Skipped: 0, Time elapsed: 1.383 sec
Running org.apache.cxf.attachment.AttachmentDeserializerTest
Tests run: 4, Failures: 0, Errors: 0, Skipped: 0, Time elapsed: 0.047 sec
Running org.apache.cxf.wsdl11.WSDLServiceBuilderTest
Tests run: 14, Failures: 0, Errors: 0, Skipped: 0, Time elapsed: 2.252 sec

Results :

Tests run: 86, Failures: 0, Errors: 0, Skipped: 1

[INFO] [jar:jar]
[INFO] Building jar: /x1/continuum/working-directory/216/rt/core/target/cxf-rt-core-2.0-incubator-SNAPSHOT.jar
[INFO] [install:install]
[INFO] Installing /x1/continuum/working-directory/216/rt/core/target/cxf-rt-core-2.0-incubator-SNAPSHOT.jar to /home/continuum/.m2/repository/org/apache/cxf/cxf-rt-core/2.0-incubator-SNAPSHOT/cxf-rt-core-2.0-incubator-SNAPSHOT.jar
[INFO] ----------------------------------------------------------------------------
[INFO] Building Apache CXF Command Line Tools Validator
[INFO]    task-segment: [clean, install]
[INFO] ----------------------------------------------------------------------------
[INFO] [clean:clean]
[INFO] Deleting directory /x1/continuum/working-directory/216/tools/validator/target
[INFO] Deleting directory /x1/continuum/working-directory/216/tools/validator/target/classes
[INFO] Deleting directory /x1/continuum/working-directory/216/tools/validator/target/test-classes
[INFO] [checkstyle:checkstyle {execution: validate}]
[INFO] Starting audit...
Audit done.

[INFO] Preparing pmd:check
[INFO] [pmd:pmd]
[INFO] [pmd:check {execution: validate}]
[INFO] 
[INFO] [remote-resources:process {execution: default}]
[INFO] [resources:resources]
[INFO] Using default encoding to copy filtered resources.
[INFO] [compiler:compile]
[INFO] Compiling 24 source files to /x1/continuum/working-directory/216/tools/validator/target/classes
[INFO] [resources:testResources]
[INFO] Using default encoding to copy filtered resources.
[INFO] [compiler:testCompile]
[INFO] Compiling 5 source files to /x1/continuum/working-directory/216/tools/validator/target/test-classes
[INFO] [surefire:test]
[INFO] Surefire report directory: /x1/continuum/working-directory/216/tools/validator/target/surefire-reports

-------------------------------------------------------
 T E S T S
-------------------------------------------------------
Running org.apache.cxf.tools.validator.WSDLValidationTest
Tests run: 11, Failures: 0, Errors: 0, Skipped: 0, Time elapsed: 11.302 sec
Running org.apache.cxf.tools.validator.internal.WSDLRefValidatorTest
Tests run: 7, Failures: 0, Errors: 0, Skipped: 0, Time elapsed: 1.631 sec
Running org.apache.cxf.tools.validator.internal.WSDL11ValidatorTest
Tests run: 1, Failures: 0, Errors: 0, Skipped: 0, Time elapsed: 0.397 sec
Running org.apache.cxf.tools.validator.internal.Stax2DOMTest
Tests run: 1, Failures: 0, Errors: 0, Skipped: 0, Time elapsed: 0.186 sec
Running org.apache.cxf.tools.validator.internal.model.XNodeTest
Tests run: 3, Failures: 0, Errors: 0, Skipped: 0, Time elapsed: 0.021 sec

Results :

Tests run: 23, Failures: 0, Errors: 0, Skipped: 0

[INFO] [jar:jar]
[INFO] Building jar: /x1/continuum/working-directory/216/tools/validator/target/cxf-tools-validator-2.0-incubator-SNAPSHOT.jar
[INFO] [install:install]
[INFO] Installing /x1/continuum/working-directory/216/tools/validator/target/cxf-tools-validator-2.0-incubator-SNAPSHOT.jar to /home/continuum/.m2/repository/org/apache/cxf/cxf-tools-validator/2.0-incubator-SNAPSHOT/cxf-tools-validator-2.0-incubator-SNAPSHOT.jar
[INFO] ----------------------------------------------------------------------------
[INFO] Building Apache CXF Command Line Tools WSDLTo Core
[INFO]    task-segment: [clean, install]
[INFO] ----------------------------------------------------------------------------
[INFO] [clean:clean]
[INFO] Deleting directory /x1/continuum/working-directory/216/tools/wsdlto/core/target
[INFO] Deleting directory /x1/continuum/working-directory/216/tools/wsdlto/core/target/classes
[INFO] Deleting directory /x1/continuum/working-directory/216/tools/wsdlto/core/target/test-classes
[INFO] [checkstyle:checkstyle {execution: validate}]
[INFO] Starting audit...
Audit done.

[INFO] Preparing pmd:check
[INFO] [pmd:pmd]
[INFO] [pmd:check {execution: validate}]
[INFO] 
[INFO] [cxf-common-xsd:xsdtojava {execution: generate-sources}]
[INFO] [remote-resources:process {execution: default}]
[INFO] [resources:resources]
[INFO] Using default encoding to copy filtered resources.
[INFO] [compiler:compile]
[INFO] Compiling 18 source files to /x1/continuum/working-directory/216/tools/wsdlto/core/target/classes
[INFO] [resources:testResources]
[INFO] Using default encoding to copy filtered resources.
[INFO] [compiler:testCompile]
[INFO] Compiling 1 source file to /x1/continuum/working-directory/216/tools/wsdlto/core/target/test-classes
[INFO] [surefire:test]
[INFO] Surefire report directory: /x1/continuum/working-directory/216/tools/wsdlto/core/target/surefire-reports

-------------------------------------------------------
 T E S T S
-------------------------------------------------------
Running org.apache.cxf.tools.wsdlto.WSDLToJavaContainerTest
Tests run: 1, Failures: 0, Errors: 0, Skipped: 0, Time elapsed: 0.408 sec

Results :

Tests run: 1, Failures: 0, Errors: 0, Skipped: 0

[INFO] [jar:jar]
[INFO] Building jar: /x1/continuum/working-directory/216/tools/wsdlto/core/target/cxf-tools-wsdlto-core-2.0-incubator-SNAPSHOT.jar
[INFO] [install:install]
[INFO] Installing /x1/continuum/working-directory/216/tools/wsdlto/core/target/cxf-tools-wsdlto-core-2.0-incubator-SNAPSHOT.jar to /home/continuum/.m2/repository/org/apache/cxf/cxf-tools-wsdlto-core/2.0-incubator-SNAPSHOT/cxf-tools-wsdlto-core-2.0-incubator-SNAPSHOT.jar
[INFO] ----------------------------------------------------------------------------
[INFO] Building Apache CXF Command Line Tools WSDLTo JAXWS Frontend
[INFO]    task-segment: [clean, install]
[INFO] ----------------------------------------------------------------------------
[INFO] [clean:clean]
[INFO] Deleting directory /x1/continuum/working-directory/216/tools/wsdlto/frontend/jaxws/target
[INFO] Deleting directory /x1/continuum/working-directory/216/tools/wsdlto/frontend/jaxws/target/classes
[INFO] Deleting directory /x1/continuum/working-directory/216/tools/wsdlto/frontend/jaxws/target/test-classes
[INFO] [checkstyle:checkstyle {execution: validate}]
[INFO] Starting audit...
Audit done.

[INFO] Preparing pmd:check
[INFO] [pmd:pmd]
[INFO] [pmd:check {execution: validate}]
[INFO] 
[INFO] [remote-resources:process {execution: default}]
[INFO] [resources:resources]
[INFO] Using default encoding to copy filtered resources.
[INFO] [compiler:compile]
[INFO] Compiling 37 source files to /x1/continuum/working-directory/216/tools/wsdlto/frontend/jaxws/target/classes
[INFO] [resources:testResources]
[INFO] Using default encoding to copy filtered resources.
[INFO] [compiler:testCompile]
[INFO] Compiling 9 source files to /x1/continuum/working-directory/216/tools/wsdlto/frontend/jaxws/target/test-classes
[INFO] [surefire:test]
[INFO] Surefire report directory: /x1/continuum/working-directory/216/tools/wsdlto/frontend/jaxws/target/surefire-reports

-------------------------------------------------------
 T E S T S
-------------------------------------------------------
Running org.apache.cxf.tools.wsdlto.frontend.jaxws.processor.internal.PortTypeProcessorTest
Tests run: 1, Failures: 0, Errors: 0, Skipped: 0, Time elapsed: 0.156 sec
Running org.apache.cxf.tools.wsdlto.frontend.jaxws.processor.internal.ProcessorUtilTest
Tests run: 1, Failures: 0, Errors: 0, Skipped: 0, Time elapsed: 0.037 sec
Running org.apache.cxf.tools.wsdlto.frontend.jaxws.processor.internal.mapper.MethodMapperTest
Tests run: 3, Failures: 0, Errors: 0, Skipped: 0, Time elapsed: 0.231 sec
Running org.apache.cxf.tools.wsdlto.frontend.jaxws.processor.internal.annotator.WebParamAnnotatorTest
Tests run: 3, Failures: 0, Errors: 0, Skipped: 0, Time elapsed: 0.102 sec
Running org.apache.cxf.tools.wsdlto.frontend.jaxws.processor.internal.annotator.WebMethodAnnotatorTest
Tests run: 2, Failures: 0, Errors: 0, Skipped: 0, Time elapsed: 0.032 sec
Running org.apache.cxf.tools.wsdlto.frontend.jaxws.processor.internal.mapper.InterfaceMapperTest
Tests run: 2, Failures: 0, Errors: 0, Skipped: 0, Time elapsed: 0.059 sec
Running org.apache.cxf.tools.wsdlto.frontend.jaxws.JAXWSProfileTest
Tests run: 1, Failures: 0, Errors: 0, Skipped: 0, Time elapsed: 4.716 sec
Running org.apache.cxf.tools.wsdlto.frontend.jaxws.wsdl11.JAXWSDefinitionBuilderTest
Tests run: 3, Failures: 0, Errors: 0, Skipped: 0, Time elapsed: 1.932 sec

Results :

Tests run: 16, Failures: 0, Errors: 0, Skipped: 0

[INFO] [jar:jar]
[INFO] Building jar: /x1/continuum/working-directory/216/tools/wsdlto/frontend/jaxws/target/cxf-tools-wsdlto-frontend-jaxws-2.0-incubator-SNAPSHOT.jar
[INFO] [install:install]
[INFO] Installing /x1/continuum/working-directory/216/tools/wsdlto/frontend/jaxws/target/cxf-tools-wsdlto-frontend-jaxws-2.0-incubator-SNAPSHOT.jar to /home/continuum/.m2/repository/org/apache/cxf/cxf-tools-wsdlto-frontend-jaxws/2.0-incubator-SNAPSHOT/cxf-tools-wsdlto-frontend-jaxws-2.0-incubator-SNAPSHOT.jar
[INFO] ----------------------------------------------------------------------------
[INFO] Building Apache CXF Command Line Tools WSDLTo JAXB Databinding
[INFO]    task-segment: [clean, install]
[INFO] ----------------------------------------------------------------------------
[INFO] [clean:clean]
[INFO] Deleting directory /x1/continuum/working-directory/216/tools/wsdlto/databinding/jaxb/target
[INFO] Deleting directory /x1/continuum/working-directory/216/tools/wsdlto/databinding/jaxb/target/classes
[INFO] Deleting directory /x1/continuum/working-directory/216/tools/wsdlto/databinding/jaxb/target/test-classes
[INFO] [checkstyle:checkstyle {execution: validate}]
[INFO] Starting audit...
Audit done.

[INFO] Preparing pmd:check
[INFO] [pmd:pmd]
[INFO] [pmd:check {execution: validate}]
[INFO] 
[INFO] [remote-resources:process {execution: default}]
[INFO] [resources:resources]
[INFO] Using default encoding to copy filtered resources.
[INFO] [compiler:compile]
[INFO] Compiling 5 source files to /x1/continuum/working-directory/216/tools/wsdlto/databinding/jaxb/target/classes
[INFO] [resources:testResources]
[INFO] Using default encoding to copy filtered resources.
[INFO] [compiler:testCompile]
[INFO] Nothing to compile - all classes are up to date
[INFO] [surefire:test]
[INFO] Surefire report directory: /x1/continuum/working-directory/216/tools/wsdlto/databinding/jaxb/target/surefire-reports

-------------------------------------------------------
 T E S T S
-------------------------------------------------------
There are no tests to run.

Results :

Tests run: 0, Failures: 0, Errors: 0, Skipped: 0

[INFO] [jar:jar]
[INFO] Building jar: /x1/continuum/working-directory/216/tools/wsdlto/databinding/jaxb/target/cxf-tools-wsdlto-databinding-jaxb-2.0-incubator-SNAPSHOT.jar
[INFO] [install:install]
[INFO] Installing /x1/continuum/working-directory/216/tools/wsdlto/databinding/jaxb/target/cxf-tools-wsdlto-databinding-jaxb-2.0-incubator-SNAPSHOT.jar to /home/continuum/.m2/repository/org/apache/cxf/cxf-tools-wsdlto-databinding-jaxb/2.0-incubator-SNAPSHOT/cxf-tools-wsdlto-databinding-jaxb-2.0-incubator-SNAPSHOT.jar
[INFO] ----------------------------------------------------------------------------
[INFO] Building Apache CXF Command Line Tools JavaTo Core
[INFO]    task-segment: [clean, install]
[INFO] ----------------------------------------------------------------------------
[INFO] [clean:clean]
[INFO] Deleting directory /x1/continuum/working-directory/216/tools/javato/core/target
[INFO] Deleting directory /x1/continuum/working-directory/216/tools/javato/core/target/classes
[INFO] Deleting directory /x1/continuum/working-directory/216/tools/javato/core/target/test-classes
[INFO] [checkstyle:checkstyle {execution: validate}]
[INFO] Starting audit...
Audit done.

[INFO] Preparing pmd:check
[INFO] [pmd:pmd]
[INFO] [pmd:check {execution: validate}]
[INFO] 
[INFO] [remote-resources:process {execution: default}]
[INFO] [resources:resources]
[INFO] Using default encoding to copy filtered resources.
[INFO] [compiler:compile]
[INFO] Compiling 19 source files to /x1/continuum/working-directory/216/tools/javato/core/target/classes
[INFO] [resources:testResources]
[INFO] Using default encoding to copy filtered resources.
[INFO] [compiler:testCompile]
[INFO] No sources to compile
[INFO] [surefire:test]
[INFO] Surefire report directory: /x1/continuum/working-directory/216/tools/javato/core/target/surefire-reports

-------------------------------------------------------
 T E S T S
-------------------------------------------------------
There are no tests to run.

Results :

Tests run: 0, Failures: 0, Errors: 0, Skipped: 0

[INFO] [jar:jar]
[INFO] Building jar: /x1/continuum/working-directory/216/tools/javato/core/target/cxf-tools-java2wsdl-2.0-incubator-SNAPSHOT.jar
[INFO] [install:install]
[INFO] Installing /x1/continuum/working-directory/216/tools/javato/core/target/cxf-tools-java2wsdl-2.0-incubator-SNAPSHOT.jar to /home/continuum/.m2/repository/org/apache/cxf/cxf-tools-java2wsdl/2.0-incubator-SNAPSHOT/cxf-tools-java2wsdl-2.0-incubator-SNAPSHOT.jar
[INFO] ----------------------------------------------------------------------------
[INFO] Building Apache CXF Code Generation Maven2 Plugins
[INFO]    task-segment: [clean, install]
[INFO] ----------------------------------------------------------------------------
[INFO] [clean:clean]
[INFO] Deleting directory /x1/continuum/working-directory/216/codegen-plugin/target
[INFO] Deleting directory /x1/continuum/working-directory/216/codegen-plugin/target/classes
[INFO] Deleting directory /x1/continuum/working-directory/216/codegen-plugin/target/test-classes
[INFO] [checkstyle:checkstyle {execution: validate}]
[INFO] Starting audit...
Audit done.

[INFO] Preparing pmd:check
[INFO] [pmd:pmd]
[INFO] [pmd:check {execution: validate}]
[INFO] 
[INFO] [plugin:descriptor]
[INFO] Using 2 extractors.
[INFO] Applying extractor for language: java
[INFO] Extractor for language: java found 3 mojo descriptors.
[INFO] Applying extractor for language: bsh
[INFO] Extractor for language: bsh found 0 mojo descriptors.
[INFO] [remote-resources:process {execution: default}]
[INFO] [resources:resources]
[INFO] Using default encoding to copy filtered resources.
[INFO] [compiler:compile]
[INFO] Compiling 5 source files to /x1/continuum/working-directory/216/codegen-plugin/target/classes
[INFO] [resources:testResources]
[INFO] Using default encoding to copy filtered resources.
[INFO] [compiler:testCompile]
[INFO] Nothing to compile - all classes are up to date
[INFO] [surefire:test]
[INFO] Surefire report directory: /x1/continuum/working-directory/216/codegen-plugin/target/surefire-reports

-------------------------------------------------------
 T E S T S
-------------------------------------------------------
There are no tests to run.

Results :

Tests run: 0, Failures: 0, Errors: 0, Skipped: 0

[INFO] [jar:jar]
[INFO] Building jar: /x1/continuum/working-directory/216/codegen-plugin/target/cxf-codegen-plugin-2.0-incubator-SNAPSHOT.jar
[INFO] [plugin:addPluginArtifactMetadata]
[INFO] [install:install]
[INFO] Installing /x1/continuum/working-directory/216/codegen-plugin/target/cxf-codegen-plugin-2.0-incubator-SNAPSHOT.jar to /home/continuum/.m2/repository/org/apache/cxf/cxf-codegen-plugin/2.0-incubator-SNAPSHOT/cxf-codegen-plugin-2.0-incubator-SNAPSHOT.jar
[INFO] [plugin:updateRegistry]
[INFO] ----------------------------------------------------------------------------
[INFO] Building Apache CXF Test Utilities
[INFO]    task-segment: [clean, install]
[INFO] ----------------------------------------------------------------------------
[INFO] [clean:clean]
[INFO] Deleting directory /x1/continuum/working-directory/216/testutils/target
[INFO] Deleting directory /x1/continuum/working-directory/216/testutils/target/classes
[INFO] Deleting directory /x1/continuum/working-directory/216/testutils/target/test-classes
[INFO] [checkstyle:checkstyle {execution: validate}]
[INFO] Starting audit...
Audit done.

[INFO] Preparing pmd:check
[INFO] [pmd:pmd]
[INFO] [pmd:check {execution: validate}]
[INFO] 
[INFO] [antrun:run {execution: validate}]
[INFO] Executing tasks
    [mkdir] Created dir: /x1/continuum/working-directory/216/testutils/target/generated/src/main/resources/wsdl/type_test
     [xslt] Processing /x1/continuum/working-directory/216/testutils/src/main/resources/wsdl/type_test/type_test.xsd to /x1/continuum/working-directory/216/testutils/target/generated/src/main/resources/wsdl/type_test/type_test_1.xsd
     [xslt] Loading stylesheet /x1/continuum/working-directory/216/testutils/src/main/resources/wsdl/type_test/type_test_ID_xsd.xsl
     [xslt] Processing /x1/continuum/working-directory/216/testutils/src/main/resources/wsdl/type_test/type_test.xsd to /x1/continuum/working-directory/216/testutils/target/generated/src/main/resources/wsdl/type_test/type_test_2.xsd
     [xslt] Loading stylesheet /x1/continuum/working-directory/216/testutils/src/main/resources/wsdl/type_test/type_test_ID_xsd.xsl
     [xslt] Processing /x1/continuum/working-directory/216/testutils/src/main/resources/wsdl/type_test/type_test.xsd to /x1/continuum/working-directory/216/testutils/target/generated/src/main/resources/wsdl/type_test/type_test_3.xsd
     [xslt] Loading stylesheet /x1/continuum/working-directory/216/testutils/src/main/resources/wsdl/type_test/type_test_ID_xsd.xsl
     [xslt] Processing /x1/continuum/working-directory/216/testutils/src/main/resources/wsdl/type_test/type_test.xsd to /x1/continuum/working-directory/216/testutils/target/generated/src/main/resources/wsdl/type_test/type_test_doclit.wsdl
     [xslt] Loading stylesheet /x1/continuum/working-directory/216/testutils/src/main/resources/wsdl/type_test/type_test_wsdl.xsl
     [xslt] Processing /x1/continuum/working-directory/216/testutils/src/main/resources/wsdl/type_test/type_test.xsd to /x1/continuum/working-directory/216/testutils/target/generated/src/main/resources/wsdl/type_test/type_test_rpclit.wsdl
     [xslt] Loading stylesheet /x1/continuum/working-directory/216/testutils/src/main/resources/wsdl/type_test/type_test_wsdl.xsl
     [xslt] Processing /x1/continuum/working-directory/216/testutils/src/main/resources/wsdl/type_test/type_test.xsd to /x1/continuum/working-directory/216/testutils/target/generated/src/main/resources/wsdl/type_test/type_test_xml_inc.wsdl
     [xslt] Loading stylesheet /x1/continuum/working-directory/216/testutils/src/main/resources/wsdl/type_test/type_test_wsdl.xsl
     [xslt] Processing /x1/continuum/working-directory/216/testutils/src/main/resources/wsdl/type_test/type_test.xsd to /x1/continuum/working-directory/216/testutils/target/generated/src/main/resources/wsdl/type_test/type_test_xml.wsdl
     [xslt] Loading stylesheet /x1/continuum/working-directory/216/testutils/src/main/resources/wsdl/type_test/type_test_xml_wsdl.xsl
     [xslt] Processing /x1/continuum/working-directory/216/testutils/src/main/resources/wsdl/type_test/type_test.xsd to /x1/continuum/working-directory/216/testutils/target/generated/src/main/resources/wsdl/type_test/type_test_doclit_soap.wsdl
     [xslt] Loading stylesheet /x1/continuum/working-directory/216/testutils/src/main/resources/wsdl/type_test/type_test_soap_wsdl.xsl
     [xslt] Processing /x1/continuum/working-directory/216/testutils/src/main/resources/wsdl/type_test/type_test.xsd to /x1/continuum/working-directory/216/testutils/target/generated/src/main/resources/wsdl/type_test/type_test_rpclit_soap.wsdl
     [xslt] Loading stylesheet /x1/continuum/working-directory/216/testutils/src/main/resources/wsdl/type_test/type_test_soap_wsdl.xsl
    [mkdir] Created dir: /x1/continuum/working-directory/216/testutils/target/generated/src/main/java/org/apache/cxf/systest/type_test
     [xslt] Processing /x1/continuum/working-directory/216/testutils/src/main/resources/wsdl/type_test/type_test.xsd to /x1/continuum/working-directory/216/testutils/target/generated/src/main/java/org/apache/cxf/systest/type_test/TypeTestImpl.java
     [xslt] Loading stylesheet /x1/continuum/working-directory/216/testutils/src/main/resources/wsdl/type_test/type_test_impl_java.xsl
     [xslt] Processing /x1/continuum/working-directory/216/testutils/src/main/resources/wsdl/type_test/type_test.xsd to /x1/continuum/working-directory/216/testutils/target/generated/src/main/java/org/apache/cxf/systest/type_test/TypeTestTester.java
     [xslt] Loading stylesheet /x1/continuum/working-directory/216/testutils/src/main/resources/wsdl/type_test/type_test_tester_java.xsl
[INFO] Executed tasks
[INFO] Registering compile source root /x1/continuum/working-directory/216/testutils/target/generated/src/main/java
[INFO] [cxf-codegen:wsdl2java {execution: generate-sources}]
Jun 12, 2007 3:12:22 AM org.apache.cxf.tools.wsdlto.core.PluginLoader loadPlugin
INFO: Loading plugin jar:file:/x1/continuum/working-directory/216/tools/wsdlto/databinding/jaxb/target/cxf-tools-wsdlto-databinding-jaxb-2.0-incubator-SNAPSHOT.jar!/META-INF/tools-plugin.xml
Jun 12, 2007 3:12:22 AM org.apache.cxf.tools.wsdlto.core.PluginLoader loadPlugin
INFO: Found 1 databindings in <jaxb> plugin.
Jun 12, 2007 3:12:22 AM org.apache.cxf.tools.wsdlto.core.PluginLoader loadPlugin
INFO: Loading <jaxb> databinding from <jaxb> plugin.
Jun 12, 2007 3:12:22 AM org.apache.cxf.tools.wsdlto.core.PluginLoader loadPlugin
INFO: Loading plugin jar:file:/x1/continuum/working-directory/216/tools/wsdlto/frontend/jaxws/target/cxf-tools-wsdlto-frontend-jaxws-2.0-incubator-SNAPSHOT.jar!/META-INF/tools-plugin.xml
Jun 12, 2007 3:12:22 AM org.apache.cxf.tools.wsdlto.core.PluginLoader loadPlugin
INFO: Found 1 frontends in <jaxws> plugin.
Jun 12, 2007 3:12:22 AM org.apache.cxf.tools.wsdlto.core.PluginLoader loadPlugin
INFO: Loading <jaxws> frontend from <jaxws> plugin.
Jun 12, 2007 3:12:24 AM org.springframework.context.support.AbstractApplicationContext refresh
INFO: Refreshing org.apache.cxf.bus.spring.BusApplicationContext@58ccfb: display name [org.apache.cxf.bus.spring.BusApplicationContext@58ccfb]; startup date [Tue Jun 12 03:12:24 PDT 2007]; root of context hierarchy
Jun 12, 2007 3:12:24 AM org.apache.cxf.bus.spring.BusApplicationContext getConfigResources
INFO: Could not find the configuration file cxf.xml on the classpath.
Jun 12, 2007 3:12:24 AM org.springframework.beans.factory.xml.XmlBeanDefinitionReader loadBeanDefinitions
INFO: Loading XML bean definitions from class path resource [META-INF/cxf/cxf.xml]
Jun 12, 2007 3:12:25 AM org.springframework.context.support.AbstractApplicationContext refresh
INFO: Bean factory for application context [org.apache.cxf.bus.spring.BusApplicationContext@58ccfb]: org.springframework.beans.factory.support.DefaultListableBeanFactory@13a99a8
Jun 12, 2007 3:12:26 AM org.springframework.context.support.AbstractApplicationContext$BeanPostProcessorChecker postProcessAfterInitialization
INFO: Bean 'org.apache.cxf.bus.spring.Jsr250BeanPostProcessor' is not eligible for getting processed by all BeanPostProcessors (for example: not eligible for auto-proxying)
Jun 12, 2007 3:12:26 AM org.springframework.context.support.AbstractApplicationContext$BeanPostProcessorChecker postProcessAfterInitialization
INFO: Bean 'cxf' is not eligible for getting processed by all BeanPostProcessors (for example: not eligible for auto-proxying)
Jun 12, 2007 3:12:26 AM org.springframework.context.support.AbstractApplicationContext$BeanPostProcessorChecker postProcessAfterInitialization
INFO: Bean 'org.apache.cxf.bus.spring.BusExtensionPostProcessor' is not eligible for getting processed by all BeanPostProcessors (for example: not eligible for auto-proxying)
Jun 12, 2007 3:12:26 AM org.springframework.beans.factory.support.DefaultListableBeanFactory preInstantiateSingletons
INFO: Pre-instantiating singletons in org.springframework.beans.factory.support.DefaultListableBeanFactory@13a99a8: defining beans [cxf,org.apache.cxf.bus.spring.Jsr250BeanPostProcessor,org.apache.cxf.bus.spring.BusExtensionPostProcessor,org.apache.cxf.resource.ResourceManager,org.apache.cxf.binding.BindingFactoryManager,org.apache.cxf.transport.DestinationFactoryManager,org.apache.cxf.transport.ConduitInitiatorManager,org.apache.cxf.wsdl.WSDLManager,org.apache.cxf.phase.PhaseManager,org.apache.cxf.workqueue.WorkQueueManager,org.apache.cxf.buslifecycle.BusLifeCycleManager,org.apache.cxf.endpoint.ServerRegistry,org.apache.cxf.endpoint.ServerLifeCycleManager,org.apache.cxf.endpoint.ClientLifeCycleManager,org.apache.cxf.transports.http.QueryHandlerRegistry,org.apache.cxf.endpoint.EndpointResolverRegistry,org.apache.cxf.headers.HeaderManager,org.apache.cxf.catalog.OASISCatalogManager]; root of factory hierarchy
[INFO] [cxf-common-xsd:xsdtojava {execution: generate-sources}]
[INFO] [remote-resources:process {execution: default}]
[INFO] [resources:resources]
[INFO] Using default encoding to copy filtered resources.
[INFO] [compiler:compile]
[INFO] Compiling 1313 source files to /x1/continuum/working-directory/216/testutils/target/classes
[INFO] [resources:testResources]
[INFO] Using default encoding to copy filtered resources.
[INFO] [compiler:testCompile]
[INFO] Compiling 1 source file to /x1/continuum/working-directory/216/testutils/target/test-classes
[INFO] [surefire:test]
[INFO] Surefire report directory: /x1/continuum/working-directory/216/testutils/target/surefire-reports

-------------------------------------------------------
 T E S T S
-------------------------------------------------------
Running org.apache.header_test.rpc.TestRPCHeaderTest
Tests run: 2, Failures: 0, Errors: 0, Skipped: 0, Time elapsed: 0.293 sec

Results :

Tests run: 2, Failures: 0, Errors: 0, Skipped: 0

[INFO] [jar:jar]
[INFO] Building jar: /x1/continuum/working-directory/216/testutils/target/cxf-testutils-2.0-incubator-SNAPSHOT.jar
[INFO] [install:install]
[INFO] Installing /x1/continuum/working-directory/216/testutils/target/cxf-testutils-2.0-incubator-SNAPSHOT.jar to /home/continuum/.m2/repository/org/apache/cxf/cxf-testutils/2.0-incubator-SNAPSHOT/cxf-testutils-2.0-incubator-SNAPSHOT.jar
[INFO] ----------------------------------------------------------------------------
[INFO] Building Apache CXF Runtime JAXB DataBinding
[INFO]    task-segment: [clean, install]
[INFO] ----------------------------------------------------------------------------
[INFO] [clean:clean]
[INFO] Deleting directory /x1/continuum/working-directory/216/rt/databinding/jaxb/target
[INFO] Deleting directory /x1/continuum/working-directory/216/rt/databinding/jaxb/target/classes
[INFO] Deleting directory /x1/continuum/working-directory/216/rt/databinding/jaxb/target/test-classes
[INFO] [checkstyle:checkstyle {execution: validate}]
[INFO] Starting audit...
Audit done.

[INFO] Preparing pmd:check
[INFO] [pmd:pmd]
[INFO] [pmd:check {execution: validate}]
[INFO] 
[INFO] [remote-resources:process {execution: default}]
[INFO] [resources:resources]
[INFO] Using default encoding to copy filtered resources.
[INFO] [compiler:compile]
[INFO] Compiling 15 source files to /x1/continuum/working-directory/216/rt/databinding/jaxb/target/classes
[INFO] [cxf-common-xsd:xsdtojava {execution: generate-sources}]
[INFO] [dependency:unpack {execution: unpack-schemas}]
[INFO] Configured Artifact: org.apache.cxf:cxf-common-schemas:2.0-incubator-SNAPSHOT:jar
[INFO] Expanding: /home/continuum/.m2/repository/org/apache/cxf/cxf-common-schemas/2.0-incubator-SNAPSHOT/cxf-common-schemas-2.0-incubator-SNAPSHOT.jar into /x1/continuum/working-directory/216/rt/databinding/jaxb/target/generated/src/test/resources
[INFO] [resources:testResources]
[INFO] Using default encoding to copy filtered resources.
[INFO] [compiler:testCompile]
[INFO] Compiling 13 source files to /x1/continuum/working-directory/216/rt/databinding/jaxb/target/test-classes
[INFO] [surefire:test]
[INFO] Surefire report directory: /x1/continuum/working-directory/216/rt/databinding/jaxb/target/surefire-reports

-------------------------------------------------------
 T E S T S
-------------------------------------------------------
Running org.apache.cxf.jaxb.BareInInterceptorTest
Tests run: 4, Failures: 0, Errors: 0, Skipped: 0, Time elapsed: 8.145 sec
Running org.apache.cxf.jaxb.DocLiteralInInterceptorTest
Tests run: 3, Failures: 0, Errors: 0, Skipped: 0, Time elapsed: 1.815 sec
Running org.apache.cxf.jaxb.WrappedInInterceptorTest
Tests run: 2, Failures: 0, Errors: 0, Skipped: 0, Time elapsed: 1.038 sec
Running org.apache.cxf.jaxb.io.XMLStreamDataReaderTest
Tests run: 4, Failures: 0, Errors: 0, Skipped: 0, Time elapsed: 0.255 sec
Running org.apache.cxf.jaxb.io.XMLStreamDataWriterTest
Tests run: 5, Failures: 0, Errors: 0, Skipped: 0, Time elapsed: 0.462 sec
Running org.apache.cxf.jaxb.JAXBEncoderDecoderTest
Tests run: 9, Failures: 0, Errors: 0, Skipped: 0, Time elapsed: 1.871 sec
Running org.apache.cxf.jaxb.BareOutInterceptorTest
Tests run: 2, Failures: 0, Errors: 0, Skipped: 0, Time elapsed: 1.053 sec
Running org.apache.cxf.jaxb.JAXBDataBindingTest
Tests run: 6, Failures: 0, Errors: 0, Skipped: 0, Time elapsed: 1.948 sec

Results :

Tests run: 35, Failures: 0, Errors: 0, Skipped: 0

[INFO] [jar:jar]
[INFO] Building jar: /x1/continuum/working-directory/216/rt/databinding/jaxb/target/cxf-rt-databinding-jaxb-2.0-incubator-SNAPSHOT.jar
[INFO] [install:install]
[INFO] Installing /x1/continuum/working-directory/216/rt/databinding/jaxb/target/cxf-rt-databinding-jaxb-2.0-incubator-SNAPSHOT.jar to /home/continuum/.m2/repository/org/apache/cxf/cxf-rt-databinding-jaxb/2.0-incubator-SNAPSHOT/cxf-rt-databinding-jaxb-2.0-incubator-SNAPSHOT.jar
[INFO] ----------------------------------------------------------------------------
[INFO] Building Apache CXF Runtime SOAP Binding
[INFO]    task-segment: [clean, install]
[INFO] ----------------------------------------------------------------------------
[INFO] [clean:clean]
[INFO] Deleting directory /x1/continuum/working-directory/216/rt/bindings/soap/target
[INFO] Deleting directory /x1/continuum/working-directory/216/rt/bindings/soap/target/classes
[INFO] Deleting directory /x1/continuum/working-directory/216/rt/bindings/soap/target/test-classes
[INFO] [checkstyle:checkstyle {execution: validate}]
[INFO] Starting audit...
Audit done.

[INFO] Preparing pmd:check
[INFO] [pmd:pmd]
[INFO] [pmd:check {execution: validate}]
[INFO] 
[INFO] [remote-resources:process {execution: default}]
[INFO] [resources:resources]
[INFO] Using default encoding to copy filtered resources.
[INFO] [compiler:compile]
[INFO] Compiling 38 source files to /x1/continuum/working-directory/216/rt/bindings/soap/target/classes
[INFO] [resources:testResources]
[INFO] Using default encoding to copy filtered resources.
[INFO] [compiler:testCompile]
[INFO] Compiling 14 source files to /x1/continuum/working-directory/216/rt/bindings/soap/target/test-classes
[INFO] [surefire:test]
[INFO] Surefire report directory: /x1/continuum/working-directory/216/rt/bindings/soap/target/surefire-reports

-------------------------------------------------------
 T E S T S
-------------------------------------------------------
Running org.apache.cxf.binding.soap.SoapDestinationFactoryTest
Tests run: 1, Failures: 0, Errors: 0, Skipped: 0, Time elapsed: 0.489 sec
Running org.apache.cxf.binding.soap.RPCOutInterceptorTest
Tests run: 2, Failures: 0, Errors: 0, Skipped: 0, Time elapsed: 5.117 sec
Running org.apache.cxf.binding.soap.saaj.SAAJInInterceptorTest
Tests run: 1, Failures: 0, Errors: 0, Skipped: 0, Time elapsed: 4.252 sec
Running org.apache.cxf.binding.soap.SoapBindingTest
Tests run: 1, Failures: 0, Errors: 0, Skipped: 0, Time elapsed: 0.02 sec
Running org.apache.cxf.binding.soap.MustUnderstandInterceptorTest
Tests run: 3, Failures: 0, Errors: 0, Skipped: 0, Time elapsed: 0.391 sec
Running org.apache.cxf.binding.soap.interceptor.SoapFaultSerializerTest
Tests run: 3, Failures: 0, Errors: 0, Skipped: 0, Time elapsed: 2.694 sec
Running org.apache.cxf.binding.soap.SoapActionInterceptorTest
Tests run: 1, Failures: 0, Errors: 0, Skipped: 0, Time elapsed: 0.059 sec
Running org.apache.cxf.binding.soap.ServiceModelUtilTest
Tests run: 1, Failures: 0, Errors: 0, Skipped: 0, Time elapsed: 0.114 sec
Running org.apache.cxf.binding.soap.SoapBindingFactoryTest
Tests run: 2, Failures: 0, Errors: 0, Skipped: 0, Time elapsed: 0.567 sec
Running org.apache.cxf.binding.soap.RPCInInterceptorTest
Tests run: 2, Failures: 0, Errors: 0, Skipped: 0, Time elapsed: 0.587 sec
Running org.apache.cxf.binding.soap.ReadHeaderInterceptorTest
Tests run: 2, Failures: 0, Errors: 0, Skipped: 0, Time elapsed: 0.786 sec
Running org.apache.cxf.binding.soap.SoapOutInterceptorTest
Tests run: 1, Failures: 0, Errors: 0, Skipped: 0, Time elapsed: 0.054 sec

Results :

Tests run: 20, Failures: 0, Errors: 0, Skipped: 0

[INFO] [jar:jar]
[INFO] Building jar: /x1/continuum/working-directory/216/rt/bindings/soap/target/cxf-rt-bindings-soap-2.0-incubator-SNAPSHOT.jar
[INFO] [install:install]
[INFO] Installing /x1/continuum/working-directory/216/rt/bindings/soap/target/cxf-rt-bindings-soap-2.0-incubator-SNAPSHOT.jar to /home/continuum/.m2/repository/org/apache/cxf/cxf-rt-bindings-soap/2.0-incubator-SNAPSHOT/cxf-rt-bindings-soap-2.0-incubator-SNAPSHOT.jar
[INFO] ----------------------------------------------------------------------------
[INFO] Building Apache CXF Runtime Management
[INFO]    task-segment: [clean, install]
[INFO] ----------------------------------------------------------------------------
[INFO] [clean:clean]
[INFO] Deleting directory /x1/continuum/working-directory/216/rt/management/target
[INFO] Deleting directory /x1/continuum/working-directory/216/rt/management/target/classes
[INFO] Deleting directory /x1/continuum/working-directory/216/rt/management/target/test-classes
[INFO] [checkstyle:checkstyle {execution: validate}]
[INFO] Starting audit...
Audit done.

[INFO] Preparing pmd:check
[INFO] [pmd:pmd]
[INFO] [pmd:check {execution: validate}]
[INFO] 
[INFO] [cxf-common-xsd:xsdtojava {execution: generate-sources}]
[INFO] [remote-resources:process {execution: default}]
[INFO] [resources:resources]
[INFO] Using default encoding to copy filtered resources.
[INFO] [compiler:compile]
[INFO] Compiling 20 source files to /x1/continuum/working-directory/216/rt/management/target/classes
[INFO] [resources:testResources]
[INFO] Using default encoding to copy filtered resources.
[INFO] [compiler:testCompile]
[INFO] Compiling 13 source files to /x1/continuum/working-directory/216/rt/management/target/test-classes
[INFO] [surefire:test]
[INFO] Surefire report directory: /x1/continuum/working-directory/216/rt/management/target/surefire-reports

-------------------------------------------------------
 T E S T S
-------------------------------------------------------
Running org.apache.cxf.management.jmx.MBServerConnectorTest
Tests run: 1, Failures: 0, Errors: 0, Skipped: 0, Time elapsed: 1.789 sec
Running org.apache.cxf.management.interceptor.ResponseTimeMessageOutInterceptorTest
Tests run: 3, Failures: 0, Errors: 0, Skipped: 0, Time elapsed: 1.348 sec
Running org.apache.cxf.management.utils.ManagementConsoleTest
Tests run: 1, Failures: 0, Errors: 0, Skipped: 0, Time elapsed: 0.036 sec
Running org.apache.cxf.management.interceptor.ResponseTimeMessageInInterceptorTest
Tests run: 3, Failures: 0, Errors: 0, Skipped: 0, Time elapsed: 0.04 sec
Running org.apache.cxf.management.interceptor.ResponseTimeMessageInvokerInterceptorTest
Tests run: 1, Failures: 0, Errors: 0, Skipped: 0, Time elapsed: 0.044 sec
Running org.apache.cxf.management.counters.CounterRepositoryTest
Tests run: 3, Failures: 0, Errors: 0, Skipped: 0, Time elapsed: 0.05 sec
Running org.apache.cxf.management.InstrumentationManagerTest
Tests run: 2, Failures: 0, Errors: 0, Skipped: 0, Time elapsed: 3.517 sec
Running org.apache.cxf.management.jmx.export.ModelMBeanAssemblerTest
Tests run: 10, Failures: 0, Errors: 0, Skipped: 0, Time elapsed: 0.429 sec
Running org.apache.cxf.management.jmx.JMXManagedComponentManagerTest
Tests run: 2, Failures: 0, Errors: 0, Skipped: 0, Time elapsed: 4.426 sec

Results :

Tests run: 26, Failures: 0, Errors: 0, Skipped: 0

[INFO] [jar:jar]
[INFO] Building jar: /x1/continuum/working-directory/216/rt/management/target/cxf-rt-management-2.0-incubator-SNAPSHOT.jar
[INFO] [install:install]
[INFO] Installing /x1/continuum/working-directory/216/rt/management/target/cxf-rt-management-2.0-incubator-SNAPSHOT.jar to /home/continuum/.m2/repository/org/apache/cxf/cxf-rt-management/2.0-incubator-SNAPSHOT/cxf-rt-management-2.0-incubator-SNAPSHOT.jar
[INFO] ----------------------------------------------------------------------------
[INFO] Building Apache CXF Runtime JMS Transport
[INFO]    task-segment: [clean, install]
[INFO] ----------------------------------------------------------------------------
[INFO] [clean:clean]
[INFO] Deleting directory /x1/continuum/working-directory/216/rt/transports/jms/target
[INFO] Deleting directory /x1/continuum/working-directory/216/rt/transports/jms/target/classes
[INFO] Deleting directory /x1/continuum/working-directory/216/rt/transports/jms/target/test-classes
[INFO] [checkstyle:checkstyle {execution: validate}]
[INFO] Starting audit...
Audit done.

[INFO] Preparing pmd:check
[INFO] [pmd:pmd]
[INFO] [pmd:check {execution: validate}]
[INFO] 
[INFO] [cxf-common-xsd:xsdtojava {execution: generate-sources}]
[INFO] [remote-resources:process {execution: default}]
[INFO] [resources:resources]
[INFO] Using default encoding to copy filtered resources.
[INFO] [compiler:compile]
[INFO] Compiling 27 source files to /x1/continuum/working-directory/216/rt/transports/jms/target/classes
[INFO] [resources:testResources]
[INFO] Using default encoding to copy filtered resources.
[INFO] [compiler:testCompile]
[INFO] Compiling 6 source files to /x1/continuum/working-directory/216/rt/transports/jms/target/test-classes
[INFO] [surefire:test]
[INFO] Surefire report directory: /x1/continuum/working-directory/216/rt/transports/jms/target/surefire-reports

-------------------------------------------------------
 T E S T S
-------------------------------------------------------
Running org.apache.cxf.transport.jms.JMSConduitTest
Tests run: 3, Failures: 0, Errors: 0, Skipped: 0, Time elapsed: 27.072 sec
Running org.apache.cxf.transport.jms.PooledSessionTest
Tests run: 1, Failures: 0, Errors: 0, Skipped: 0, Time elapsed: 0.161 sec
Running org.apache.cxf.transport.jms.JMSDestinationTest
Tests run: 7, Failures: 0, Errors: 0, Skipped: 0, Time elapsed: 25.358 sec
Running org.apache.cxf.transport.jms.JMSUtilsTest
Tests run: 1, Failures: 0, Errors: 0, Skipped: 0, Time elapsed: 0.015 sec

Results :

Tests run: 12, Failures: 0, Errors: 0, Skipped: 0

[INFO] [jar:jar]
[INFO] Building jar: /x1/continuum/working-directory/216/rt/transports/jms/target/cxf-rt-transports-jms-2.0-incubator-SNAPSHOT.jar
[INFO] [install:install]
[INFO] Installing /x1/continuum/working-directory/216/rt/transports/jms/target/cxf-rt-transports-jms-2.0-incubator-SNAPSHOT.jar to /home/continuum/.m2/repository/org/apache/cxf/cxf-rt-transports-jms/2.0-incubator-SNAPSHOT/cxf-rt-transports-jms-2.0-incubator-SNAPSHOT.jar
[INFO] ----------------------------------------------------------------------------
[INFO] Building Apache CXF Runtime XML Binding
[INFO]    task-segment: [clean, install]
[INFO] ----------------------------------------------------------------------------
[INFO] [clean:clean]
[INFO] Deleting directory /x1/continuum/working-directory/216/rt/bindings/xml/target
[INFO] Deleting directory /x1/continuum/working-directory/216/rt/bindings/xml/target/classes
[INFO] Deleting directory /x1/continuum/working-directory/216/rt/bindings/xml/target/test-classes
[INFO] [checkstyle:checkstyle {execution: validate}]
[INFO] Starting audit...
Audit done.

[INFO] Preparing pmd:check
[INFO] [pmd:pmd]
[INFO] [pmd:check {execution: validate}]
[INFO] 
[INFO] [cxf-common-xsd:xsdtojava {execution: generate-sources}]
[INFO] [remote-resources:process {execution: default}]
[INFO] [resources:resources]
[INFO] Using default encoding to copy filtered resources.
[INFO] [compiler:compile]
[INFO] Compiling 17 source files to /x1/continuum/working-directory/216/rt/bindings/xml/target/classes
[INFO] [resources:testResources]
[INFO] Using default encoding to copy filtered resources.
[INFO] [compiler:testCompile]
[INFO] Compiling 6 source files to /x1/continuum/working-directory/216/rt/bindings/xml/target/test-classes
[INFO] [surefire:test]
[INFO] Surefire report directory: /x1/continuum/working-directory/216/rt/bindings/xml/target/surefire-reports

-------------------------------------------------------
 T E S T S
-------------------------------------------------------
Running org.apache.cxf.binding.xml.interceptor.XMLMessageOutInterceptorTest
Tests run: 3, Failures: 0, Errors: 0, Skipped: 0, Time elapsed: 5.666 sec
Running org.apache.cxf.binding.xml.interceptor.XMLMessageInInterceptorTest
Tests run: 3, Failures: 0, Errors: 0, Skipped: 0, Time elapsed: 0.876 sec
Running org.apache.cxf.binding.xml.interceptor.XMLFaultInterceptorsTest
Tests run: 1, Failures: 0, Errors: 0, Skipped: 0, Time elapsed: 0.254 sec
Running org.apache.cxf.binding.xml.interceptor.XMLFaultOutInterceptorTest
Tests run: 1, Failures: 0, Errors: 0, Skipped: 0, Time elapsed: 0.048 sec
Running org.apache.cxf.binding.xml.XMLBindingFactoryTest
Tests run: 1, Failures: 0, Errors: 0, Skipped: 0, Time elapsed: 0.006 sec

Results :

Tests run: 9, Failures: 0, Errors: 0, Skipped: 0

[INFO] [jar:jar]
[INFO] Building jar: /x1/continuum/working-directory/216/rt/bindings/xml/target/cxf-rt-bindings-xml-2.0-incubator-SNAPSHOT.jar
[INFO] [install:install]
[INFO] Installing /x1/continuum/working-directory/216/rt/bindings/xml/target/cxf-rt-bindings-xml-2.0-incubator-SNAPSHOT.jar to /home/continuum/.m2/repository/org/apache/cxf/cxf-rt-bindings-xml/2.0-incubator-SNAPSHOT/cxf-rt-bindings-xml-2.0-incubator-SNAPSHOT.jar
[INFO] ----------------------------------------------------------------------------
[INFO] Building Apache CXF Command Line Tools WSDLTo Test
[INFO]    task-segment: [clean, install]
[INFO] ----------------------------------------------------------------------------
[INFO] [clean:clean]
[INFO] Deleting directory /x1/continuum/working-directory/216/tools/wsdlto/test/target
[INFO] Deleting directory /x1/continuum/working-directory/216/tools/wsdlto/test/target/classes
[INFO] Deleting directory /x1/continuum/working-directory/216/tools/wsdlto/test/target/test-classes
[INFO] [checkstyle:checkstyle {execution: validate}]
[INFO] Starting audit...
Audit done.

[INFO] Preparing pmd:check
[INFO] [pmd:pmd]
[INFO] [pmd:check {execution: validate}]
[INFO] 
[INFO] [remote-resources:process {execution: default}]
[INFO] [resources:resources]
[INFO] Using default encoding to copy filtered resources.
[INFO] [compiler:compile]
[INFO] No sources to compile
[INFO] [resources:testResources]
[INFO] Using default encoding to copy filtered resources.
[INFO] [compiler:testCompile]
[INFO] Compiling 8 source files to /x1/continuum/working-directory/216/tools/wsdlto/test/target/test-classes
[INFO] [surefire:test]
[INFO] Surefire report directory: /x1/continuum/working-directory/216/tools/wsdlto/test/target/surefire-reports

-------------------------------------------------------
 T E S T S
-------------------------------------------------------
Running org.apache.cxf.tools.wsdlto.WSDLToJavaTest
Tests run: 3, Failures: 0, Errors: 0, Skipped: 0, Time elapsed: 4.208 sec
Running org.apache.cxf.tools.wsdlto.jaxws.wsdl11.JAXWSDefinitionBuilderTest
Tests run: 2, Failures: 0, Errors: 0, Skipped: 0, Time elapsed: 3.373 sec
Running org.apache.cxf.tools.wsdlto.jaxws.CodeGenOptionTest
Tests run: 3, Failures: 0, Errors: 0, Skipped: 0, Time elapsed: 20.501 sec
Running org.apache.cxf.tools.wsdlto.validator.ValidatorTest
Tests run: 1, Failures: 0, Errors: 0, Skipped: 0, Time elapsed: 0.349 sec
Running org.apache.cxf.tools.wsdlto.jaxws.JAXWSContainerTest
Tests run: 2, Failures: 0, Errors: 0, Skipped: 0, Time elapsed: 1.316 sec
Running org.apache.cxf.tools.wsdlto.core.PluginLoaderTest
Tests run: 1, Failures: 0, Errors: 0, Skipped: 0, Time elapsed: 0.01 sec
Running org.apache.cxf.tools.wsdlto.jaxws.CodeGenBugTest
2007-06-12 03:20:30.636::INFO:  Logging to STDERR via org.mortbay.log.StdErrLog
2007-06-12 03:20:30.763::INFO:  jetty-6.1.3
2007-06-12 03:20:30.814::INFO:  Started SocketConnector @ 0.0.0.0:8585
2007-06-12 03:20:35.388::WARN:  handle failed
java.lang.InterruptedException
	at org.mortbay.jetty.HttpParser.parseNext(HttpParser.java:289)
	at org.mortbay.jetty.HttpParser.parseAvailable(HttpParser.java:202)
	at org.mortbay.jetty.HttpConnection.handle(HttpConnection.java:378)
	at org.mortbay.jetty.bio.SocketConnector$Connection.run(SocketConnector.java:226)
	at org.mortbay.thread.BoundedThreadPool$PoolThread.run(BoundedThreadPool.java:442)
Tests run: 26, Failures: 0, Errors: 0, Skipped: 0, Time elapsed: 89.258 sec
Running org.apache.cxf.tools.wsdlto.jaxws.CodeGenTest
Tests run: 29, Failures: 0, Errors: 0, Skipped: 1, Time elapsed: 70.769 sec

Results :

Tests run: 67, Failures: 0, Errors: 0, Skipped: 1

[INFO] [jar:jar]
[INFO] Building jar: /x1/continuum/working-directory/216/tools/wsdlto/test/target/cxf-tools-wsdlto-test-2.0-incubator-SNAPSHOT.jar
[INFO] [install:install]
[INFO] Installing /x1/continuum/working-directory/216/tools/wsdlto/test/target/cxf-tools-wsdlto-test-2.0-incubator-SNAPSHOT.jar to /home/continuum/.m2/repository/org/apache/cxf/cxf-tools-wsdlto-test/2.0-incubator-SNAPSHOT/cxf-tools-wsdlto-test-2.0-incubator-SNAPSHOT.jar
[INFO] ----------------------------------------------------------------------------
[INFO] Building Apache CXF Command Line Tools WSDLTo Misctools
[INFO]    task-segment: [clean, install]
[INFO] ----------------------------------------------------------------------------
[INFO] [clean:clean]
[INFO] Deleting directory /x1/continuum/working-directory/216/tools/wsdlto/misc/target
[INFO] Deleting directory /x1/continuum/working-directory/216/tools/wsdlto/misc/target/classes
[INFO] Deleting directory /x1/continuum/working-directory/216/tools/wsdlto/misc/target/test-classes
[INFO] [checkstyle:checkstyle {execution: validate}]
[INFO] Starting audit...
Audit done.

[INFO] Preparing pmd:check
[INFO] [pmd:pmd]
[INFO] [pmd:check {execution: validate}]
[INFO] 
[INFO] [remote-resources:process {execution: default}]
[INFO] [resources:resources]
[INFO] Using default encoding to copy filtered resources.
[INFO] [compiler:compile]
[INFO] Compiling 14 source files to /x1/continuum/working-directory/216/tools/wsdlto/misc/target/classes
[INFO] [resources:testResources]
[INFO] Using default encoding to copy filtered resources.
[INFO] [compiler:testCompile]
[INFO] Compiling 4 source files to /x1/continuum/working-directory/216/tools/wsdlto/misc/target/test-classes
[INFO] [surefire:test]
[INFO] Surefire report directory: /x1/continuum/working-directory/216/tools/wsdlto/misc/target/surefire-reports

-------------------------------------------------------
 T E S T S
-------------------------------------------------------
Running org.apache.cxf.tools.misc.processor.WSDLToServiceProcessorTest
Tests run: 6, Failures: 0, Errors: 0, Skipped: 0, Time elapsed: 4.612 sec
Running org.apache.cxf.tools.misc.processor.WSDLToXMLProcessorTest
Tests run: 1, Failures: 0, Errors: 0, Skipped: 0, Time elapsed: 0.353 sec
Running org.apache.cxf.tools.misc.processor.XSDToWSDLProcessorTest
Tests run: 2, Failures: 0, Errors: 0, Skipped: 0, Time elapsed: 0.231 sec
Running org.apache.cxf.tools.misc.processor.WSDLToSoapProcessorTest
Tests run: 9, Failures: 0, Errors: 0, Skipped: 0, Time elapsed: 1.383 sec

Results :

Tests run: 18, Failures: 0, Errors: 0, Skipped: 0

[INFO] [jar:jar]
[INFO] Building jar: /x1/continuum/working-directory/216/tools/wsdlto/misc/target/cxf-tools-misctools-2.0-incubator-SNAPSHOT.jar
[INFO] [install:install]
[INFO] Installing /x1/continuum/working-directory/216/tools/wsdlto/misc/target/cxf-tools-misctools-2.0-incubator-SNAPSHOT.jar to /home/continuum/.m2/repository/org/apache/cxf/cxf-tools-misctools/2.0-incubator-SNAPSHOT/cxf-tools-misctools-2.0-incubator-SNAPSHOT.jar
[INFO] ----------------------------------------------------------------------------
[INFO] Building Apache CXF Command Line Tools
[INFO]    task-segment: [clean, install]
[INFO] ----------------------------------------------------------------------------
[INFO] [clean:clean]
[INFO] Deleting directory /x1/continuum/working-directory/216/tools/target
[INFO] Deleting directory /x1/continuum/working-directory/216/tools/target/classes
[INFO] Deleting directory /x1/continuum/working-directory/216/tools/target/test-classes
[INFO] [site:attach-descriptor]
[INFO] [install:install]
[INFO] Installing /x1/continuum/working-directory/216/tools/pom.xml to /home/continuum/.m2/repository/org/apache/cxf/cxf-tools/2.0-incubator-SNAPSHOT/cxf-tools-2.0-incubator-SNAPSHOT.pom
[INFO] ----------------------------------------------------------------------------
[INFO] Building Apache CXF Command Line Tools WSDLTo
[INFO]    task-segment: [clean, install]
[INFO] ----------------------------------------------------------------------------
[INFO] [clean:clean]
[INFO] Deleting directory /x1/continuum/working-directory/216/tools/wsdlto/target
[INFO] Deleting directory /x1/continuum/working-directory/216/tools/wsdlto/target/classes
[INFO] Deleting directory /x1/continuum/working-directory/216/tools/wsdlto/target/test-classes
[INFO] [site:attach-descriptor]
[INFO] [install:install]
[INFO] Installing /x1/continuum/working-directory/216/tools/wsdlto/pom.xml to /home/continuum/.m2/repository/org/apache/cxf/cxf-tools-wsdlto/2.0-incubator-SNAPSHOT/cxf-tools-wsdlto-2.0-incubator-SNAPSHOT.pom
[INFO] ----------------------------------------------------------------------------
[INFO] Building Apache CXF Runtime Local transport
[INFO]    task-segment: [clean, install]
[INFO] ----------------------------------------------------------------------------
[INFO] [clean:clean]
[INFO] Deleting directory /x1/continuum/working-directory/216/rt/transports/local/target
[INFO] Deleting directory /x1/continuum/working-directory/216/rt/transports/local/target/classes
[INFO] Deleting directory /x1/continuum/working-directory/216/rt/transports/local/target/test-classes
[INFO] [checkstyle:checkstyle {execution: validate}]
[INFO] Starting audit...
Audit done.

[INFO] Preparing pmd:check
[INFO] [pmd:pmd]
[INFO] [pmd:check {execution: validate}]
[INFO] 
[INFO] [remote-resources:process {execution: default}]
[INFO] [resources:resources]
[INFO] Using default encoding to copy filtered resources.
[INFO] [compiler:compile]
[INFO] Compiling 3 source files to /x1/continuum/working-directory/216/rt/transports/local/target/classes
[INFO] [resources:testResources]
[INFO] Using default encoding to copy filtered resources.
[INFO] [compiler:testCompile]
[INFO] Compiling 1 source file to /x1/continuum/working-directory/216/rt/transports/local/target/test-classes
[INFO] [surefire:test]
[INFO] Surefire report directory: /x1/continuum/working-directory/216/rt/transports/local/target/surefire-reports

-------------------------------------------------------
 T E S T S
-------------------------------------------------------
Running org.apache.cxf.transport.local.LocalTransportFactoryTest
Tests run: 2, Failures: 0, Errors: 0, Skipped: 0, Time elapsed: 0.209 sec

Results :

Tests run: 2, Failures: 0, Errors: 0, Skipped: 0

[INFO] [jar:jar]
[INFO] Building jar: /x1/continuum/working-directory/216/rt/transports/local/target/cxf-rt-transports-local-2.0-incubator-SNAPSHOT.jar
[INFO] [install:install]
[INFO] Installing /x1/continuum/working-directory/216/rt/transports/local/target/cxf-rt-transports-local-2.0-incubator-SNAPSHOT.jar to /home/continuum/.m2/repository/org/apache/cxf/cxf-rt-transports-local/2.0-incubator-SNAPSHOT/cxf-rt-transports-local-2.0-incubator-SNAPSHOT.jar
[INFO] ----------------------------------------------------------------------------
[INFO] Building Apache CXF Runtime Simple Frontend
[INFO]    task-segment: [clean, install]
[INFO] ----------------------------------------------------------------------------
[INFO] [clean:clean]
[INFO] Deleting directory /x1/continuum/working-directory/216/rt/frontend/simple/target
[INFO] Deleting directory /x1/continuum/working-directory/216/rt/frontend/simple/target/classes
[INFO] Deleting directory /x1/continuum/working-directory/216/rt/frontend/simple/target/test-classes
[INFO] [checkstyle:checkstyle {execution: validate}]
[INFO] Starting audit...
Audit done.

[INFO] Preparing pmd:check
[INFO] [pmd:pmd]
[INFO] [pmd:check {execution: validate}]
[INFO] 
[INFO] [remote-resources:process {execution: default}]
[INFO] [resources:resources]
[INFO] Using default encoding to copy filtered resources.
[INFO] [compiler:compile]
[INFO] Compiling 14 source files to /x1/continuum/working-directory/216/rt/frontend/simple/target/classes
[INFO] [resources:testResources]
[INFO] Using default encoding to copy filtered resources.
[INFO] [compiler:testCompile]
[INFO] Compiling 9 source files to /x1/continuum/working-directory/216/rt/frontend/simple/target/test-classes
[INFO] [surefire:test]
[INFO] Surefire report directory: /x1/continuum/working-directory/216/rt/frontend/simple/target/surefire-reports

-------------------------------------------------------
 T E S T S
-------------------------------------------------------
Running org.apache.cxf.frontend.spring.SpringBeansTest
Tests run: 2, Failures: 0, Errors: 0, Skipped: 0, Time elapsed: 5.71 sec
Running org.apache.cxf.service.factory.ClientFactoryBeanTest
Tests run: 2, Failures: 0, Errors: 0, Skipped: 0, Time elapsed: 1.165 sec
Running org.apache.cxf.frontend.soap.SoapBindingSelectionTest
Tests run: 1, Failures: 0, Errors: 0, Skipped: 1, Time elapsed: 0.016 sec
Running org.apache.cxf.service.factory.ServerFactoryTest
Tests run: 2, Failures: 0, Errors: 0, Skipped: 0, Time elapsed: 0.847 sec
Running org.apache.cxf.service.factory.ReflectionServiceFactoryTest
Tests run: 3, Failures: 0, Errors: 0, Skipped: 0, Time elapsed: 1.169 sec
Running org.apache.cxf.service.factory.RountripTest
Tests run: 1, Failures: 0, Errors: 0, Skipped: 0, Time elapsed: 0.975 sec

Results :

Tests run: 11, Failures: 0, Errors: 0, Skipped: 1

[INFO] [jar:jar]
[INFO] Building jar: /x1/continuum/working-directory/216/rt/frontend/simple/target/cxf-rt-frontend-simple-2.0-incubator-SNAPSHOT.jar
[INFO] [install:install]
[INFO] Installing /x1/continuum/working-directory/216/rt/frontend/simple/target/cxf-rt-frontend-simple-2.0-incubator-SNAPSHOT.jar to /home/continuum/.m2/repository/org/apache/cxf/cxf-rt-frontend-simple/2.0-incubator-SNAPSHOT/cxf-rt-frontend-simple-2.0-incubator-SNAPSHOT.jar
[INFO] ----------------------------------------------------------------------------
[INFO] Building Apache CXF Runtime JAX-WS Frontend
[INFO]    task-segment: [clean, install]
[INFO] ----------------------------------------------------------------------------
[INFO] [clean:clean]
[INFO] Deleting directory /x1/continuum/working-directory/216/rt/frontend/jaxws/target
[INFO] Deleting directory /x1/continuum/working-directory/216/rt/frontend/jaxws/target/classes
[INFO] Deleting directory /x1/continuum/working-directory/216/rt/frontend/jaxws/target/test-classes
[INFO] [checkstyle:checkstyle {execution: validate}]
[INFO] Starting audit...
Audit done.

[INFO] Preparing pmd:check
[INFO] [pmd:pmd]
[INFO] [pmd:check {execution: validate}]
[INFO] 
[INFO] [build-helper:add-source {execution: add-source}]
[INFO] Source directory: /x1/continuum/working-directory/216/rt/frontend/jaxws/src/main/generated added.
[INFO] [remote-resources:process {execution: default}]
[INFO] [resources:resources]
[INFO] Using default encoding to copy filtered resources.
[INFO] [compiler:compile]
[INFO] Compiling 134 source files to /x1/continuum/working-directory/216/rt/frontend/jaxws/target/classes
[INFO] [resources:testResources]
[INFO] Using default encoding to copy filtered resources.
[INFO] [compiler:testCompile]
[INFO] Compiling 57 source files to /x1/continuum/working-directory/216/rt/frontend/jaxws/target/test-classes
[INFO] [surefire:test]
[INFO] Surefire report directory: /x1/continuum/working-directory/216/rt/frontend/jaxws/target/surefire-reports

-------------------------------------------------------
 T E S T S
-------------------------------------------------------
Running org.apache.cxf.jaxws.JaxWsClientTest
Tests run: 3, Failures: 0, Errors: 0, Skipped: 0, Time elapsed: 7.348 sec
Running org.apache.cxf.jaxws.header.HeaderClientServerTest
Tests run: 9, Failures: 0, Errors: 0, Skipped: 0, Time elapsed: 8.929 sec
Running org.apache.cxf.jaxws.SOAPBindingTest
Tests run: 2, Failures: 0, Errors: 0, Skipped: 0, Time elapsed: 0.964 sec
Running org.apache.cxf.jaxws.holder.HolderTest
Tests run: 2, Failures: 0, Errors: 0, Skipped: 0, Time elapsed: 2.846 sec
Running org.apache.cxf.jaxws.provider.ProviderServiceFactoryTest
Tests run: 6, Failures: 0, Errors: 0, Skipped: 0, Time elapsed: 3.624 sec
Running org.apache.cxf.jaxws.javaee.WebservicesTypeTest
Tests run: 1, Failures: 0, Errors: 0, Skipped: 0, Time elapsed: 0.392 sec
Running org.apache.cxf.jaxws.ServiceModelUtilsTest
Tests run: 4, Failures: 0, Errors: 0, Skipped: 0, Time elapsed: 2.013 sec
Running org.apache.cxf.jaxws.handler.InitParamResourceResolverTest
Tests run: 9, Failures: 0, Errors: 0, Skipped: 0, Time elapsed: 0.046 sec
Running org.apache.cxf.jaxws.HeaderTest
Tests run: 1, Failures: 0, Errors: 0, Skipped: 0, Time elapsed: 0.593 sec
Running org.apache.cxf.jaxws.handler.AbstractProtocolHandlerInterceptorTest
Tests run: 2, Failures: 0, Errors: 0, Skipped: 0, Time elapsed: 0.682 sec
Running org.apache.cxf.jaxws.handler.soap.SOAPHandlerInterceptorTest
Tests run: 5, Failures: 0, Errors: 0, Skipped: 0, Time elapsed: 0.468 sec
Running org.apache.cxf.jaxws.GreeterTest
Tests run: 1, Failures: 0, Errors: 0, Skipped: 0, Time elapsed: 0.496 sec
Running org.apache.cxf.jaxws.CodeFirstTest
Tests run: 8, Failures: 0, Errors: 0, Skipped: 0, Time elapsed: 3.906 sec
Running org.apache.cxf.jaxws.spring.SpringBeansTest
Tests run: 3, Failures: 0, Errors: 0, Skipped: 0, Time elapsed: 3.062 sec
Running org.apache.cxf.jaxws.handler.LogicalHandlerInterceptorTest
Tests run: 1, Failures: 0, Errors: 0, Skipped: 0, Time elapsed: 0.047 sec
Running org.apache.cxf.jaxws.context.WebServiceContextImplTest
Tests run: 2, Failures: 0, Errors: 0, Skipped: 0, Time elapsed: 0.015 sec
Running org.apache.cxf.jaxws.JAXWSMethodInvokerTest
Tests run: 1, Failures: 0, Errors: 0, Skipped: 0, Time elapsed: 0.046 sec
Running org.apache.cxf.jaxws.SoapFaultTest
Tests run: 2, Failures: 0, Errors: 0, Skipped: 0, Time elapsed: 1.921 sec
Running org.apache.cxf.jaxws.provider.ProviderTest
Tests run: 1, Failures: 0, Errors: 0, Skipped: 0, Time elapsed: 0.373 sec
Running org.apache.cxf.jaxws.ServiceImplTest
Tests run: 10, Failures: 0, Errors: 0, Skipped: 1, Time elapsed: 3.046 sec
Running org.apache.cxf.jaxws.support.JaxWsServiceFactoryBeanTest
Tests run: 3, Failures: 0, Errors: 0, Skipped: 0, Time elapsed: 1.068 sec
Running org.apache.cxf.jaxws.dispatch.DispatchTest
Tests run: 5, Failures: 0, Errors: 0, Skipped: 0, Time elapsed: 1.569 sec
Running org.apache.cxf.jaxws.handler.AnnotationHandlerChainBuilderTest
Tests run: 2, Failures: 0, Errors: 0, Skipped: 0, Time elapsed: 0.992 sec
Running org.apache.cxf.jaxws.ConfiguredEndpointTest
Tests run: 8, Failures: 0, Errors: 0, Skipped: 2, Time elapsed: 2.536 sec
Running org.apache.cxf.jaxws.support.ContextPropertiesMappingTest
Tests run: 5, Failures: 0, Errors: 0, Skipped: 0, Time elapsed: 0.043 sec
Running org.apache.cxf.jaxws.JaxWsServerFactoryBeanTest
Tests run: 5, Failures: 0, Errors: 0, Skipped: 0, Time elapsed: 1.767 sec
Running org.apache.cxf.jaxws.CodeFirstWSDLTest
Tests run: 2, Failures: 0, Errors: 0, Skipped: 0, Time elapsed: 0.694 sec
Running org.apache.cxf.jaxws.URIMappingInterceptorDocLitTest
Tests run: 5, Failures: 0, Errors: 0, Skipped: 0, Time elapsed: 1.479 sec
Running org.apache.cxf.jaxws.support.JaxWsImplementorInfoTest
Tests run: 1, Failures: 0, Errors: 0, Skipped: 0, Time elapsed: 0.007 sec
Running org.apache.cxf.jaxws.support.JaxWsServiceConfigurationTest
Tests run: 6, Failures: 0, Errors: 0, Skipped: 0, Time elapsed: 0.099 sec
Running org.apache.cxf.jaxws.handler.HandlerChainInvokerTest
Tests run: 22, Failures: 0, Errors: 0, Skipped: 0, Time elapsed: 0.137 sec
Running org.apache.cxf.jaxws.handler.LogicalMessageImplTest
Tests run: 1, Failures: 0, Errors: 0, Skipped: 0, Time elapsed: 0.029 sec
Running org.apache.cxf.jaxws.EndpointImplTest
Tests run: 5, Failures: 0, Errors: 0, Skipped: 0, Time elapsed: 1.595 sec
Running org.apache.cxf.jaxws.handler.HandlerChainBuilderTest
Tests run: 5, Failures: 0, Errors: 0, Skipped: 0, Time elapsed: 0.032 sec
Running org.apache.cxf.jaxws.URIMappingInterceptorRPCTest
Tests run: 6, Failures: 0, Errors: 0, Skipped: 0, Time elapsed: 1.868 sec

Results :

Tests run: 154, Failures: 0, Errors: 0, Skipped: 3

[INFO] [jar:jar]
[INFO] Building jar: /x1/continuum/working-directory/216/rt/frontend/jaxws/target/cxf-rt-frontend-jaxws-2.0-incubator-SNAPSHOT.jar
[INFO] [install:install]
[INFO] Installing /x1/continuum/working-directory/216/rt/frontend/jaxws/target/cxf-rt-frontend-jaxws-2.0-incubator-SNAPSHOT.jar to /home/continuum/.m2/repository/org/apache/cxf/cxf-rt-frontend-jaxws/2.0-incubator-SNAPSHOT/cxf-rt-frontend-jaxws-2.0-incubator-SNAPSHOT.jar
[INFO] ----------------------------------------------------------------------------
[INFO] Building Apache CXF Command Line Tools JavaTo Test
[INFO]    task-segment: [clean, install]
[INFO] ----------------------------------------------------------------------------
[INFO] [clean:clean]
[INFO] Deleting directory /x1/continuum/working-directory/216/tools/javato/test/target
[INFO] Deleting directory /x1/continuum/working-directory/216/tools/javato/test/target/classes
[INFO] Deleting directory /x1/continuum/working-directory/216/tools/javato/test/target/test-classes
[INFO] [checkstyle:checkstyle {execution: validate}]
[INFO] Starting audit...
Audit done.

[INFO] Preparing pmd:check
[INFO] [pmd:pmd]
[INFO] [pmd:check {execution: validate}]
[INFO] 
[INFO] [remote-resources:process {execution: default}]
[INFO] [resources:resources]
[INFO] Using default encoding to copy filtered resources.
[INFO] [compiler:compile]
[INFO] No sources to compile
[INFO] [cxf-codegen:wsdl2java {execution: generate-test-sources}]
[INFO] [build-helper:add-source {execution: add-source}]
[INFO] Source directory: /x1/continuum/working-directory/216/tools/javato/test/src/test/generated added.
[INFO] [resources:testResources]
[INFO] Using default encoding to copy filtered resources.
[INFO] [compiler:testCompile]
[INFO] Compiling 119 source files to /x1/continuum/working-directory/216/tools/javato/test/target/test-classes
[INFO] [surefire:test]
[INFO] Surefire report directory: /x1/continuum/working-directory/216/tools/javato/test/target/surefire-reports

-------------------------------------------------------
 T E S T S
-------------------------------------------------------
Running org.apache.cxf.tools.java2wsdl.generator.WSDLGeneratorFactoryTest
Tests run: 1, Failures: 0, Errors: 0, Skipped: 0, Time elapsed: 0.067 sec
Running org.apache.cxf.tools.java2wsdl.processor.internal.jaxws.FaultBeanTest
Tests run: 1, Failures: 0, Errors: 0, Skipped: 0, Time elapsed: 0.104 sec
Running org.apache.cxf.tools.java2wsdl.processor.internal.jaxws.RequestWrapperTest
Tests run: 4, Failures: 0, Errors: 0, Skipped: 0, Time elapsed: 4.894 sec
Running org.apache.cxf.tools.java2wsdl.generator.wsdl11.annotator.WrapperBeanAnnotatorTest
Tests run: 1, Failures: 0, Errors: 0, Skipped: 0, Time elapsed: 0.013 sec
Running org.apache.cxf.tools.java2wsdl.generator.wsdl11.WrapperBeanGeneratorTest
Tests run: 2, Failures: 0, Errors: 0, Skipped: 0, Time elapsed: 11.913 sec
Running org.apache.cxf.tools.java2wsdl.generator.wsdl11.annotator.WrapperBeanFieldAnnotatorTest
Tests run: 1, Failures: 0, Errors: 0, Skipped: 0, Time elapsed: 0.037 sec
Running org.apache.cxf.tools.java2wsdl.processor.FrontendFactoryTest
Tests run: 3, Failures: 0, Errors: 0, Skipped: 0, Time elapsed: 0.466 sec
Running org.apache.cxf.tools.java2wsdl.processor.internal.jaxws.WrapperTest
Tests run: 3, Failures: 0, Errors: 0, Skipped: 0, Time elapsed: 0.039 sec
Running org.apache.cxf.tools.java2wsdl.processor.internal.jaxws.JaxwsServiceBuilderRPCTest
Tests run: 1, Failures: 0, Errors: 0, Skipped: 1, Time elapsed: 0.014 sec
Running org.apache.cxf.tools.java2wsdl.processor.internal.jaxws.JaxwsServiceBuilderTest
Tests run: 1, Failures: 0, Errors: 0, Skipped: 1, Time elapsed: 0.002 sec
Running org.apache.cxf.tools.java2wsdl.processor.JavaToProcessorTest
Tests run: 15, Failures: 0, Errors: 0, Skipped: 2, Time elapsed: 60.179 sec
Running org.apache.cxf.tools.java2wsdl.processor.internal.jaxws.WrapperUtilTest
Tests run: 2, Failures: 0, Errors: 0, Skipped: 0, Time elapsed: 0.251 sec
Running org.apache.cxf.tools.java2wsdl.processor.internal.jaxws.JaxwsServiceBuilderNoAnnoTest
Tests run: 3, Failures: 0, Errors: 0, Skipped: 0, Time elapsed: 0.348 sec
Running org.apache.cxf.tools.java2wsdl.processor.internal.ServiceBuilderFactoryTest
Tests run: 3, Failures: 0, Errors: 0, Skipped: 0, Time elapsed: 0.342 sec
Running org.apache.cxf.tools.java2wsdl.generator.wsdl11.FaultBeanGeneratorTest
Tests run: 3, Failures: 0, Errors: 0, Skipped: 0, Time elapsed: 9.103 sec
Running org.apache.cxf.tools.java2wsdl.JavaToWSDLTest
Tests run: 7, Failures: 0, Errors: 0, Skipped: 0, Time elapsed: 4.9 sec
Running org.apache.cxf.tools.java2wsdl.processor.internal.jaxws.ResponseWrapperTest
Tests run: 2, Failures: 0, Errors: 0, Skipped: 0, Time elapsed: 0.179 sec

Results :

Tests run: 53, Failures: 0, Errors: 0, Skipped: 4

[INFO] [jar:jar]
[INFO] Building jar: /x1/continuum/working-directory/216/tools/javato/test/target/cxf-tools-java2wsdl-test-2.0-incubator-SNAPSHOT.jar
[INFO] [install:install]
[INFO] Installing /x1/continuum/working-directory/216/tools/javato/test/target/cxf-tools-java2wsdl-test-2.0-incubator-SNAPSHOT.jar to /home/continuum/.m2/repository/org/apache/cxf/cxf-tools-java2wsdl-test/2.0-incubator-SNAPSHOT/cxf-tools-java2wsdl-test-2.0-incubator-SNAPSHOT.jar
[INFO] ----------------------------------------------------------------------------
[INFO] Building Apache CXF Command Line Tools JavaTo
[INFO]    task-segment: [clean, install]
[INFO] ----------------------------------------------------------------------------
[INFO] [clean:clean]
[INFO] Deleting directory /x1/continuum/working-directory/216/tools/javato/target
[INFO] Deleting directory /x1/continuum/working-directory/216/tools/javato/target/classes
[INFO] Deleting directory /x1/continuum/working-directory/216/tools/javato/target/test-classes
[INFO] [site:attach-descriptor]
[INFO] [install:install]
[INFO] Installing /x1/continuum/working-directory/216/tools/javato/pom.xml to /home/continuum/.m2/repository/org/apache/cxf/cxf-tools-javato/2.0-incubator-SNAPSHOT/cxf-tools-javato-2.0-incubator-SNAPSHOT.pom
[INFO] ----------------------------------------------------------------------------
[INFO] Building Apache CXF Runtime HTTP transport
[INFO]    task-segment: [clean, install]
[INFO] ----------------------------------------------------------------------------
[INFO] [clean:clean]
[INFO] Deleting directory /x1/continuum/working-directory/216/rt/transports/http/target
[INFO] Deleting directory /x1/continuum/working-directory/216/rt/transports/http/target/classes
[INFO] Deleting directory /x1/continuum/working-directory/216/rt/transports/http/target/test-classes
[INFO] [checkstyle:checkstyle {execution: validate}]
[INFO] Starting audit...
Audit done.

[INFO] Preparing pmd:check
[INFO] [pmd:pmd]
[INFO] [pmd:check {execution: validate}]
[INFO] 
[INFO] [cxf-common-xsd:xsdtojava {execution: generate-sources}]
[INFO] [remote-resources:process {execution: default}]
[INFO] [resources:resources]
[INFO] Using default encoding to copy filtered resources.
[INFO] [compiler:compile]
[INFO] Compiling 40 source files to /x1/continuum/working-directory/216/rt/transports/http/target/classes
[INFO] [resources:testResources]
[INFO] Using default encoding to copy filtered resources.
[INFO] [compiler:testCompile]
[INFO] Compiling 6 source files to /x1/continuum/working-directory/216/rt/transports/http/target/test-classes
[INFO] [surefire:test]
[INFO] Surefire report directory: /x1/continuum/working-directory/216/rt/transports/http/target/surefire-reports

-------------------------------------------------------
 T E S T S
-------------------------------------------------------
Running org.apache.cxf.transport.http.policy.PolicyUtilsTest
Tests run: 12, Failures: 0, Errors: 0, Skipped: 0, Time elapsed: 0.714 sec
Running org.apache.cxf.transport.http.policy.HTTPClientAssertionBuilderTest
Tests run: 3, Failures: 0, Errors: 0, Skipped: 0, Time elapsed: 0.148 sec
Running org.apache.cxf.transport.http.HTTPConduitTest
Tests run: 3, Failures: 0, Errors: 0, Skipped: 0, Time elapsed: 0.307 sec
Running org.apache.cxf.transport.http.HTTPConduitURLEasyMockTest
Tests run: 5, Failures: 0, Errors: 0, Skipped: 0, Time elapsed: 2.165 sec
Running org.apache.cxf.transport.http.HTTPConduitURLConnectionTest
Tests run: 3, Failures: 0, Errors: 0, Skipped: 0, Time elapsed: 3.469 sec
Running org.apache.cxf.transport.http.policy.HTTPServerAssertionBuilderTest
Tests run: 3, Failures: 0, Errors: 0, Skipped: 0, Time elapsed: 0.058 sec

Results :

Tests run: 29, Failures: 0, Errors: 0, Skipped: 0

[INFO] [jar:jar]
[INFO] Building jar: /x1/continuum/working-directory/216/rt/transports/http/target/cxf-rt-transports-http-2.0-incubator-SNAPSHOT.jar
[INFO] [install:install]
[INFO] Installing /x1/continuum/working-directory/216/rt/transports/http/target/cxf-rt-transports-http-2.0-incubator-SNAPSHOT.jar to /home/continuum/.m2/repository/org/apache/cxf/cxf-rt-transports-http/2.0-incubator-SNAPSHOT/cxf-rt-transports-http-2.0-incubator-SNAPSHOT.jar
[INFO] ----------------------------------------------------------------------------
[INFO] Building Apache CXF Runtime HTTP Jetty transport
[INFO]    task-segment: [clean, install]
[INFO] ----------------------------------------------------------------------------
[INFO] [clean:clean]
[INFO] Deleting directory /x1/continuum/working-directory/216/rt/transports/http-jetty/target
[INFO] Deleting directory /x1/continuum/working-directory/216/rt/transports/http-jetty/target/classes
[INFO] Deleting directory /x1/continuum/working-directory/216/rt/transports/http-jetty/target/test-classes
[INFO] [checkstyle:checkstyle {execution: validate}]
[INFO] Starting audit...
Audit done.

[INFO] Preparing pmd:check
[INFO] [pmd:pmd]
[INFO] [pmd:check {execution: validate}]
[INFO] 
[INFO] [cxf-common-xsd:xsdtojava {execution: generate-sources}]
[INFO] [remote-resources:process {execution: default}]
[INFO] [resources:resources]
[INFO] Using default encoding to copy filtered resources.
[INFO] [compiler:compile]
[INFO] Compiling 22 source files to /x1/continuum/working-directory/216/rt/transports/http-jetty/target/classes
[INFO] [resources:testResources]
[INFO] Using default encoding to copy filtered resources.
[INFO] [compiler:testCompile]
[INFO] Compiling 6 source files to /x1/continuum/working-directory/216/rt/transports/http-jetty/target/test-classes
[INFO] [surefire:test]
[INFO] Surefire report directory: /x1/continuum/working-directory/216/rt/transports/http-jetty/target/surefire-reports

-------------------------------------------------------
 T E S T S
-------------------------------------------------------
Running org.apache.cxf.transport.http_jetty.JettyHTTPServerEngineTest
Tests run: 2, Failures: 0, Errors: 0, Skipped: 0, Time elapsed: 0.477 sec
Running org.apache.cxf.transport.http_jetty.JettyHTTPDestinationTest
Tests run: 17, Failures: 0, Errors: 0, Skipped: 0, Time elapsed: 3.692 sec
Running org.apache.cxf.transport.http_jetty.JettyContextInspectorTest
Tests run: 1, Failures: 0, Errors: 0, Skipped: 0, Time elapsed: 0.883 sec
Running org.apache.cxf.transport.http_jetty.JettyHTTPServerEngineFactoryTest
Tests run: 2, Failures: 0, Errors: 0, Skipped: 0, Time elapsed: 7.131 sec
Running org.apache.cxf.transport.http_jetty.spring.BeanDefinitionParsersTest
Tests run: 3, Failures: 0, Errors: 0, Skipped: 0, Time elapsed: 1.421 sec
Running org.apache.cxf.transport.http_jetty.spring.ApplicationContextTest
Tests run: 2, Failures: 0, Errors: 0, Skipped: 1, Time elapsed: 4.05 sec

Results :

Tests run: 27, Failures: 0, Errors: 0, Skipped: 1

[INFO] [jar:jar]
[INFO] Building jar: /x1/continuum/working-directory/216/rt/transports/http-jetty/target/cxf-rt-transports-http-jetty-2.0-incubator-SNAPSHOT.jar
[INFO] [install:install]
[INFO] Installing /x1/continuum/working-directory/216/rt/transports/http-jetty/target/cxf-rt-transports-http-jetty-2.0-incubator-SNAPSHOT.jar to /home/continuum/.m2/repository/org/apache/cxf/cxf-rt-transports-http-jetty/2.0-incubator-SNAPSHOT/cxf-rt-transports-http-jetty-2.0-incubator-SNAPSHOT.jar
[INFO] ----------------------------------------------------------------------------
[INFO] Building Apache CXF Runtime Aegis Databinding
[INFO]    task-segment: [clean, install]
[INFO] ----------------------------------------------------------------------------
[INFO] [clean:clean]
[INFO] Deleting directory /x1/continuum/working-directory/216/rt/databinding/aegis/target
[INFO] Deleting directory /x1/continuum/working-directory/216/rt/databinding/aegis/target/classes
[INFO] Deleting directory /x1/continuum/working-directory/216/rt/databinding/aegis/target/test-classes
[INFO] [checkstyle:checkstyle {execution: validate}]
[INFO] Starting audit...
Audit done.

[INFO] Preparing pmd:check
[INFO] [pmd:pmd]
[INFO] [pmd:check {execution: validate}]
[INFO] 
[INFO] [build-helper:add-source {execution: add-source}]
[INFO] Source directory: /x1/continuum/working-directory/216/rt/databinding/aegis/src/main/generated added.
[INFO] [remote-resources:process {execution: default}]
[INFO] [resources:resources]
[INFO] Using default encoding to copy filtered resources.
[INFO] [compiler:compile]
[INFO] Compiling 90 source files to /x1/continuum/working-directory/216/rt/databinding/aegis/target/classes
[INFO] [resources:testResources]
[INFO] Using default encoding to copy filtered resources.
[INFO] [compiler:testCompile]
[INFO] Compiling 83 source files to /x1/continuum/working-directory/216/rt/databinding/aegis/target/test-classes
[INFO] [surefire:test]
[INFO] Surefire report directory: /x1/continuum/working-directory/216/rt/databinding/aegis/target/surefire-reports

-------------------------------------------------------
 T E S T S
-------------------------------------------------------
Running org.apache.cxf.aegis.xml.stax.WriterTest
Tests run: 2, Failures: 0, Errors: 0, Skipped: 0, Time elapsed: 7.004 sec
Running org.apache.cxf.aegis.type.basic.DynamicProxyTest
Tests run: 6, Failures: 0, Errors: 0, Skipped: 0, Time elapsed: 2.268 sec
Running org.apache.cxf.aegis.services.base64.BinaryDataTest
Tests run: 1, Failures: 0, Errors: 0, Skipped: 0, Time elapsed: 1.309 sec
Running org.codehaus.xfire.aegis.inheritance.intf.InterfaceInheritanceTest
Tests run: 1, Failures: 0, Errors: 0, Skipped: 0, Time elapsed: 1.528 sec
Running org.apache.cxf.aegis.type.java5.DualOutServiceTest
Tests run: 1, Failures: 0, Errors: 0, Skipped: 0, Time elapsed: 1.087 sec
Running org.codehaus.xfire.aegis.inheritance.ExceptionInheritanceTest
Tests run: 1, Failures: 0, Errors: 0, Skipped: 0, Time elapsed: 0.422 sec
Running org.apache.cxf.aegis.xml.stax.ReaderTest
Tests run: 2, Failures: 0, Errors: 0, Skipped: 0, Time elapsed: 2.572 sec
Running org.apache.cxf.aegis.type.java5.AnnotatedTypeTest
Tests run: 7, Failures: 0, Errors: 0, Skipped: 0, Time elapsed: 2.349 sec
Running org.apache.cxf.aegis.type.basic.BeanTest
Tests run: 11, Failures: 0, Errors: 0, Skipped: 0, Time elapsed: 3.139 sec
Running org.apache.cxf.aegis.type.java5.ConfigurationTest
Tests run: 6, Failures: 0, Errors: 0, Skipped: 0, Time elapsed: 0.978 sec
Running org.codehaus.xfire.aegis.inheritance.InheritancePOJOTest
Tests run: 3, Failures: 0, Errors: 0, Skipped: 0, Time elapsed: 0.716 sec
Running org.apache.cxf.aegis.type.java5.OperationNSTest
Tests run: 1, Failures: 0, Errors: 0, Skipped: 0, Time elapsed: 0.284 sec
Running org.apache.cxf.aegis.type.java5.CollectionTest
Tests run: 8, Failures: 0, Errors: 0, Skipped: 0, Time elapsed: 1.404 sec
Running org.apache.cxf.aegis.client.HeaderTest
Tests run: 1, Failures: 0, Errors: 0, Skipped: 1, Time elapsed: 0.008 sec
Running org.apache.cxf.aegis.type.java5.MapTest
Tests run: 6, Failures: 0, Errors: 0, Skipped: 0, Time elapsed: 0.899 sec
Running org.apache.cxf.aegis.type.java5.EnumTypeTest
Tests run: 6, Failures: 0, Errors: 0, Skipped: 0, Time elapsed: 0.818 sec
Running org.apache.cxf.aegis.type.basic.ByteDataTest
Tests run: 1, Failures: 0, Errors: 0, Skipped: 0, Time elapsed: 0.244 sec
Running org.apache.cxf.aegis.integration.WrappedTest
Tests run: 2, Failures: 0, Errors: 0, Skipped: 0, Time elapsed: 0.857 sec
Running org.apache.cxf.aegis.type.java5.XmlParamTypeTest
Tests run: 2, Failures: 0, Errors: 0, Skipped: 0, Time elapsed: 0.274 sec

Results :

Tests run: 68, Failures: 0, Errors: 0, Skipped: 1

[INFO] [jar:jar]
[INFO] Building jar: /x1/continuum/working-directory/216/rt/databinding/aegis/target/cxf-rt-databinding-aegis-2.0-incubator-SNAPSHOT.jar
[INFO] [install:install]
[INFO] Installing /x1/continuum/working-directory/216/rt/databinding/aegis/target/cxf-rt-databinding-aegis-2.0-incubator-SNAPSHOT.jar to /home/continuum/.m2/repository/org/apache/cxf/cxf-rt-databinding-aegis/2.0-incubator-SNAPSHOT/cxf-rt-databinding-aegis-2.0-incubator-SNAPSHOT.jar
[INFO] ----------------------------------------------------------------------------
[INFO] Building Apache CXF Runtime HTTP Binding
[INFO]    task-segment: [clean, install]
[INFO] ----------------------------------------------------------------------------
[INFO] [clean:clean]
[INFO] Deleting directory /x1/continuum/working-directory/216/rt/bindings/http/target
[INFO] Deleting directory /x1/continuum/working-directory/216/rt/bindings/http/target/classes
[INFO] Deleting directory /x1/continuum/working-directory/216/rt/bindings/http/target/test-classes
[INFO] [checkstyle:checkstyle {execution: validate}]
[INFO] Starting audit...
Audit done.

[INFO] Preparing pmd:check
[INFO] [pmd:pmd]
[INFO] [pmd:check {execution: validate}]
[INFO] 
[INFO] [remote-resources:process {execution: default}]
[INFO] [resources:resources]
[INFO] Using default encoding to copy filtered resources.
[INFO] [compiler:compile]
[INFO] Compiling 16 source files to /x1/continuum/working-directory/216/rt/bindings/http/target/classes
[INFO] [cxf-common-xsd:xsdtojava {execution: generate-sources}]
[INFO] [resources:testResources]
[INFO] Using default encoding to copy filtered resources.
[INFO] [compiler:testCompile]
[INFO] Compiling 13 source files to /x1/continuum/working-directory/216/rt/bindings/http/target/test-classes
[INFO] [surefire:test]
[INFO] Surefire report directory: /x1/continuum/working-directory/216/rt/bindings/http/target/surefire-reports

-------------------------------------------------------
 T E S T S
-------------------------------------------------------
Running org.apache.cxf.binding.http.InflectorTest
Tests run: 2, Failures: 0, Errors: 0, Skipped: 0, Time elapsed: 0.111 sec
Running org.apache.cxf.binding.http.mtom.MtomTest
Tests run: 1, Failures: 0, Errors: 0, Skipped: 0, Time elapsed: 12.509 sec
Running org.apache.cxf.binding.http.IriDecoderTest
Tests run: 1, Failures: 0, Errors: 0, Skipped: 0, Time elapsed: 0.038 sec
Running org.apache.cxf.binding.http.wrapped.WrappedServiceTest
Tests run: 2, Failures: 0, Errors: 0, Skipped: 0, Time elapsed: 4.892 sec
Running org.apache.cxf.binding.http.bare.ClientTest
Tests run: 1, Failures: 0, Errors: 0, Skipped: 0, Time elapsed: 1.465 sec
Running org.apache.cxf.binding.http.bare.BareServiceTest
Tests run: 2, Failures: 0, Errors: 0, Skipped: 0, Time elapsed: 3.038 sec

Results :

Tests run: 9, Failures: 0, Errors: 0, Skipped: 0

[INFO] [jar:jar]
[INFO] Building jar: /x1/continuum/working-directory/216/rt/bindings/http/target/cxf-rt-bindings-http-2.0-incubator-SNAPSHOT.jar
[INFO] [install:install]
[INFO] Installing /x1/continuum/working-directory/216/rt/bindings/http/target/cxf-rt-bindings-http-2.0-incubator-SNAPSHOT.jar to /home/continuum/.m2/repository/org/apache/cxf/cxf-rt-bindings-http/2.0-incubator-SNAPSHOT/cxf-rt-bindings-http-2.0-incubator-SNAPSHOT.jar
[INFO] ----------------------------------------------------------------------------
[INFO] Building Apache CXF Runtime Object Binding
[INFO]    task-segment: [clean, install]
[INFO] ----------------------------------------------------------------------------
[INFO] [clean:clean]
[INFO] Deleting directory /x1/continuum/working-directory/216/rt/bindings/object/target
[INFO] Deleting directory /x1/continuum/working-directory/216/rt/bindings/object/target/classes
[INFO] Deleting directory /x1/continuum/working-directory/216/rt/bindings/object/target/test-classes
[INFO] [checkstyle:checkstyle {execution: validate}]
[INFO] Starting audit...
Audit done.

[INFO] Preparing pmd:check
[INFO] [pmd:pmd]
[INFO] [pmd:check {execution: validate}]
[INFO] 
[INFO] [remote-resources:process {execution: default}]
[INFO] [resources:resources]
[INFO] Using default encoding to copy filtered resources.
[INFO] [compiler:compile]
[INFO] Compiling 7 source files to /x1/continuum/working-directory/216/rt/bindings/object/target/classes
[INFO] [resources:testResources]
[INFO] Using default encoding to copy filtered resources.
[INFO] [compiler:testCompile]
[INFO] Compiling 4 source files to /x1/continuum/working-directory/216/rt/bindings/object/target/test-classes
[INFO] [surefire:test]
[INFO] Surefire report directory: /x1/continuum/working-directory/216/rt/bindings/object/target/surefire-reports

-------------------------------------------------------
 T E S T S
-------------------------------------------------------
Running org.apache.cxf.binding.object.LocalServerRegistrationTest
Tests run: 1, Failures: 0, Errors: 0, Skipped: 0, Time elapsed: 10.368 sec
Running org.apache.cxf.binding.object.ObjectBindingTest
Tests run: 3, Failures: 0, Errors: 0, Skipped: 0, Time elapsed: 3.605 sec

Results :

Tests run: 4, Failures: 0, Errors: 0, Skipped: 0

[INFO] [jar:jar]
[INFO] Building jar: /x1/continuum/working-directory/216/rt/bindings/object/target/cxf-rt-bindings-object-2.0-incubator-SNAPSHOT.jar
[INFO] [install:install]
[INFO] Installing /x1/continuum/working-directory/216/rt/bindings/object/target/cxf-rt-bindings-object-2.0-incubator-SNAPSHOT.jar to /home/continuum/.m2/repository/org/apache/cxf/cxf-rt-bindings-object/2.0-incubator-SNAPSHOT/cxf-rt-bindings-object-2.0-incubator-SNAPSHOT.jar
[INFO] ----------------------------------------------------------------------------
[INFO] Building Apache CXF Colocated Binding
[INFO]    task-segment: [clean, install]
[INFO] ----------------------------------------------------------------------------
[INFO] [clean:clean]
[INFO] Deleting directory /x1/continuum/working-directory/216/rt/bindings/coloc/target
[INFO] Deleting directory /x1/continuum/working-directory/216/rt/bindings/coloc/target/classes
[INFO] Deleting directory /x1/continuum/working-directory/216/rt/bindings/coloc/target/test-classes
[INFO] [checkstyle:checkstyle {execution: validate}]
[INFO] Starting audit...
Audit done.

[INFO] Preparing pmd:check
[INFO] [pmd:pmd]
[INFO] [pmd:check {execution: validate}]
[INFO] 
[INFO] [remote-resources:process {execution: default}]
[INFO] [resources:resources]
[INFO] Using default encoding to copy filtered resources.
[INFO] [compiler:compile]
[INFO] Compiling 10 source files to /x1/continuum/working-directory/216/rt/bindings/coloc/target/classes
[INFO] [resources:testResources]
[INFO] Using default encoding to copy filtered resources.
[INFO] [compiler:testCompile]
[INFO] Compiling 3 source files to /x1/continuum/working-directory/216/rt/bindings/coloc/target/test-classes
[INFO] [surefire:test]
[INFO] Surefire report directory: /x1/continuum/working-directory/216/rt/bindings/coloc/target/surefire-reports

-------------------------------------------------------
 T E S T S
-------------------------------------------------------
Running org.apache.cxf.binding.coloc.ColocMessageObserverTest
Tests run: 2, Failures: 0, Errors: 0, Skipped: 0, Time elapsed: 1.978 sec
Running org.apache.cxf.binding.coloc.ColocUtilTest
Tests run: 6, Failures: 0, Errors: 0, Skipped: 0, Time elapsed: 0.162 sec
Running org.apache.cxf.binding.coloc.ColocOutInterceptorTest
Tests run: 8, Failures: 0, Errors: 0, Skipped: 0, Time elapsed: 0.637 sec

Results :

Tests run: 16, Failures: 0, Errors: 0, Skipped: 0

[INFO] [jar:jar]
[INFO] Building jar: /x1/continuum/working-directory/216/rt/bindings/coloc/target/cxf-rt-bindings-coloc-2.0-incubator-SNAPSHOT.jar
[INFO] [install:install]
[INFO] Installing /x1/continuum/working-directory/216/rt/bindings/coloc/target/cxf-rt-bindings-coloc-2.0-incubator-SNAPSHOT.jar to /home/continuum/.m2/repository/org/apache/cxf/cxf-rt-bindings-coloc/2.0-incubator-SNAPSHOT/cxf-rt-bindings-coloc-2.0-incubator-SNAPSHOT.jar
[INFO] ----------------------------------------------------------------------------
[INFO] Building Apache CXF Runtime JBI Binding
[INFO]    task-segment: [clean, install]
[INFO] ----------------------------------------------------------------------------
[INFO] [clean:clean]
[INFO] Deleting directory /x1/continuum/working-directory/216/rt/bindings/jbi/target
[INFO] Deleting directory /x1/continuum/working-directory/216/rt/bindings/jbi/target/classes
[INFO] Deleting directory /x1/continuum/working-directory/216/rt/bindings/jbi/target/test-classes
[INFO] [checkstyle:checkstyle {execution: validate}]
[INFO] Starting audit...
Audit done.

[INFO] Preparing pmd:check
[INFO] [pmd:pmd]
[INFO] [pmd:check {execution: validate}]
[INFO] 
[INFO] [cxf-common-xsd:xsdtojava {execution: generate-sources}]
[INFO] [remote-resources:process {execution: default}]
[INFO] [resources:resources]
[INFO] Using default encoding to copy filtered resources.
[INFO] [compiler:compile]
[INFO] Compiling 14 source files to /x1/continuum/working-directory/216/rt/bindings/jbi/target/classes
[INFO] [resources:testResources]
[INFO] Using default encoding to copy filtered resources.
[INFO] [compiler:testCompile]
[INFO] Compiling 3 source files to /x1/continuum/working-directory/216/rt/bindings/jbi/target/test-classes
[INFO] [surefire:test]
[INFO] Surefire report directory: /x1/continuum/working-directory/216/rt/bindings/jbi/target/surefire-reports

-------------------------------------------------------
 T E S T S
-------------------------------------------------------
Running org.apache.cxf.binding.jbi.JBIBindingFactoryTest
Tests run: 1, Failures: 0, Errors: 0, Skipped: 0, Time elapsed: 0.417 sec
Running org.apache.cxf.binding.jbi.interceptor.JBIOperationInInterceptorTest
Tests run: 1, Failures: 0, Errors: 0, Skipped: 0, Time elapsed: 0.12 sec
Running org.apache.cxf.binding.jbi.interceptor.JBIFaultOutInterceptorTest
Tests run: 5, Failures: 0, Errors: 0, Skipped: 0, Time elapsed: 0.576 sec

Results :

Tests run: 7, Failures: 0, Errors: 0, Skipped: 0

[INFO] [jar:jar]
[INFO] Building jar: /x1/continuum/working-directory/216/rt/bindings/jbi/target/cxf-rt-bindings-jbi-2.0-incubator-SNAPSHOT.jar
[INFO] [install:install]
[INFO] Installing /x1/continuum/working-directory/216/rt/bindings/jbi/target/cxf-rt-bindings-jbi-2.0-incubator-SNAPSHOT.jar to /home/continuum/.m2/repository/org/apache/cxf/cxf-rt-bindings-jbi/2.0-incubator-SNAPSHOT/cxf-rt-bindings-jbi-2.0-incubator-SNAPSHOT.jar
[INFO] ----------------------------------------------------------------------------
[INFO] Building Apache CXF Runtime
[INFO]    task-segment: [clean, install]
[INFO] ----------------------------------------------------------------------------
[INFO] [clean:clean]
[INFO] Deleting directory /x1/continuum/working-directory/216/rt/target
[INFO] Deleting directory /x1/continuum/working-directory/216/rt/target/classes
[INFO] Deleting directory /x1/continuum/working-directory/216/rt/target/test-classes
[INFO] [site:attach-descriptor]
[INFO] [install:install]
[INFO] Installing /x1/continuum/working-directory/216/rt/pom.xml to /home/continuum/.m2/repository/org/apache/cxf/cxf-rt/2.0-incubator-SNAPSHOT/cxf-rt-2.0-incubator-SNAPSHOT.pom
[INFO] ----------------------------------------------------------------------------
[INFO] Building Apache CXF Runtime Bindings
[INFO]    task-segment: [clean, install]
[INFO] ----------------------------------------------------------------------------
[INFO] [clean:clean]
[INFO] Deleting directory /x1/continuum/working-directory/216/rt/bindings/target
[INFO] Deleting directory /x1/continuum/working-directory/216/rt/bindings/target/classes
[INFO] Deleting directory /x1/continuum/working-directory/216/rt/bindings/target/test-classes
[INFO] [site:attach-descriptor]
[INFO] [install:install]
[INFO] Installing /x1/continuum/working-directory/216/rt/bindings/pom.xml to /home/continuum/.m2/repository/org/apache/cxf/cxf-rt-bindings/2.0-incubator-SNAPSHOT/cxf-rt-bindings-2.0-incubator-SNAPSHOT.pom
[INFO] ----------------------------------------------------------------------------
[INFO] Building Apache CXF Runtime JavaScript Frontend
[INFO]    task-segment: [clean, install]
[INFO] ----------------------------------------------------------------------------
[INFO] [clean:clean]
[INFO] Deleting directory /x1/continuum/working-directory/216/rt/frontend/js/target
[INFO] Deleting directory /x1/continuum/working-directory/216/rt/frontend/js/target/classes
[INFO] Deleting directory /x1/continuum/working-directory/216/rt/frontend/js/target/test-classes
[INFO] [checkstyle:checkstyle {execution: validate}]
[INFO] Starting audit...
Audit done.

[INFO] Preparing pmd:check
[INFO] [pmd:pmd]
[INFO] [pmd:check {execution: validate}]
[INFO] 
[INFO] [remote-resources:process {execution: default}]
[INFO] [resources:resources]
[INFO] Using default encoding to copy filtered resources.
[INFO] [compiler:compile]
[INFO] Compiling 6 source files to /x1/continuum/working-directory/216/rt/frontend/js/target/classes
[INFO] [resources:testResources]
[INFO] Using default encoding to copy filtered resources.
[INFO] [compiler:testCompile]
[INFO] Compiling 3 source files to /x1/continuum/working-directory/216/rt/frontend/js/target/test-classes
[INFO] [surefire:test]
[INFO] Surefire report directory: /x1/continuum/working-directory/216/rt/frontend/js/target/surefire-reports

-------------------------------------------------------
 T E S T S
-------------------------------------------------------
Running org.apache.cxf.js.rhino.AbstractDOMProviderTest
Tests run: 7, Failures: 0, Errors: 0, Skipped: 0, Time elapsed: 1.03 sec
Running org.apache.cxf.js.rhino.ServerAppTest
Tests run: 13, Failures: 0, Errors: 0, Skipped: 0, Time elapsed: 0.778 sec
Running org.apache.cxf.js.rhino.ProviderFactoryTest
Tests run: 7, Failures: 0, Errors: 0, Skipped: 0, Time elapsed: 0.902 sec

Results :

Tests run: 27, Failures: 0, Errors: 0, Skipped: 0

[INFO] [jar:jar]
[INFO] Building jar: /x1/continuum/working-directory/216/rt/frontend/js/target/cxf-rt-frontend-js-2.0-incubator-SNAPSHOT.jar
[INFO] [install:install]
[INFO] Installing /x1/continuum/working-directory/216/rt/frontend/js/target/cxf-rt-frontend-js-2.0-incubator-SNAPSHOT.jar to /home/continuum/.m2/repository/org/apache/cxf/cxf-rt-frontend-js/2.0-incubator-SNAPSHOT/cxf-rt-frontend-js-2.0-incubator-SNAPSHOT.jar
[INFO] ----------------------------------------------------------------------------
[INFO] Building Apache CXF Runtime JBI transport
[INFO]    task-segment: [clean, install]
[INFO] ----------------------------------------------------------------------------
[INFO] [clean:clean]
[INFO] Deleting directory /x1/continuum/working-directory/216/rt/transports/jbi/target
[INFO] Deleting directory /x1/continuum/working-directory/216/rt/transports/jbi/target/classes
[INFO] Deleting directory /x1/continuum/working-directory/216/rt/transports/jbi/target/test-classes
[INFO] [checkstyle:checkstyle {execution: validate}]
[INFO] Starting audit...
Audit done.

[INFO] Preparing pmd:check
[INFO] [pmd:pmd]
[INFO] [pmd:check {execution: validate}]
[INFO] 
[INFO] [cxf-common-xsd:xsdtojava {execution: generate-sources}]
[INFO] [remote-resources:process {execution: default}]
[INFO] [resources:resources]
[INFO] Using default encoding to copy filtered resources.
[INFO] [compiler:compile]
[INFO] Compiling 10 source files to /x1/continuum/working-directory/216/rt/transports/jbi/target/classes
[INFO] [resources:testResources]
[INFO] Using default encoding to copy filtered resources.
[INFO] [compiler:testCompile]
[INFO] Compiling 3 source files to /x1/continuum/working-directory/216/rt/transports/jbi/target/test-classes
[INFO] [surefire:test]
[INFO] Surefire report directory: /x1/continuum/working-directory/216/rt/transports/jbi/target/surefire-reports

-------------------------------------------------------
 T E S T S
-------------------------------------------------------
Running org.apache.cxf.transport.jbi.JBIConduitTest
Tests run: 2, Failures: 0, Errors: 0, Skipped: 1, Time elapsed: 4.156 sec
Running org.apache.cxf.transport.jbi.JBIDestinationTest
Tests run: 1, Failures: 0, Errors: 0, Skipped: 0, Time elapsed: 0.612 sec

Results :

Tests run: 3, Failures: 0, Errors: 0, Skipped: 1

[INFO] [jar:jar]
[INFO] Building jar: /x1/continuum/working-directory/216/rt/transports/jbi/target/cxf-rt-transports-jbi-2.0-incubator-SNAPSHOT.jar
[INFO] [install:install]
[INFO] Installing /x1/continuum/working-directory/216/rt/transports/jbi/target/cxf-rt-transports-jbi-2.0-incubator-SNAPSHOT.jar to /home/continuum/.m2/repository/org/apache/cxf/cxf-rt-transports-jbi/2.0-incubator-SNAPSHOT/cxf-rt-transports-jbi-2.0-incubator-SNAPSHOT.jar
[INFO] ----------------------------------------------------------------------------
[INFO] Building Apache CXF Runtime WS Policy
[INFO]    task-segment: [clean, install]
[INFO] ----------------------------------------------------------------------------
[INFO] [clean:clean]
[INFO] Deleting directory /x1/continuum/working-directory/216/rt/ws/policy/target
[INFO] Deleting directory /x1/continuum/working-directory/216/rt/ws/policy/target/classes
[INFO] Deleting directory /x1/continuum/working-directory/216/rt/ws/policy/target/test-classes
[INFO] [checkstyle:checkstyle {execution: validate}]
[INFO] Starting audit...
Audit done.

[INFO] Preparing pmd:check
[INFO] [pmd:pmd]
[INFO] [pmd:check {execution: validate}]
[INFO] 
[INFO] [cxf-common-xsd:xsdtojava {execution: generate-sources}]
[INFO] [remote-resources:process {execution: default}]
[INFO] [resources:resources]
[INFO] Using default encoding to copy filtered resources.
[INFO] [compiler:compile]
[INFO] Compiling 59 source files to /x1/continuum/working-directory/216/rt/ws/policy/target/classes
[INFO] [cxf-codegen:wsdl2java {execution: generate-test-sources}]
[INFO] [resources:testResources]
[INFO] Using default encoding to copy filtered resources.
[INFO] [compiler:testCompile]
[INFO] Compiling 32 source files to /x1/continuum/working-directory/216/rt/ws/policy/target/test-classes
[INFO] [surefire:test]
[INFO] Surefire report directory: /x1/continuum/working-directory/216/rt/ws/policy/target/surefire-reports

-------------------------------------------------------
 T E S T S
-------------------------------------------------------
Running org.apache.cxf.ws.policy.attachment.external.EndpointReferenceDomainExpressionTest
Tests run: 1, Failures: 0, Errors: 0, Skipped: 0, Time elapsed: 1.671 sec
Running org.apache.cxf.ws.policy.attachment.external.DomainExpressionBuilderRegistryTest
Tests run: 2, Failures: 0, Errors: 0, Skipped: 0, Time elapsed: 0.094 sec
Running org.apache.cxf.ws.policy.attachment.wsdl11.Wsdl11AttachmentPolicyProviderTest
Tests run: 7, Failures: 0, Errors: 0, Skipped: 0, Time elapsed: 3.18 sec
Running org.apache.cxf.ws.policy.PolicyVerificationInFaultInterceptorTest
Tests run: 1, Failures: 0, Errors: 0, Skipped: 0, Time elapsed: 0.7 sec
Running org.apache.cxf.ws.policy.PolicyInterceptorProviderRegistryImplTest
Tests run: 1, Failures: 0, Errors: 0, Skipped: 0, Time elapsed: 0.021 sec
Running org.apache.cxf.ws.policy.PolicyInterceptorsTest
Tests run: 8, Failures: 0, Errors: 0, Skipped: 0, Time elapsed: 0.537 sec
Running org.apache.cxf.ws.policy.spring.PolicyFeatureTest
Tests run: 4, Failures: 0, Errors: 0, Skipped: 0, Time elapsed: 12.203 sec
Running org.apache.cxf.ws.policy.PolicyTest
Tests run: 4, Failures: 0, Errors: 0, Skipped: 3, Time elapsed: 0.017 sec
Running org.apache.cxf.ws.policy.attachment.reference.ReferenceResolverTest
Tests run: 3, Failures: 0, Errors: 0, Skipped: 0, Time elapsed: 0.243 sec
Running org.apache.cxf.ws.policy.PolicyEngineTest
Tests run: 27, Failures: 0, Errors: 0, Skipped: 0, Time elapsed: 0.623 sec
Running org.apache.cxf.ws.policy.selector.MinimalMaximalAlternativeSelectorTest
Tests run: 2, Failures: 0, Errors: 0, Skipped: 0, Time elapsed: 0.035 sec
Running org.apache.cxf.ws.policy.EffectivePolicyImplTest
Tests run: 9, Failures: 0, Errors: 0, Skipped: 0, Time elapsed: 0.068 sec
Running org.apache.cxf.ws.policy.PolicyVerificationInInterceptorTest
Tests run: 2, Failures: 0, Errors: 0, Skipped: 0, Time elapsed: 0.482 sec
Running org.apache.cxf.ws.policy.PolicyExtensionsTest
Tests run: 1, Failures: 0, Errors: 0, Skipped: 0, Time elapsed: 0.277 sec
Running org.apache.cxf.ws.policy.selector.FirstAlternativeSelectorTest
Tests run: 1, Failures: 0, Errors: 0, Skipped: 0, Time elapsed: 0.011 sec
Running org.apache.cxf.ws.policy.builder.primitive.NestedPrimitiveAssertionTest
Tests run: 3, Failures: 0, Errors: 0, Skipped: 0, Time elapsed: 0.199 sec
Running org.apache.cxf.ws.policy.EndpointPolicyImplTest
Tests run: 8, Failures: 0, Errors: 0, Skipped: 0, Time elapsed: 0.168 sec
Running org.apache.cxf.ws.policy.attachment.external.ExternalAttachmentProviderTest
Tests run: 11, Failures: 0, Errors: 0, Skipped: 0, Time elapsed: 0.291 sec
Running org.apache.cxf.ws.policy.attachment.external.PolicyAttachmentTest
Tests run: 6, Failures: 0, Errors: 0, Skipped: 0, Time elapsed: 0.037 sec
Running org.apache.cxf.ws.policy.PolicyRegistryImplTest
Tests run: 1, Failures: 0, Errors: 0, Skipped: 0, Time elapsed: 0.005 sec
Running org.apache.cxf.ws.policy.PolicyVerificationOutInterceptorTest
Tests run: 1, Failures: 0, Errors: 0, Skipped: 0, Time elapsed: 0.065 sec
Running org.apache.cxf.ws.policy.PolicyBuilderTest
Tests run: 3, Failures: 0, Errors: 0, Skipped: 0, Time elapsed: 0.112 sec
Running org.apache.cxf.ws.policy.NormalizeTest
Tests run: 1, Failures: 0, Errors: 0, Skipped: 0, Time elapsed: 0.592 sec

Results :

Tests run: 107, Failures: 0, Errors: 0, Skipped: 3

[INFO] [jar:jar]
[INFO] Building jar: /x1/continuum/working-directory/216/rt/ws/policy/target/cxf-rt-ws-policy-2.0-incubator-SNAPSHOT.jar
[INFO] [install:install]
[INFO] Installing /x1/continuum/working-directory/216/rt/ws/policy/target/cxf-rt-ws-policy-2.0-incubator-SNAPSHOT.jar to /home/continuum/.m2/repository/org/apache/cxf/cxf-rt-ws-policy/2.0-incubator-SNAPSHOT/cxf-rt-ws-policy-2.0-incubator-SNAPSHOT.jar
[INFO] ----------------------------------------------------------------------------
[INFO] Building Apache CXF Runtime WS Addressing
[INFO]    task-segment: [clean, install]
[INFO] ----------------------------------------------------------------------------
[INFO] [clean:clean]
[INFO] Deleting directory /x1/continuum/working-directory/216/rt/ws/addr/target
[INFO] Deleting directory /x1/continuum/working-directory/216/rt/ws/addr/target/classes
[INFO] Deleting directory /x1/continuum/working-directory/216/rt/ws/addr/target/test-classes
[INFO] [checkstyle:checkstyle {execution: validate}]
[INFO] Starting audit...
Audit done.

[INFO] Preparing pmd:check
[INFO] [pmd:pmd]
[INFO] [pmd:check {execution: validate}]
[INFO] 
[INFO] [remote-resources:process {execution: default}]
[INFO] [resources:resources]
[INFO] Using default encoding to copy filtered resources.
[INFO] [compiler:compile]
[INFO] Compiling 15 source files to /x1/continuum/working-directory/216/rt/ws/addr/target/classes
[INFO] [resources:testResources]
[INFO] Using default encoding to copy filtered resources.
[INFO] [compiler:testCompile]
[INFO] Compiling 7 source files to /x1/continuum/working-directory/216/rt/ws/addr/target/test-classes
[INFO] [surefire:test]
[INFO] Surefire report directory: /x1/continuum/working-directory/216/rt/ws/addr/target/surefire-reports

-------------------------------------------------------
 T E S T S
-------------------------------------------------------
Running org.apache.cxf.ws.addressing.AddressingBuilderImplTest
Tests run: 2, Failures: 0, Errors: 0, Skipped: 0, Time elapsed: 0.232 sec
Running org.apache.cxf.ws.addressing.soap.MAPCodecTest
Tests run: 12, Failures: 0, Errors: 0, Skipped: 0, Time elapsed: 2.02 sec
Running org.apache.cxf.ws.addressing.spring.WSAFeatureXmlTest
Tests run: 1, Failures: 0, Errors: 0, Skipped: 0, Time elapsed: 11.273 sec
Running org.apache.cxf.ws.addressing.AddressingConstantsImplTest
Tests run: 33, Failures: 0, Errors: 0, Skipped: 0, Time elapsed: 0.837 sec
Running org.apache.cxf.ws.addressing.AddressingBuilderTest
Tests run: 1, Failures: 0, Errors: 0, Skipped: 0, Time elapsed: 0.011 sec
Running org.apache.cxf.ws.addressing.MAPAggregatorTest
Tests run: 24, Failures: 0, Errors: 0, Skipped: 0, Time elapsed: 1.404 sec
Running org.apache.cxf.ws.addressing.spring.WSAFeatureTest
Tests run: 1, Failures: 0, Errors: 0, Skipped: 0, Time elapsed: 1.72 sec

Results :

Tests run: 74, Failures: 0, Errors: 0, Skipped: 0

[INFO] [jar:jar]
[INFO] Building jar: /x1/continuum/working-directory/216/rt/ws/addr/target/cxf-rt-ws-addr-2.0-incubator-SNAPSHOT.jar
[INFO] [install:install]
[INFO] Installing /x1/continuum/working-directory/216/rt/ws/addr/target/cxf-rt-ws-addr-2.0-incubator-SNAPSHOT.jar to /home/continuum/.m2/repository/org/apache/cxf/cxf-rt-ws-addr/2.0-incubator-SNAPSHOT/cxf-rt-ws-addr-2.0-incubator-SNAPSHOT.jar
[INFO] ----------------------------------------------------------------------------
[INFO] Building Apache CXF Runtime WS Reliable Messaging
[INFO]    task-segment: [clean, install]
[INFO] ----------------------------------------------------------------------------
[INFO] [clean:clean]
[INFO] Deleting directory /x1/continuum/working-directory/216/rt/ws/rm/target
[INFO] Deleting directory /x1/continuum/working-directory/216/rt/ws/rm/target/classes
[INFO] Deleting directory /x1/continuum/working-directory/216/rt/ws/rm/target/test-classes
[INFO] [cobertura:clean {execution: default}]
[INFO] [checkstyle:checkstyle {execution: validate}]
[INFO] Starting audit...
Audit done.

[INFO] Preparing pmd:check
[INFO] [pmd:pmd]
[INFO] [pmd:check {execution: validate}]
[INFO] 
[INFO] [cxf-common-xsd:xsdtojava {execution: generate-sources}]
[INFO] [remote-resources:process {execution: default}]
[INFO] [resources:resources]
[INFO] Using default encoding to copy filtered resources.
[INFO] [compiler:compile]
[INFO] Compiling 65 source files to /x1/continuum/working-directory/216/rt/ws/rm/target/classes
[INFO] [resources:testResources]
[INFO] Using default encoding to copy filtered resources.
[INFO] [compiler:testCompile]
[INFO] Compiling 20 source files to /x1/continuum/working-directory/216/rt/ws/rm/target/test-classes
[INFO] [surefire:test]
[INFO] Surefire report directory: /x1/continuum/working-directory/216/rt/ws/rm/target/surefire-reports

-------------------------------------------------------
 T E S T S
-------------------------------------------------------
Running org.apache.cxf.ws.rm.RMUtilsTest
Tests run: 1, Failures: 0, Errors: 0, Skipped: 0, Time elapsed: 1.961 sec
Running org.apache.cxf.ws.rm.AbstractRMInterceptorTest
Tests run: 5, Failures: 0, Errors: 0, Skipped: 0, Time elapsed: 1.683 sec
Running org.apache.cxf.ws.rm.RMManagerConfigurationTest
Tests run: 1, Failures: 0, Errors: 0, Skipped: 0, Time elapsed: 8.304 sec
Running org.apache.cxf.ws.rm.persistence.PersistenceUtilsTest
Tests run: 1, Failures: 0, Errors: 0, Skipped: 0, Time elapsed: 0.818 sec
Running org.apache.cxf.ws.rm.AbstractEndpointTest
Tests run: 2, Failures: 0, Errors: 0, Skipped: 0, Time elapsed: 0.471 sec
Running org.apache.cxf.ws.rm.DestinationSequenceTest
Tests run: 25, Failures: 0, Errors: 0, Skipped: 0, Time elapsed: 3.79 sec
Running org.apache.cxf.ws.rm.RMContextUtilsTest
Tests run: 10, Failures: 0, Errors: 0, Skipped: 0, Time elapsed: 0.438 sec
Running org.apache.cxf.ws.rm.RMManagerTest
Tests run: 19, Failures: 0, Errors: 0, Skipped: 0, Time elapsed: 2.012 sec
Running org.apache.cxf.ws.rm.AbstractSequenceTest
Tests run: 1, Failures: 0, Errors: 0, Skipped: 0, Time elapsed: 0.017 sec
Running org.apache.cxf.ws.rm.policy.PolicyUtilsTest
Tests run: 3, Failures: 0, Errors: 0, Skipped: 0, Time elapsed: 0.061 sec
Running org.apache.cxf.ws.rm.soap.SoapFaultFactoryTest
Tests run: 6, Failures: 0, Errors: 0, Skipped: 0, Time elapsed: 1.606 sec
Running org.apache.cxf.ws.rm.RMEndpointTest
Tests run: 18, Failures: 0, Errors: 0, Skipped: 0, Time elapsed: 2.059 sec
Running org.apache.cxf.ws.rm.soap.RMSoapInterceptorTest
Tests run: 8, Failures: 0, Errors: 0, Skipped: 0, Time elapsed: 1.485 sec
Running org.apache.cxf.ws.rm.ProxyTest
Tests run: 12, Failures: 0, Errors: 0, Skipped: 0, Time elapsed: 0.539 sec
Running org.apache.cxf.ws.rm.DestinationTest
Tests run: 7, Failures: 0, Errors: 0, Skipped: 0, Time elapsed: 0.151 sec
Running org.apache.cxf.ws.rm.RMInInterceptorTest
Tests run: 13, Failures: 0, Errors: 0, Skipped: 0, Time elapsed: 0.548 sec
Running org.apache.cxf.ws.rm.RMOutInterceptorTest
Chain org.apache.cxf.phase.PhaseInterceptorChain@3bc1a1. Current flow:
  pre-logical [MAPAggregator, RMOutInterceptor]

Tests run: 5, Failures: 0, Errors: 0, Skipped: 0, Time elapsed: 0.154 sec
Running org.apache.cxf.ws.rm.persistence.jdbc.RMTxStoreTest
Tests run: 9, Failures: 0, Errors: 0, Skipped: 0, Time elapsed: 15.534 sec
Running org.apache.cxf.ws.rm.soap.RetransmissionQueueImplTest
Tests run: 10, Failures: 0, Errors: 0, Skipped: 0, Time elapsed: 0.317 sec
Running org.apache.cxf.ws.rm.SourceSequenceTest
Tests run: 8, Failures: 0, Errors: 0, Skipped: 0, Time elapsed: 1.07 sec

Results :

Tests run: 164, Failures: 0, Errors: 0, Skipped: 0

[INFO] [jar:jar]
[INFO] Building jar: /x1/continuum/working-directory/216/rt/ws/rm/target/cxf-rt-ws-rm-2.0-incubator-SNAPSHOT.jar
[INFO] [install:install]
[INFO] Installing /x1/continuum/working-directory/216/rt/ws/rm/target/cxf-rt-ws-rm-2.0-incubator-SNAPSHOT.jar to /home/continuum/.m2/repository/org/apache/cxf/cxf-rt-ws-rm/2.0-incubator-SNAPSHOT/cxf-rt-ws-rm-2.0-incubator-SNAPSHOT.jar
[INFO] ----------------------------------------------------------------------------
[INFO] Building Apache CXF Runtime WS Security
[INFO]    task-segment: [clean, install]
[INFO] ----------------------------------------------------------------------------
[INFO] [clean:clean]
[INFO] Deleting directory /x1/continuum/working-directory/216/rt/ws/security/target
[INFO] Deleting directory /x1/continuum/working-directory/216/rt/ws/security/target/classes
[INFO] Deleting directory /x1/continuum/working-directory/216/rt/ws/security/target/test-classes
[INFO] [checkstyle:checkstyle {execution: validate}]
[INFO] Starting audit...
Audit done.

[INFO] Preparing pmd:check
[INFO] [pmd:pmd]
[INFO] [pmd:check {execution: validate}]
[INFO] 
Downloading: http://repo1.maven.org/maven2/wss4j/wss4j/1.5.1/wss4j-1.5.1.pom
Downloading: http://repo1.maven.org/maven2/xml-security/xmlsec/1.3.0/xmlsec-1.3.0.pom
[INFO] [remote-resources:process {execution: default}]
[INFO] [resources:resources]
[INFO] Using default encoding to copy filtered resources.
[INFO] [compiler:compile]
[INFO] Compiling 3 source files to /x1/continuum/working-directory/216/rt/ws/security/target/classes
[INFO] [resources:testResources]
[INFO] Using default encoding to copy filtered resources.
[INFO] [compiler:testCompile]
[INFO] Compiling 7 source files to /x1/continuum/working-directory/216/rt/ws/security/target/test-classes
[INFO] [surefire:test]
[INFO] Surefire report directory: /x1/continuum/working-directory/216/rt/ws/security/target/surefire-reports

-------------------------------------------------------
 T E S T S
-------------------------------------------------------
Running org.apache.cxf.ws.security.wss4j.RoundTripTest
Tests run: 1, Failures: 0, Errors: 0, Skipped: 1, Time elapsed: 0.066 sec
Running org.apache.cxf.ws.security.wss4j.WSS4JInOutTest
Tests run: 1, Failures: 0, Errors: 0, Skipped: 1, Time elapsed: 0.019 sec
Running org.apache.cxf.ws.security.wss4j.WSS4JOutInterceptorTest
Tests run: 5, Failures: 0, Errors: 0, Skipped: 0, Time elapsed: 29.761 sec

Results :

Tests run: 7, Failures: 0, Errors: 0, Skipped: 2

[INFO] [jar:jar]
[INFO] Building jar: /x1/continuum/working-directory/216/rt/ws/security/target/cxf-rt-ws-security-2.0-incubator-SNAPSHOT.jar
[INFO] [install:install]
[INFO] Installing /x1/continuum/working-directory/216/rt/ws/security/target/cxf-rt-ws-security-2.0-incubator-SNAPSHOT.jar to /home/continuum/.m2/repository/org/apache/cxf/cxf-rt-ws-security/2.0-incubator-SNAPSHOT/cxf-rt-ws-security-2.0-incubator-SNAPSHOT.jar
[INFO] ----------------------------------------------------------------------------
[INFO] Building Apache CXF JBI Integration
[INFO]    task-segment: [clean, install]
[INFO] ----------------------------------------------------------------------------
[INFO] [clean:clean]
[INFO] Deleting directory /x1/continuum/working-directory/216/integration/jbi/target
[INFO] Deleting directory /x1/continuum/working-directory/216/integration/jbi/target/classes
[INFO] Deleting directory /x1/continuum/working-directory/216/integration/jbi/target/test-classes
[INFO] [checkstyle:checkstyle {execution: validate}]
[INFO] Starting audit...
Audit done.

[INFO] Preparing pmd:check
[INFO] [pmd:pmd]
[INFO] [pmd:check {execution: validate}]
[INFO] 
[INFO] [remote-resources:process {execution: default}]
[INFO] [resources:resources]
[INFO] Using default encoding to copy filtered resources.
[INFO] [compiler:compile]
[INFO] Compiling 16 source files to /x1/continuum/working-directory/216/integration/jbi/target/classes
[INFO] [resources:testResources]
[INFO] Using default encoding to copy filtered resources.
[INFO] [compiler:testCompile]
[INFO] Compiling 6 source files to /x1/continuum/working-directory/216/integration/jbi/target/test-classes
[INFO] [surefire:test]
[INFO] Surefire report directory: /x1/continuum/working-directory/216/integration/jbi/target/surefire-reports

-------------------------------------------------------
 T E S T S
-------------------------------------------------------
Running org.apache.cxf.jbi.se.CXFServiceUnitManagerTest
Tests run: 20, Failures: 0, Errors: 0, Skipped: 0, Time elapsed: 20.32 sec
Running org.apache.cxf.jbi.se.CXFServiceUnitTest
Tests run: 6, Failures: 0, Errors: 0, Skipped: 0, Time elapsed: 3.466 sec
Running org.apache.cxf.jbi.se.state.ServiceEngineShutdownTest
Tests run: 4, Failures: 0, Errors: 0, Skipped: 0, Time elapsed: 0.125 sec
Running org.apache.cxf.jbi.se.state.ServiceEngineStartTest
Tests run: 4, Failures: 0, Errors: 0, Skipped: 0, Time elapsed: 0.03 sec
Running org.apache.cxf.jbi.se.state.ServiceEngineStateFactoryTest
Tests run: 2, Failures: 0, Errors: 0, Skipped: 0, Time elapsed: 0.011 sec
Running org.apache.cxf.jbi.se.state.ServiceEngineStopTest
Tests run: 4, Failures: 0, Errors: 0, Skipped: 0, Time elapsed: 0.023 sec

Results :

Tests run: 40, Failures: 0, Errors: 0, Skipped: 0

[INFO] [jar:jar]
[INFO] Building jar: /x1/continuum/working-directory/216/integration/jbi/target/cxf-integration-jbi-2.0-incubator-SNAPSHOT.jar
[INFO] [install:install]
[INFO] Installing /x1/continuum/working-directory/216/integration/jbi/target/cxf-integration-jbi-2.0-incubator-SNAPSHOT.jar to /home/continuum/.m2/repository/org/apache/cxf/cxf-integration-jbi/2.0-incubator-SNAPSHOT/cxf-integration-jbi-2.0-incubator-SNAPSHOT.jar
[INFO] ----------------------------------------------------------------------------
[INFO] Building Apache CXF JCA Connection
[INFO]    task-segment: [clean, install]
[INFO] ----------------------------------------------------------------------------
[INFO] [clean:clean]
[INFO] Deleting directory /x1/continuum/working-directory/216/integration/jca/target
[INFO] Deleting directory /x1/continuum/working-directory/216/integration/jca/target/classes
[INFO] Deleting directory /x1/continuum/working-directory/216/integration/jca/target/test-classes
[INFO] [checkstyle:checkstyle {execution: validate}]
[INFO] Starting audit...
Audit done.

[INFO] Preparing pmd:check
[INFO] [pmd:pmd]
[INFO] [pmd:check {execution: validate}]
[INFO] 
[INFO] [remote-resources:process {execution: default}]
[INFO] [resources:resources]
[INFO] Using default encoding to copy filtered resources.
[INFO] [compiler:compile]
[INFO] Compiling 35 source files to /x1/continuum/working-directory/216/integration/jca/target/classes
[INFO] [resources:testResources]
[INFO] Using default encoding to copy filtered resources.
[INFO] [compiler:testCompile]
[INFO] Compiling 35 source files to /x1/continuum/working-directory/216/integration/jca/target/test-classes
[INFO] [surefire:test]
[INFO] Surefire report directory: /x1/continuum/working-directory/216/integration/jca/target/surefire-reports

-------------------------------------------------------
 T E S T S
-------------------------------------------------------
Running org.apache.cxf.jca.servant.CXFConnectEJBServantTest
Tests run: 2, Failures: 0, Errors: 0, Skipped: 0, Time elapsed: 2.283 sec
Running org.apache.cxf.jca.core.logging.LoggerHelperTest
Tests run: 3, Failures: 0, Errors: 0, Skipped: 0, Time elapsed: 0.208 sec
Running org.apache.cxf.jca.cxf.handlers.ObjectMethodInvocationHandlerTest
Tests run: 9, Failures: 0, Errors: 0, Skipped: 0, Time elapsed: 0.875 sec
Running org.apache.cxf.jca.core.classloader.PlugInClassLoaderTest
Tests run: 10, Failures: 0, Errors: 0, Skipped: 0, Time elapsed: 0.34 sec
Running org.apache.cxf.jca.cxf.handlers.InvocationHandlerFactoryTest
Tests run: 2, Failures: 0, Errors: 0, Skipped: 0, Time elapsed: 0.026 sec
Running org.apache.cxf.jca.cxf.ConnectionFactoryImplTest
Tests run: 7, Failures: 0, Errors: 0, Skipped: 0, Time elapsed: 0.357 sec
Running org.apache.cxf.jca.cxf.AssociatedManagedConnectionFactoryImplTest
Tests run: 22, Failures: 0, Errors: 0, Skipped: 0, Time elapsed: 11.073 sec
Running org.apache.cxf.jca.core.resourceadapter.HandlerTest
Tests run: 2, Failures: 0, Errors: 0, Skipped: 0, Time elapsed: 0.071 sec
Running org.apache.cxf.jca.core.resourceadapter.ResourceAdapterInternalExceptionTest
Tests run: 6, Failures: 0, Errors: 0, Skipped: 0, Time elapsed: 0.091 sec
Running org.apache.cxf.jca.cxf.handlers.ProxyInvocationHandlerTest
Tests run: 6, Failures: 0, Errors: 0, Skipped: 0, Time elapsed: 1.697 sec
Running org.apache.cxf.jca.cxf.ManagedConnectionFactoryImplTest
Tests run: 18, Failures: 0, Errors: 0, Skipped: 0, Time elapsed: 2.257 sec
Running org.apache.cxf.jca.core.resourceadapter.ResourceBeanTest
Tests run: 1, Failures: 0, Errors: 0, Skipped: 0, Time elapsed: 0.015 sec
Running org.apache.cxf.jca.cxf.handlers.InvokingInvocationHandlerTest
Tests run: 6, Failures: 0, Errors: 0, Skipped: 0, Time elapsed: 0.033 sec
Running org.apache.cxf.jca.jarloader.JarLoaderTest
Tests run: 2, Failures: 0, Errors: 0, Skipped: 0, Time elapsed: 0.04 sec
Running org.apache.cxf.jca.core.resourceadapter.ManagedConnectionFactoryImplTest
Tests run: 8, Failures: 0, Errors: 0, Skipped: 0, Time elapsed: 0.303 sec
Running org.apache.cxf.jca.cxf.JCABusFactoryTest
Tests run: 13, Failures: 0, Errors: 0, Skipped: 0, Time elapsed: 16.023 sec
Running org.apache.cxf.jca.core.resourceadapter.ManagedConnectionImplTest
Tests run: 13, Failures: 0, Errors: 0, Skipped: 0, Time elapsed: 0.179 sec
Running org.apache.cxf.jca.core.resourceadapter.UriHandlerInitTest
Tests run: 1, Failures: 0, Errors: 0, Skipped: 0, Time elapsed: 0.011 sec
Running org.apache.cxf.jca.cxf.ManagedConnectionImplTest
Jun 12, 2007 3:39:23 AM org.apache.cxf.jca.core.resourceadapter.ResourceAdapterInternalException <init>
WARNING: java.lang.ClassCastException: $Proxy62
Tests run: 9, Failures: 0, Errors: 0, Skipped: 0, Time elapsed: 11.482 sec
Running org.apache.cxf.jca.cxf.CXFConnectionRequestInfoTest
Tests run: 1, Failures: 0, Errors: 0, Skipped: 0, Time elapsed: 0.025 sec
Running org.apache.cxf.jca.cxf.ResourceAdapterImplTest
Tests run: 9, Failures: 0, Errors: 0, Skipped: 0, Time elapsed: 0.236 sec

Results :

Tests run: 150, Failures: 0, Errors: 0, Skipped: 0

[INFO] [jar:jar]
[INFO] Building jar: /x1/continuum/working-directory/216/integration/jca/target/cxf-integration-jca-2.0-incubator-SNAPSHOT.jar
[INFO] [install:install]
[INFO] Installing /x1/continuum/working-directory/216/integration/jca/target/cxf-integration-jca-2.0-incubator-SNAPSHOT.jar to /home/continuum/.m2/repository/org/apache/cxf/cxf-integration-jca/2.0-incubator-SNAPSHOT/cxf-integration-jca-2.0-incubator-SNAPSHOT.jar
[INFO] ----------------------------------------------------------------------------
[INFO] Building Apache CXF Integration
[INFO]    task-segment: [clean, install]
[INFO] ----------------------------------------------------------------------------
[INFO] [clean:clean]
[INFO] Deleting directory /x1/continuum/working-directory/216/integration/target
[INFO] Deleting directory /x1/continuum/working-directory/216/integration/target/classes
[INFO] Deleting directory /x1/continuum/working-directory/216/integration/target/test-classes
[INFO] [site:attach-descriptor]
[INFO] [install:install]
[INFO] Installing /x1/continuum/working-directory/216/integration/pom.xml to /home/continuum/.m2/repository/org/apache/cxf/cxf-integration/2.0-incubator-SNAPSHOT/cxf-integration-2.0-incubator-SNAPSHOT.pom
[INFO] ----------------------------------------------------------------------------
[INFO] Building Apache CXF System Tests
[INFO]    task-segment: [clean, install]
[INFO] ----------------------------------------------------------------------------
[INFO] [clean:clean]
[INFO] Deleting directory /x1/continuum/working-directory/216/systests/target
[INFO] Deleting directory /x1/continuum/working-directory/216/systests/target/classes
[INFO] Deleting directory /x1/continuum/working-directory/216/systests/target/test-classes
[INFO] [checkstyle:checkstyle {execution: validate}]
[INFO] Starting audit...
Audit done.

[INFO] Preparing pmd:check
[INFO] [pmd:pmd]
[INFO] [pmd:check {execution: validate}]
[INFO] 
[INFO] [remote-resources:process {execution: default}]
[INFO] [resources:resources]
[INFO] Using default encoding to copy filtered resources.
[INFO] [compiler:compile]
[INFO] No sources to compile
[INFO] [resources:testResources]
[INFO] Using default encoding to copy filtered resources.
[INFO] [compiler:testCompile]
[INFO] Compiling 198 source files to /x1/continuum/working-directory/216/systests/target/test-classes
[INFO] [surefire:test]
[INFO] Surefire report directory: /x1/continuum/working-directory/216/systests/target/surefire-reports

-------------------------------------------------------
 T E S T S
-------------------------------------------------------
Running org.apache.cxf.systest.provider.AttachmentProviderXMLClientServerTest
Tests run: 1, Failures: 0, Errors: 0, Skipped: 0, Time elapsed: 14.141 sec

Results :

Tests run: 1, Failures: 0, Errors: 0, Skipped: 0


-------------------------------------------------------
 T E S T S
-------------------------------------------------------
Running org.apache.cxf.systest.jaxws.ClientServerMiscTest
Tests run: 4, Failures: 0, Errors: 0, Skipped: 0, Time elapsed: 20.969 sec

Results :

Tests run: 5, Failures: 0, Errors: 0, Skipped: 0


-------------------------------------------------------
 T E S T S
-------------------------------------------------------
Running org.apache.cxf.systest.ws.addressing.MAPTest
Tests run: 7, Failures: 0, Errors: 0, Skipped: 2, Time elapsed: 24.661 sec

Results :

Tests run: 12, Failures: 0, Errors: 0, Skipped: 2


-------------------------------------------------------
 T E S T S
-------------------------------------------------------
Running org.apache.cxf.systest.management.CountersClientServerTest
*********  greetMeOneWay: hello
Tests run: 1, Failures: 0, Errors: 0, Skipped: 0, Time elapsed: 11.593 sec

Results :

Tests run: 13, Failures: 0, Errors: 0, Skipped: 2


-------------------------------------------------------
 T E S T S
-------------------------------------------------------
Running org.apache.cxf.systest.coloc.ColocWrappedDocLitTest
*********  greetMeOneWay: oneWay
*********  greetMeOneWay: oneWay
Tests run: 4, Failures: 0, Errors: 0, Skipped: 0, Time elapsed: 18.181 sec

Results :

Tests run: 17, Failures: 0, Errors: 0, Skipped: 2


-------------------------------------------------------
 T E S T S
-------------------------------------------------------
Running org.apache.cxf.systest.dispatch.DispatchClientServerTest
Tests run: 8, Failures: 0, Errors: 0, Skipped: 0, Time elapsed: 22.443 sec

Results :

Tests run: 25, Failures: 0, Errors: 0, Skipped: 2


-------------------------------------------------------
 T E S T S
-------------------------------------------------------
Running org.apache.cxf.systest.factory_pattern.ManualHttpMulitplexClientServerTest
Tests run: 2, Failures: 0, Errors: 0, Skipped: 0, Time elapsed: 23.064 sec

Results :

Tests run: 27, Failures: 0, Errors: 0, Skipped: 2


-------------------------------------------------------
 T E S T S
-------------------------------------------------------
Running org.apache.cxf.systest.mtom.MtomServerTest
Tests run: 2, Failures: 0, Errors: 0, Skipped: 0, Time elapsed: 12.758 sec

Results :

Tests run: 29, Failures: 0, Errors: 0, Skipped: 2


-------------------------------------------------------
 T E S T S
-------------------------------------------------------
Running org.apache.cxf.systest.jaxws.ClientServerXMLTest
Tests run: 7, Failures: 0, Errors: 0, Skipped: 0, Time elapsed: 22.385 sec

Results :

Tests run: 36, Failures: 0, Errors: 0, Skipped: 2


-------------------------------------------------------
 T E S T S
-------------------------------------------------------
Running org.apache.cxf.systest.coloc.ColocHeaderRpcLitTest
Tests run: 7, Failures: 0, Errors: 0, Skipped: 0, Time elapsed: 18.406 sec

Results :

Tests run: 43, Failures: 0, Errors: 0, Skipped: 2


-------------------------------------------------------
 T E S T S
-------------------------------------------------------
Running org.apache.cxf.systest.jaxws.ClientServerMixedStyleTest
Tests run: 1, Failures: 0, Errors: 0, Skipped: 0, Time elapsed: 19.933 sec

Results :

Tests run: 44, Failures: 0, Errors: 0, Skipped: 2


-------------------------------------------------------
 T E S T S
-------------------------------------------------------
Running org.apache.cxf.systest.rest.RestClientServerBookTest
Tests run: 2, Failures: 0, Errors: 0, Skipped: 0, Time elapsed: 20.202 sec

Results :

Tests run: 46, Failures: 0, Errors: 0, Skipped: 2


-------------------------------------------------------
 T E S T S
-------------------------------------------------------
Running org.apache.cxf.systest.servlet.SpringServletTest
Tests run: 3, Failures: 0, Errors: 0, Skipped: 0, Time elapsed: 12.176 sec

Results :

Tests run: 49, Failures: 0, Errors: 0, Skipped: 2


-------------------------------------------------------
 T E S T S
-------------------------------------------------------
Running org.apache.cxf.systest.type_test.soap.SOAPRpcLitClientTypeTest
Tests run: 176, Failures: 0, Errors: 0, Skipped: 0, Time elapsed: 40.496 sec

Results :

Tests run: 225, Failures: 0, Errors: 0, Skipped: 2


-------------------------------------------------------
 T E S T S
-------------------------------------------------------
Running org.apache.cxf.systest.coloc.ColocHeaderDocLitTest
Tests run: 5, Failures: 0, Errors: 0, Skipped: 0, Time elapsed: 20.996 sec

Results :

Tests run: 230, Failures: 0, Errors: 0, Skipped: 2


-------------------------------------------------------
 T E S T S
-------------------------------------------------------
Running org.apache.cxf.systest.mtom.MtomPolicyTest
Tests run: 2, Failures: 0, Errors: 0, Skipped: 0, Time elapsed: 12.117 sec

Results :

Tests run: 232, Failures: 0, Errors: 0, Skipped: 2


-------------------------------------------------------
 T E S T S
-------------------------------------------------------
Running org.apache.cxf.systest.ws.rm.ServerPersistenceTest
Tests run: 1, Failures: 0, Errors: 0, Skipped: 0, Time elapsed: 84.784 sec

Results :

Tests run: 233, Failures: 0, Errors: 0, Skipped: 2


-------------------------------------------------------
 T E S T S
-------------------------------------------------------
Running org.apache.cxf.systest.ws.policy.HTTPClientPolicyTest
Tests run: 1, Failures: 0, Errors: 0, Skipped: 0, Time elapsed: 42.716 sec

Results :

Tests run: 234, Failures: 0, Errors: 0, Skipped: 2


-------------------------------------------------------
 T E S T S
-------------------------------------------------------
Running org.apache.cxf.systest.basicDOCBare.DOCBareClientServerTest
Tests run: 2, Failures: 0, Errors: 0, Skipped: 0, Time elapsed: 24.334 sec

Results :

Tests run: 236, Failures: 0, Errors: 0, Skipped: 2


-------------------------------------------------------
 T E S T S
-------------------------------------------------------
Running org.apache.cxf.systest.ws.policy.AddressingInlinePolicyTest
Tests run: 1, Failures: 0, Errors: 0, Skipped: 0, Time elapsed: 36.537 sec

Results :

Tests run: 237, Failures: 0, Errors: 0, Skipped: 2


-------------------------------------------------------
 T E S T S
-------------------------------------------------------
Running org.apache.cxf.systest.dispatch.DispatchXMLClientServerTest
Tests run: 3, Failures: 0, Errors: 0, Skipped: 0, Time elapsed: 38.63 sec

Results :

Tests run: 240, Failures: 0, Errors: 0, Skipped: 2


-------------------------------------------------------
 T E S T S
-------------------------------------------------------
Running org.apache.cxf.systest.handlers.HandlerInvocationUsingAddNumbersTest
Tests run: 5, Failures: 0, Errors: 0, Skipped: 1, Time elapsed: 35.78 sec

Results :

Tests run: 245, Failures: 0, Errors: 0, Skipped: 3


-------------------------------------------------------
 T E S T S
-------------------------------------------------------
Running org.apache.cxf.systest.type_test.soap.SOAPDocLitClientTypeTest
Tests run: 176, Failures: 0, Errors: 0, Skipped: 0, Time elapsed: 53.052 sec

Results :

Tests run: 421, Failures: 0, Errors: 0, Skipped: 3


-------------------------------------------------------
 T E S T S
-------------------------------------------------------
Running org.apache.cxf.systest.ws.rm.DecoupledBareTest
Tests run: 1, Failures: 0, Errors: 0, Skipped: 0, Time elapsed: 39.41 sec

Results :

Tests run: 422, Failures: 0, Errors: 0, Skipped: 3


-------------------------------------------------------
 T E S T S
-------------------------------------------------------
Running org.apache.cxf.systest.jaxws.LocatorClientServerTest
Tests run: 1, Failures: 0, Errors: 0, Skipped: 0, Time elapsed: 38.953 sec

Results :

Tests run: 423, Failures: 0, Errors: 0, Skipped: 3


-------------------------------------------------------
 T E S T S
-------------------------------------------------------
Running org.apache.cxf.systest.provider.ProviderXMLClientServerTest
Tests run: 1, Failures: 0, Errors: 0, Skipped: 0, Time elapsed: 37.173 sec

Results :

Tests run: 424, Failures: 0, Errors: 0, Skipped: 3


-------------------------------------------------------
 T E S T S
-------------------------------------------------------
Running org.apache.cxf.systest.management.ManagedClientServerTest
the size is 1
Tests run: 1, Failures: 0, Errors: 0, Skipped: 0, Time elapsed: 21.615 sec

Results :

Tests run: 425, Failures: 0, Errors: 0, Skipped: 3


-------------------------------------------------------
 T E S T S
-------------------------------------------------------
Running org.apache.cxf.systest.handlers.HandlerInvocationTest
Tests run: 33, Failures: 0, Errors: 0, Skipped: 5, Time elapsed: 100.482 sec

Results :

Tests run: 458, Failures: 0, Errors: 0, Skipped: 8


-------------------------------------------------------
 T E S T S
-------------------------------------------------------
Running org.apache.cxf.systest.jaxws.ClientServerRPCLitTest
Tests run: 2, Failures: 0, Errors: 0, Skipped: 0, Time elapsed: 38.372 sec

Results :

Tests run: 460, Failures: 0, Errors: 0, Skipped: 8


-------------------------------------------------------
 T E S T S
-------------------------------------------------------
Running org.apache.cxf.systest.servlet.HttpBindingServletTest
Tests run: 2, Failures: 0, Errors: 0, Skipped: 0, Time elapsed: 20.696 sec

Results :

Tests run: 462, Failures: 0, Errors: 0, Skipped: 8


-------------------------------------------------------
 T E S T S
-------------------------------------------------------
Running org.apache.cxf.systest.management.ManagedBusTest
Tests run: 2, Failures: 0, Errors: 0, Skipped: 0, Time elapsed: 14.737 sec

Results :

Tests run: 464, Failures: 0, Errors: 0, Skipped: 8


-------------------------------------------------------
 T E S T S
-------------------------------------------------------
Running org.apache.cxf.systest.ws.policy.AddressingOptionalPolicyTest
Tests run: 2, Failures: 0, Errors: 0, Skipped: 0, Time elapsed: 39.345 sec

Results :

Tests run: 466, Failures: 0, Errors: 0, Skipped: 8


-------------------------------------------------------
 T E S T S
-------------------------------------------------------
Running org.apache.cxf.systest.bus.SpringBusFactoryTest
Tests run: 1, Failures: 0, Errors: 0, Skipped: 0, Time elapsed: 6.345 sec

Results :

Tests run: 467, Failures: 0, Errors: 0, Skipped: 8


-------------------------------------------------------
 T E S T S
-------------------------------------------------------
Running org.apache.cxf.systest.jaxws.ClientServerGreeterNoWsdlTest
Tests run: 2, Failures: 0, Errors: 0, Skipped: 0, Time elapsed: 32.998 sec

Results :

Tests run: 469, Failures: 0, Errors: 0, Skipped: 8


-------------------------------------------------------
 T E S T S
-------------------------------------------------------
Running org.apache.cxf.systest.ws.rm.ClientPersistenceTest
Tests run: 1, Failures: 0, Errors: 0, Skipped: 0, Time elapsed: 66.895 sec

Results :

Tests run: 470, Failures: 0, Errors: 0, Skipped: 8


-------------------------------------------------------
 T E S T S
-------------------------------------------------------
Running org.apache.cxf.systest.servlet.JsFrontEndServletTest
Tests run: 1, Failures: 0, Errors: 0, Skipped: 0, Time elapsed: 16.696 sec

Results :

Tests run: 471, Failures: 0, Errors: 0, Skipped: 8


-------------------------------------------------------
 T E S T S
-------------------------------------------------------
Running org.apache.cxf.systest.jaxws.ClientServerGreeterBaseTest
Tests run: 1, Failures: 0, Errors: 0, Skipped: 0, Time elapsed: 34.457 sec

Results :

Tests run: 472, Failures: 0, Errors: 0, Skipped: 8


-------------------------------------------------------
 T E S T S
-------------------------------------------------------
Running org.apache.cxf.systest.jbi.ClientServerTest
*********  greetMeOneWay: test
Reached here :ffang
Call sayHi here 
Reached pingMe
Tests run: 1, Failures: 0, Errors: 0, Skipped: 0, Time elapsed: 22.555 sec

Results :

Tests run: 473, Failures: 0, Errors: 0, Skipped: 8


-------------------------------------------------------
 T E S T S
-------------------------------------------------------
Running org.apache.cxf.systest.jaxws.JaxwsExecutorTest
Tests run: 1, Failures: 0, Errors: 0, Skipped: 0, Time elapsed: 36.367 sec

Results :

Tests run: 474, Failures: 0, Errors: 0, Skipped: 8


-------------------------------------------------------
 T E S T S
-------------------------------------------------------
Running org.apache.cxf.systest.ws.policy.RMPolicyTest
Tests run: 1, Failures: 0, Errors: 0, Skipped: 0, Time elapsed: 47.213 sec

Results :

Tests run: 475, Failures: 0, Errors: 0, Skipped: 8


-------------------------------------------------------
 T E S T S
-------------------------------------------------------
Running org.apache.cxf.systest.ws.rm.SequenceTest
Tests run: 24, Failures: 0, Errors: 0, Skipped: 1, Time elapsed: 230.352 sec

Results :

Tests run: 499, Failures: 0, Errors: 0, Skipped: 9


-------------------------------------------------------
 T E S T S
-------------------------------------------------------
Running org.apache.cxf.systest.versioning.ClientServerVersioningTest
Tests run: 1, Failures: 0, Errors: 0, Skipped: 0, Time elapsed: 35.701 sec

Results :

Tests run: 500, Failures: 0, Errors: 0, Skipped: 9


-------------------------------------------------------
 T E S T S
-------------------------------------------------------
Running org.apache.cxf.systest.schema_validation.ValidationClientServerTest
Tests run: 1, Failures: 0, Errors: 0, Skipped: 0, Time elapsed: 26.183 sec

Results :

Tests run: 501, Failures: 0, Errors: 0, Skipped: 9


-------------------------------------------------------
 T E S T S
-------------------------------------------------------
Running org.apache.cxf.systest.js.JSClientServerTest
Tests run: 2, Failures: 0, Errors: 0, Skipped: 0, Time elapsed: 18.901 sec

Results :

Tests run: 503, Failures: 0, Errors: 0, Skipped: 9


-------------------------------------------------------
 T E S T S
-------------------------------------------------------
Running org.apache.cxf.systest.jaxws.ClientServerRPCLitDefatulAnnoTest
Tests run: 1, Failures: 0, Errors: 0, Skipped: 0, Time elapsed: 17.793 sec

Results :

Tests run: 504, Failures: 0, Errors: 0, Skipped: 9


-------------------------------------------------------
 T E S T S
-------------------------------------------------------
Running org.apache.cxf.systest.lifecycle.LifeCycleTest
Tests run: 2, Failures: 0, Errors: 0, Skipped: 0, Time elapsed: 10.282 sec

Results :

Tests run: 506, Failures: 0, Errors: 0, Skipped: 9


-------------------------------------------------------
 T E S T S
-------------------------------------------------------
Running org.apache.cxf.systest.ws.policy.HTTPServerPolicyTest
Tests run: 1, Failures: 0, Errors: 0, Skipped: 0, Time elapsed: 19.23 sec

Results :

Tests run: 507, Failures: 0, Errors: 0, Skipped: 9


-------------------------------------------------------
 T E S T S
-------------------------------------------------------
Running org.apache.cxf.systest.provider.ProviderRPCClientServerTest
Tests run: 6, Failures: 0, Errors: 0, Skipped: 0, Time elapsed: 18.906 sec

Results :

Tests run: 513, Failures: 0, Errors: 0, Skipped: 9


-------------------------------------------------------
 T E S T S
-------------------------------------------------------
Running org.apache.cxf.systest.jca.OutBoundConnectionTest
Tests run: 1, Failures: 0, Errors: 0, Skipped: 0, Time elapsed: 23.106 sec

Results :

Tests run: 514, Failures: 0, Errors: 0, Skipped: 9


-------------------------------------------------------
 T E S T S
-------------------------------------------------------
Running org.apache.cxf.systest.interceptor.InterceptorFaultTest
Tests run: 3, Failures: 0, Errors: 0, Skipped: 1, Time elapsed: 41.43 sec

Results :

Tests run: 517, Failures: 0, Errors: 0, Skipped: 10


-------------------------------------------------------
 T E S T S
-------------------------------------------------------
Running org.apache.cxf.systest.handlers.TrivialSOAPHandlerTest
Tests run: 1, Failures: 0, Errors: 0, Skipped: 0, Time elapsed: 30.956 sec

Results :

Tests run: 518, Failures: 0, Errors: 0, Skipped: 10


-------------------------------------------------------
 T E S T S
-------------------------------------------------------
Running org.apache.cxf.systest.callback.CallbackClientServerTest
Tests run: 1, Failures: 0, Errors: 0, Skipped: 0, Time elapsed: 27.116 sec

Results :

Tests run: 519, Failures: 0, Errors: 0, Skipped: 10


-------------------------------------------------------
 T E S T S
-------------------------------------------------------
Running org.apache.cxf.systest.mtom.ClientMtomXopTest
Tests run: 1, Failures: 0, Errors: 0, Skipped: 0, Time elapsed: 24.801 sec

Results :

Tests run: 520, Failures: 0, Errors: 0, Skipped: 10


-------------------------------------------------------
 T E S T S
-------------------------------------------------------
Running org.apache.cxf.systest.clustering.FailoverTest
Tests run: 10, Failures: 0, Errors: 1, Skipped: 0, Time elapsed: 59.757 sec <<< FAILURE!
testRandomStrategy(org.apache.cxf.systest.clustering.FailoverTest)  Time elapsed: 4.129 sec  <<< ERROR!
javax.xml.ws.soap.SOAPFaultException: Error reading XMLStreamReader.
	at org.apache.cxf.jaxws.JaxWsClientProxy.invoke(JaxWsClientProxy.java:165)
	at $Proxy44.greetMe(Unknown Source)
	at org.apache.cxf.systest.clustering.FailoverTest.strategyTest(FailoverTest.java:314)
	at org.apache.cxf.systest.clustering.FailoverTest.testRandomStrategy(FailoverTest.java:294)
	at sun.reflect.NativeMethodAccessorImpl.invoke0(Native Method)
	at sun.reflect.NativeMethodAccessorImpl.invoke(NativeMethodAccessorImpl.java:39)
	at sun.reflect.DelegatingMethodAccessorImpl.invoke(DelegatingMethodAccessorImpl.java:25)
	at java.lang.reflect.Method.invoke(Method.java:585)
	at org.junit.internal.runners.TestMethodRunner.executeMethodBody(TestMethodRunner.java:99)
	at org.junit.internal.runners.TestMethodRunner.runUnprotected(TestMethodRunner.java:81)
	at org.junit.internal.runners.BeforeAndAfterRunner.runProtected(BeforeAndAfterRunner.java:34)
	at org.junit.internal.runners.TestMethodRunner.runMethod(TestMethodRunner.java:75)
	at org.junit.internal.runners.TestMethodRunner.run(TestMethodRunner.java:45)
	at org.junit.internal.runners.TestClassMethodsRunner.invokeTestMethod(TestClassMethodsRunner.java:66)
	at org.junit.internal.runners.TestClassMethodsRunner.run(TestClassMethodsRunner.java:35)
	at org.junit.internal.runners.TestClassRunner$1.runUnprotected(TestClassRunner.java:42)
	at org.junit.internal.runners.BeforeAndAfterRunner.runProtected(BeforeAndAfterRunner.java:34)
	at org.junit.internal.runners.TestClassRunner.run(TestClassRunner.java:52)
	at org.apache.maven.surefire.junit4.JUnit4TestSet.execute(JUnit4TestSet.java:62)
	at org.apache.maven.surefire.suite.AbstractDirectoryTestSuite.executeTestSet(AbstractDirectoryTestSuite.java:138)
	at org.apache.maven.surefire.suite.AbstractDirectoryTestSuite.execute(AbstractDirectoryTestSuite.java:163)
	at org.apache.maven.surefire.Surefire.run(Surefire.java:84)
	at sun.reflect.NativeMethodAccessorImpl.invoke0(Native Method)
	at sun.reflect.NativeMethodAccessorImpl.invoke(NativeMethodAccessorImpl.java:39)
	at sun.reflect.DelegatingMethodAccessorImpl.invoke(DelegatingMethodAccessorImpl.java:25)
	at java.lang.reflect.Method.invoke(Method.java:585)
	at org.apache.maven.surefire.booter.SurefireBooter.runSuitesInProcess(SurefireBooter.java:244)
	at org.apache.maven.surefire.booter.SurefireBooter.main(SurefireBooter.java:814)
Caused by: org.apache.cxf.binding.soap.SoapFault: Error reading XMLStreamReader.
	at org.apache.cxf.binding.soap.interceptor.ReadHeadersInterceptor.handleMessage(ReadHeadersInterceptor.java:186)
	at org.apache.cxf.binding.soap.interceptor.ReadHeadersInterceptor.handleMessage(ReadHeadersInterceptor.java:57)
	at org.apache.cxf.phase.PhaseInterceptorChain.doIntercept(PhaseInterceptorChain.java:162)
	at org.apache.cxf.endpoint.ClientImpl.onMessage(ClientImpl.java:394)
	at org.apache.cxf.transport.http.HTTPConduit$WrappedOutputStream.handleResponse(HTTPConduit.java:1825)
	at org.apache.cxf.transport.http.HTTPConduit$WrappedOutputStream.doClose(HTTPConduit.java:1690)
	at org.apache.cxf.io.AbstractCachedOutputStream.close(AbstractCachedOutputStream.java:114)
	at org.apache.cxf.transport.AbstractConduit.close(AbstractConduit.java:66)
	at org.apache.cxf.interceptor.MessageSenderInterceptor$MessageSenderEndingInterceptor.handleMessage(MessageSenderInterceptor.java:62)
	at org.apache.cxf.phase.PhaseInterceptorChain.doIntercept(PhaseInterceptorChain.java:162)
	at org.apache.cxf.endpoint.ClientImpl.invoke(ClientImpl.java:249)
	at org.apache.cxf.endpoint.ClientImpl.invoke(ClientImpl.java:200)
	at org.apache.cxf.frontend.ClientProxy.invokeSync(ClientProxy.java:73)
	at org.apache.cxf.jaxws.JaxWsClientProxy.invoke(JaxWsClientProxy.java:134)
	... 27 more
Caused by: com.ctc.wstx.exc.WstxEOFException: Unexpected EOF in prolog
 at [row,col {unknown-source}]: [1,0]
	at com.ctc.wstx.sr.StreamScanner.throwUnexpectedEOF(StreamScanner.java:661)
	at com.ctc.wstx.sr.BasicStreamReader.handleEOF(BasicStreamReader.java:2134)
	at com.ctc.wstx.sr.BasicStreamReader.nextFromProlog(BasicStreamReader.java:2040)
	at com.ctc.wstx.sr.BasicStreamReader.next(BasicStreamReader.java:1069)
	at com.ctc.wstx.sr.BasicStreamReader.nextTag(BasicStreamReader.java:1095)
	at org.apache.cxf.binding.soap.interceptor.ReadHeadersInterceptor.handleMessage(ReadHeadersInterceptor.java:87)
	... 40 more


Results :

Tests in error: 
  testRandomStrategy(org.apache.cxf.systest.clustering.FailoverTest)

Tests run: 530, Failures: 0, Errors: 1, Skipped: 10


-------------------------------------------------------
 T E S T S
-------------------------------------------------------
Running org.apache.cxf.systest.multitransport.MultiTransportClientServerTest
Tests run: 1, Failures: 0, Errors: 0, Skipped: 0, Time elapsed: 39.218 sec

Results :

Tests in error: 

Tests run: 531, Failures: 0, Errors: 1, Skipped: 10


-------------------------------------------------------
 T E S T S
-------------------------------------------------------
Running org.apache.cxf.systest.jms.JMSClientServerTest
Tests run: 5, Failures: 0, Errors: 0, Skipped: 0, Time elapsed: 54.068 sec

Results :

Tests in error: 

Tests run: 536, Failures: 0, Errors: 1, Skipped: 10


-------------------------------------------------------
 T E S T S
-------------------------------------------------------
Running org.apache.cxf.systest.jaxws.ClientServerGreeterBaseNoWsdlTest
Tests run: 1, Failures: 0, Errors: 0, Skipped: 0, Time elapsed: 23.448 sec

Results :

Tests in error: 

Tests run: 537, Failures: 0, Errors: 1, Skipped: 10


-------------------------------------------------------
 T E S T S
-------------------------------------------------------
Running org.apache.cxf.systest.factory_pattern.MultiplexClientServerTest
Tests run: 2, Failures: 0, Errors: 0, Skipped: 0, Time elapsed: 39.974 sec

Results :

Tests in error: 

Tests run: 539, Failures: 0, Errors: 1, Skipped: 10


-------------------------------------------------------
 T E S T S
-------------------------------------------------------
Running org.apache.cxf.systest.rest.RestClientServerTest
Tests run: 4, Failures: 0, Errors: 0, Skipped: 1, Time elapsed: 22.047 sec

Results :

Tests in error: 

Tests run: 543, Failures: 0, Errors: 1, Skipped: 11


-------------------------------------------------------
 T E S T S
-------------------------------------------------------
Running org.apache.cxf.systest.ws.rm.DecoupledClientServerTest
Tests run: 1, Failures: 0, Errors: 0, Skipped: 0, Time elapsed: 33.107 sec

Results :

Tests in error: 

Tests run: 544, Failures: 0, Errors: 1, Skipped: 11


-------------------------------------------------------
 T E S T S
-------------------------------------------------------
Running org.apache.cxf.systest.type_test.xml.XMLClientTypeTest
Tests run: 174, Failures: 0, Errors: 0, Skipped: 2, Time elapsed: 57.359 sec

Results :

Tests in error: 

Tests run: 718, Failures: 0, Errors: 1, Skipped: 13


-------------------------------------------------------
 T E S T S
-------------------------------------------------------
Running org.apache.cxf.systest.jaxws.AnyClientServerTest
Tests run: 2, Failures: 0, Errors: 0, Skipped: 1, Time elapsed: 25.27 sec

Results :

Tests in error: 

Tests run: 720, Failures: 0, Errors: 1, Skipped: 14


-------------------------------------------------------
 T E S T S
-------------------------------------------------------
Running org.apache.cxf.systest.jaxws.ClientServerTest
Bonjour
Tests run: 24, Failures: 0, Errors: 0, Skipped: 1, Time elapsed: 59.774 sec

Results :

Tests in error: 

Tests run: 744, Failures: 0, Errors: 1, Skipped: 15


-------------------------------------------------------
 T E S T S
-------------------------------------------------------
Running org.apache.cxf.systest.provider.ProviderClientServerTest
Tests run: 1, Failures: 0, Errors: 0, Skipped: 0, Time elapsed: 24.052 sec

Results :

Tests in error: 

Tests run: 745, Failures: 0, Errors: 1, Skipped: 15


-------------------------------------------------------
 T E S T S
-------------------------------------------------------
Running org.apache.cxf.systest.outofband.header.OOBHeaderTest
Tests run: 1, Failures: 0, Errors: 0, Skipped: 0, Time elapsed: 12.279 sec

Results :

Tests in error: 

Tests run: 746, Failures: 0, Errors: 1, Skipped: 15


-------------------------------------------------------
 T E S T S
-------------------------------------------------------
Running org.apache.cxf.systest.ws.policy.RMPolicyWsdlTest
Tests run: 1, Failures: 0, Errors: 0, Skipped: 0, Time elapsed: 30.328 sec

Results :

Tests in error: 

Tests run: 747, Failures: 0, Errors: 1, Skipped: 15


-------------------------------------------------------
 T E S T S
-------------------------------------------------------
Running org.apache.cxf.systest.soap12.Soap12ClientServerTest
Tests run: 5, Failures: 0, Errors: 0, Skipped: 0, Time elapsed: 24.823 sec

Results :

Tests in error: 

Tests run: 752, Failures: 0, Errors: 1, Skipped: 15


-------------------------------------------------------
 T E S T S
-------------------------------------------------------
Running org.apache.cxf.systest.ws.policy.AddressingPolicyTest
Tests run: 1, Failures: 0, Errors: 0, Skipped: 0, Time elapsed: 28.601 sec

Results :

Tests in error: 

Tests run: 753, Failures: 0, Errors: 1, Skipped: 15


-------------------------------------------------------
 T E S T S
-------------------------------------------------------
Running org.apache.cxf.systest.jaxws.OASISCatalogTest
Tests run: 4, Failures: 0, Errors: 0, Skipped: 0, Time elapsed: 9.838 sec

Results :

Tests in error: 

Tests run: 757, Failures: 0, Errors: 1, Skipped: 15


-------------------------------------------------------
 T E S T S
-------------------------------------------------------
Running org.apache.cxf.systest.ws.addressing.NonDecoupledTest
Tests run: 7, Failures: 0, Errors: 0, Skipped: 2, Time elapsed: 36.948 sec

Results :

Tests in error: 

Tests run: 764, Failures: 0, Errors: 1, Skipped: 17


-------------------------------------------------------
 T E S T S
-------------------------------------------------------
Running org.apache.cxf.systest.servlet.CXFServletTest
Tests run: 6, Failures: 0, Errors: 0, Skipped: 0, Time elapsed: 27.839 sec

Results :

Tests in error: 

Tests run: 770, Failures: 0, Errors: 1, Skipped: 17


-------------------------------------------------------
 T E S T S
-------------------------------------------------------
Running org.apache.cxf.systest.factory_pattern.MultiplexHttpAddressClientServerTest
Tests run: 2, Failures: 0, Errors: 0, Skipped: 0, Time elapsed: 27.937 sec

Results :

Tests in error: 

Tests run: 772, Failures: 0, Errors: 1, Skipped: 17


-------------------------------------------------------
 T E S T S
-------------------------------------------------------
Running org.apache.cxf.systest.rest.RestClientServerHttpBindingTest
Tests run: 3, Failures: 0, Errors: 0, Skipped: 1, Time elapsed: 20.285 sec

Results :

Tests in error: 

Tests run: 775, Failures: 0, Errors: 1, Skipped: 18


-------------------------------------------------------
 T E S T S
-------------------------------------------------------
Running org.apache.cxf.systest.http.HTTPConduitTest
Tests run: 10, Failures: 0, Errors: 0, Skipped: 0, Time elapsed: 32.706 sec

Results :

Tests in error: 

Tests run: 785, Failures: 0, Errors: 1, Skipped: 18


-------------------------------------------------------
 T E S T S
-------------------------------------------------------
Running org.apache.cxf.systest.servlet.ExternalServicesServletTest
Tests run: 1, Failures: 0, Errors: 0, Skipped: 0, Time elapsed: 12.04 sec

Results :

Tests in error: 

Tests run: 786, Failures: 0, Errors: 1, Skipped: 18


-------------------------------------------------------
 T E S T S
-------------------------------------------------------
Running org.apache.cxf.systest.swa.ClientServerSwaTest
Tests run: 4, Failures: 0, Errors: 0, Skipped: 1, Time elapsed: 28.604 sec

Results :

Tests in error: 

Tests run: 790, Failures: 0, Errors: 1, Skipped: 19

[INFO] ------------------------------------------------------------------------
[ERROR] BUILD FAILURE
[INFO] ------------------------------------------------------------------------
[INFO] There are test failures.
[INFO] ------------------------------------------------------------------------
[INFO] For more information, run Maven with the -e switch
[INFO] ------------------------------------------------------------------------
[INFO] Total time: 88 minutes 26 seconds
[INFO] Finished at: Tue Jun 12 04:30:16 PDT 2007
[INFO] Final Memory: 55M/63M
[INFO] ------------------------------------------------------------------------

****************************************************************************



Mime
View raw message