cxf-notifications mailing list archives

Site index · List index
Message view « Date » · « Thread »
Top « Date » · « Thread »
From "Continuum@vmbuild.apache.org" <cxf-notificati...@incubator.apache.org>
Subject [continuum] BUILD SUCCESSFUL: Apache CXF
Date Fri, 13 Apr 2007 15:52:11 GMT
Online report : http://vmbuild.apache.org/continuum/servlet/continuum/target/ProjectBuild.vm/view/ProjectBuild/id/216/buildId/110552
Build statistics:
  State: Ok
  Previous State: Failed
  Started at: Fri, 13 Apr 2007 08:00:31 -0700
  Finished at: Fri, 13 Apr 2007 08:52:10 -0700
  Total time: 51m 38s
  Build Trigger: Schedule
  Exit code: 0
  Building machine hostname: vmbuild.apache.org
  Operating system : Linux(unknown)
  Java version : 1.5.0_06(Sun Microsystems Inc.)

Changes
         dkulp          Lock down pmd version

             /incubator/cxf/trunk/parent/pom.xml
        
****************************************************************************
Output:
****************************************************************************
[INFO] Scanning for projects...
[INFO] Reactor build order: 
[INFO]   Apache CXF
[INFO]   Apache CXF Buildtools
[INFO]   Apache CXF Parent
[INFO]   Apache CXF Common Utilities
[INFO]   Apache CXF Common XSD2Java  Plugins
[INFO]   Apache CXF Common Schemas
[INFO]   Apache CXF XJC Default Value Plugin
[INFO]   Apache CXF XJC Default Value Plugin Tests
[INFO]   Apache CXF XJC Plugins
[INFO]   Apache CXF Common
[INFO]   Apache CXF API
[INFO]   Apache CXF Runtime Core
[INFO]   Apache CXF Command Line Tools Common
[INFO]   Apache CXF Command Line Tools Validator
[INFO]   Apache CXF Command Line Tools WSDLTo Core
[INFO]   Apache CXF Command Line Tools WSDLTo JAXWS Frontend
[INFO]   Apache CXF Command Line Tools WSDLTo JAXB Databinding
[INFO]   Apache CXF Command Line Tools WSDLTo Test
[INFO]   Apache CXF Command Line Tools WSDLTo Misctools
[INFO]   Apache CXF Command Line Tools
[INFO]   Apache CXF Command Line Tools WSDLTo
[INFO]   Apache CXF Code Generation Maven2 Plugins
[INFO]   Apache CXF Test Utilities
[INFO]   Apache CXF Runtime JAXB DataBinding
[INFO]   Apache CXF Runtime SOAP Binding
[INFO]   Apache CXF Runtime XML Binding
[INFO]   Apache CXF Runtime Local transport
[INFO]   Apache CXF Runtime Simple Frontend
[INFO]   Apache CXF Runtime JAX-WS Frontend
[INFO]   Apache CXF Command Line Tools JavaTo
[INFO]   Apache CXF Runtime HTTP transport
[INFO]   Apache CXF Runtime HTTP Jetty transport
[INFO]   Apache CXF Runtime Aegis Databinding
[INFO]   Apache CXF Runtime HTTP Binding
[INFO]   Apache CXF Runtime Object Binding
[INFO]   Apache CXF Colocated Binding
[INFO]   Apache CXF Runtime
[INFO]   Apache CXF Runtime Bindings
[INFO]   Apache CXF Runtime JavaScript Frontend
[INFO]   Apache CXF Runtime Management
[INFO]   Apache CXF Runtime JMS Transport
[INFO]   Apache CXF Runtime WS Policy
[INFO]   Apache CXF Runtime WS Addressing
[INFO]   Apache CXF Runtime WS Reliable Messaging
[INFO]   Apache CXF Runtime WS Security
[INFO]   Apache CXF JBI Integration
[INFO]   Apache CXF JCA Connection
[INFO]   Apache CXF Integration
[INFO]   Apache CXF System Tests
[INFO] ----------------------------------------------------------------------------
[INFO] Building Apache CXF
[INFO]    task-segment: [clean, install]
[INFO] ----------------------------------------------------------------------------
[INFO] [clean:clean]
[INFO] Deleting directory /x1/continuum/working-directory/216/target
[INFO] Deleting directory /x1/continuum/working-directory/216/target/classes
[INFO] Deleting directory /x1/continuum/working-directory/216/target/test-classes
[INFO] [site:attach-descriptor]
[INFO] [install:install]
[INFO] Installing /x1/continuum/working-directory/216/pom.xml to /home/continuum/.m2/repository/org/apache/cxf/cxf/2.0-incubator-RC-SNAPSHOT/cxf-2.0-incubator-RC-SNAPSHOT.pom
[INFO] ----------------------------------------------------------------------------
[INFO] Building Apache CXF Buildtools
[INFO]    task-segment: [clean, install]
[INFO] ----------------------------------------------------------------------------
[INFO] [clean:clean]
[INFO] Deleting directory /x1/continuum/working-directory/216/buildtools/target
[INFO] Deleting directory /x1/continuum/working-directory/216/buildtools/target/classes
[INFO] Deleting directory /x1/continuum/working-directory/216/buildtools/target/test-classes
[INFO] Setting property: classpath.resource.loader.class => 'org.codehaus.plexus.velocity.ContextClassLoaderResourceLoader'.
[INFO] Setting property: velocimacro.messages.on => 'false'.
[INFO] Setting property: resource.loader => 'classpath'.
[INFO] Setting property: resource.manager.logwhenfound => 'false'.
[INFO] [remote-resources:process {execution: default}]
[INFO] [resources:resources]
[INFO] Using default encoding to copy filtered resources.
[INFO] [compiler:compile]
[INFO] No sources to compile
[INFO] [resources:testResources]
[INFO] Using default encoding to copy filtered resources.
[INFO] [compiler:testCompile]
[INFO] Not compiling test sources
[INFO] [surefire:test]
[INFO] Tests are skipped.
[INFO] [jar:jar]
[INFO] Building jar: /x1/continuum/working-directory/216/buildtools/target/cxf-buildtools-2.0-incubator-RC-SNAPSHOT.jar
[INFO] [install:install]
[INFO] Installing /x1/continuum/working-directory/216/buildtools/target/cxf-buildtools-2.0-incubator-RC-SNAPSHOT.jar to /home/continuum/.m2/repository/org/apache/cxf/cxf-buildtools/2.0-incubator-RC-SNAPSHOT/cxf-buildtools-2.0-incubator-RC-SNAPSHOT.jar
[INFO] ----------------------------------------------------------------------------
[INFO] Building Apache CXF Parent
[INFO]    task-segment: [clean, install]
[INFO] ----------------------------------------------------------------------------
Downloading: http://repo1.maven.org/maven2/org/apache/maven/plugins/maven-pmd-plugin/2.2/maven-pmd-plugin-2.2.pom
6K downloaded
Downloading: http://repo1.maven.org/maven2/org/apache/maven/plugins/maven-pmd-plugin/2.2/maven-pmd-plugin-2.2.jar
37K downloaded
[INFO] [clean:clean]
[INFO] Deleting directory /x1/continuum/working-directory/216/parent/target
[INFO] Deleting directory /x1/continuum/working-directory/216/parent/target/classes
[INFO] Deleting directory /x1/continuum/working-directory/216/parent/target/test-classes
[INFO] Setting property: classpath.resource.loader.class => 'org.codehaus.plexus.velocity.ContextClassLoaderResourceLoader'.
[INFO] Setting property: velocimacro.messages.on => 'false'.
[INFO] Setting property: resource.loader => 'classpath'.
[INFO] Setting property: resource.manager.logwhenfound => 'false'.
[INFO] ************************************************************** 
[INFO] Starting Jakarta Velocity v1.4
[INFO] RuntimeInstance initializing.
[INFO] Default Properties File: org/apache/velocity/runtime/defaults/velocity.properties
[INFO] Default ResourceManager initializing. (class org.apache.velocity.runtime.resource.ResourceManagerImpl)
[INFO] Resource Loader Instantiated: org.codehaus.plexus.velocity.ContextClassLoaderResourceLoader
[INFO] ClasspathResourceLoader : initialization starting.
[INFO] ClasspathResourceLoader : initialization complete.
[INFO] ResourceCache : initialized. (class org.apache.velocity.runtime.resource.ResourceCacheImpl)
[INFO] Default ResourceManager initialization complete.
[INFO] Loaded System Directive: org.apache.velocity.runtime.directive.Literal
[INFO] Loaded System Directive: org.apache.velocity.runtime.directive.Macro
[INFO] Loaded System Directive: org.apache.velocity.runtime.directive.Parse
[INFO] Loaded System Directive: org.apache.velocity.runtime.directive.Include
[INFO] Loaded System Directive: org.apache.velocity.runtime.directive.Foreach
[INFO] Created: 20 parsers.
[INFO] Velocimacro : initialization starting.
[INFO] Velocimacro : adding VMs from VM library template : VM_global_library.vm
[ERROR] ResourceManager : unable to find resource 'VM_global_library.vm' in any resource loader.
[INFO] Velocimacro : error using  VM library template VM_global_library.vm : org.apache.velocity.exception.ResourceNotFoundException: Unable to find resource 'VM_global_library.vm'
[INFO] Velocimacro :  VM library template macro registration complete.
[INFO] Velocimacro : allowInline = true : VMs can be defined inline in templates
[INFO] Velocimacro : allowInlineToOverride = false : VMs defined inline may NOT replace previous VM definitions
[INFO] Velocimacro : allowInlineLocal = false : VMs defined inline will be  global in scope if allowed.
[INFO] Velocimacro : initialization complete.
[INFO] Velocity successfully started.
[INFO] [checkstyle:checkstyle {execution: validate}]
[INFO] Source directory does not exist - skipping report.
[INFO] Preparing pmd:check
Downloading: http://repo1.maven.org/maven2/xom/xom/1.1/xom-1.1.pom
1K downloaded
Downloading: http://repo1.maven.org/maven2/pmd/pmd/3.9/pmd-3.9.pom
7K downloaded
Downloading: http://repo1.maven.org/maven2/ant/ant/1.6/ant-1.6.pom
182b downloaded
Downloading: http://repo1.maven.org/maven2/backport-util-concurrent/backport-util-concurrent/3.0/backport-util-concurrent-3.0.pom
909b downloaded
Downloading: http://repo1.maven.org/maven2/backport-util-concurrent/backport-util-concurrent/3.0/backport-util-concurrent-3.0.jar
320K downloaded
Downloading: http://repo1.maven.org/maven2/pmd/pmd/3.9/pmd-3.9.jar
903K downloaded
Downloading: http://repo1.maven.org/maven2/xom/xom/1.1/xom-1.1.jar
421K downloaded
Downloading: http://repo1.maven.org/maven2/dom4j/dom4j/1.6.1/dom4j-1.6.1.jar
306K downloaded
Downloading: http://repo1.maven.org/maven2/ant/ant/1.6/ant-1.6.jar
929K downloaded
[INFO] [pmd:pmd]
[INFO] [pmd:check {execution: validate}]
[INFO] [remote-resources:process {execution: default}]
[INFO] [site:attach-descriptor]
[INFO] [install:install]
[INFO] Installing /x1/continuum/working-directory/216/parent/pom.xml to /home/continuum/.m2/repository/org/apache/cxf/cxf-parent/2.0-incubator-RC-SNAPSHOT/cxf-parent-2.0-incubator-RC-SNAPSHOT.pom
[INFO] ----------------------------------------------------------------------------
[INFO] Building Apache CXF Common Utilities
[INFO]    task-segment: [clean, install]
[INFO] ----------------------------------------------------------------------------
[INFO] [clean:clean]
[INFO] Deleting directory /x1/continuum/working-directory/216/common/common/target
[INFO] Deleting directory /x1/continuum/working-directory/216/common/common/target/classes
[INFO] Deleting directory /x1/continuum/working-directory/216/common/common/target/test-classes
[INFO] [checkstyle:checkstyle {execution: validate}]
[INFO] Starting audit...
Audit done.

[INFO] Preparing pmd:check
[INFO] [pmd:pmd]
[INFO] [pmd:check {execution: validate}]
[INFO] 
[INFO] [remote-resources:process {execution: default}]
[INFO] [resources:resources]
[INFO] Using default encoding to copy filtered resources.
[INFO] [compiler:compile]
[INFO] Compiling 96 source files to /x1/continuum/working-directory/216/common/common/target/classes
[INFO] [resources:testResources]
[INFO] Using default encoding to copy filtered resources.
[INFO] [compiler:testCompile]
[INFO] Compiling 34 source files to /x1/continuum/working-directory/216/common/common/target/test-classes
[INFO] [surefire:test]
[INFO] Surefire report directory: /x1/continuum/working-directory/216/common/common/target/surefire-reports

-------------------------------------------------------
 T E S T S
-------------------------------------------------------
Running org.apache.cxf.helpers.ServiceUtilsTest
Tests run: 1, Failures: 0, Errors: 0, Skipped: 0, Time elapsed: 0.071 sec
Running org.apache.cxf.common.commands.ForkedCommandTest
Tests run: 4, Failures: 0, Errors: 0, Skipped: 0, Time elapsed: 1.683 sec
Running org.apache.cxf.common.util.Base64UtilityTest
Tests run: 3, Failures: 0, Errors: 0, Skipped: 0, Time elapsed: 0.068 sec
Running org.apache.cxf.common.classloader.FireWallClassLoaderTest
Tests run: 4, Failures: 0, Errors: 0, Skipped: 0, Time elapsed: 0.033 sec
Running org.apache.cxf.version.VersionTest
Tests run: 2, Failures: 0, Errors: 0, Skipped: 0, Time elapsed: 0.018 sec
Running org.apache.cxf.common.util.CollectionUtilsTest
Tests run: 2, Failures: 0, Errors: 0, Skipped: 0, Time elapsed: 0.015 sec
Running org.apache.cxf.common.util.PackageUtilsTest
Tests run: 2, Failures: 0, Errors: 0, Skipped: 0, Time elapsed: 0.02 sec
Running org.apache.cxf.configuration.spring.SpringBeanMapTest
Tests run: 1, Failures: 0, Errors: 0, Skipped: 0, Time elapsed: 1.285 sec
Running org.apache.cxf.common.annotation.AnnotationProcessorTest
Tests run: 5, Failures: 0, Errors: 0, Skipped: 0, Time elapsed: 0.207 sec
Running org.apache.cxf.resource.ClassLoaderResolverTest
Tests run: 2, Failures: 0, Errors: 0, Skipped: 0, Time elapsed: 0.034 sec
Running org.apache.cxf.helpers.XMLUtilsTest
Tests run: 1, Failures: 0, Errors: 0, Skipped: 0, Time elapsed: 0.122 sec
Running org.apache.cxf.helpers.NameSpaceTest
Tests run: 2, Failures: 0, Errors: 0, Skipped: 0, Time elapsed: 0.027 sec
Running org.apache.cxf.common.util.TwoStageCacheTest
Tests run: 4, Failures: 0, Errors: 0, Skipped: 0, Time elapsed: 2.526 sec
Running org.apache.cxf.common.i18n.BundleUtilsTest
Tests run: 2, Failures: 0, Errors: 0, Skipped: 0, Time elapsed: 0.034 sec
Running org.apache.cxf.jaxb.JAXBUtilsTest
Tests run: 3, Failures: 0, Errors: 0, Skipped: 0, Time elapsed: 0.04 sec
Running org.apache.cxf.resource.URIResolverTest
Tests run: 2, Failures: 0, Errors: 0, Skipped: 0, Time elapsed: 0.078 sec
Running org.apache.cxf.common.injection.ResourceInjectorTest
Tests run: 6, Failures: 0, Errors: 0, Skipped: 0, Time elapsed: 0.186 sec
Running org.apache.cxf.staxutils.FragmentStreamReaderTest
Tests run: 1, Failures: 0, Errors: 0, Skipped: 0, Time elapsed: 0.247 sec
Running org.apache.cxf.configuration.spring.SpringBeanQNameMapTest
Tests run: 1, Failures: 0, Errors: 0, Skipped: 0, Time elapsed: 0.175 sec
Running org.apache.cxf.staxutils.StaxUtilsTest
Tests run: 5, Failures: 0, Errors: 0, Skipped: 0, Time elapsed: 0.09 sec
Running org.apache.cxf.jaxb.DatatypeFactoryTest
Tests run: 1, Failures: 0, Errors: 0, Skipped: 0, Time elapsed: 0.082 sec
Running org.apache.cxf.common.i18n.MessageTest
Tests run: 2, Failures: 0, Errors: 0, Skipped: 0, Time elapsed: 0.011 sec
Running org.apache.cxf.common.logging.LogUtilsTest
Tests run: 7, Failures: 0, Errors: 0, Skipped: 0, Time elapsed: 0.121 sec
Running org.apache.cxf.staxutils.DepthXMLStreamReaderTest
Tests run: 1, Failures: 0, Errors: 0, Skipped: 0, Time elapsed: 0.011 sec
Running org.apache.cxf.common.util.PropertiesLoaderUtilsTest
Tests run: 2, Failures: 0, Errors: 0, Skipped: 0, Time elapsed: 0.056 sec
Running org.apache.cxf.common.util.StringUtilsTest
Tests run: 6, Failures: 0, Errors: 0, Skipped: 0, Time elapsed: 0.037 sec
Running org.apache.cxf.common.commands.ResultBufferedCommandTest
Tests run: 2, Failures: 0, Errors: 0, Skipped: 0, Time elapsed: 0.784 sec
Running org.apache.cxf.staxutils.StaxStreamFilterTest
Tests run: 2, Failures: 0, Errors: 0, Skipped: 0, Time elapsed: 0.041 sec

Results :

Tests run: 76, Failures: 0, Errors: 0, Skipped: 0

[INFO] [jar:jar]
[INFO] Building jar: /x1/continuum/working-directory/216/common/common/target/cxf-common-utilities-2.0-incubator-RC-SNAPSHOT.jar
[INFO] [install:install]
[INFO] Installing /x1/continuum/working-directory/216/common/common/target/cxf-common-utilities-2.0-incubator-RC-SNAPSHOT.jar to /home/continuum/.m2/repository/org/apache/cxf/cxf-common-utilities/2.0-incubator-RC-SNAPSHOT/cxf-common-utilities-2.0-incubator-RC-SNAPSHOT.jar
[INFO] ----------------------------------------------------------------------------
[INFO] Building Apache CXF Common XSD2Java  Plugins
[INFO]    task-segment: [clean, install]
[INFO] ----------------------------------------------------------------------------
[INFO] [clean:clean]
[INFO] Deleting directory /x1/continuum/working-directory/216/common/xsd/target
[INFO] Deleting directory /x1/continuum/working-directory/216/common/xsd/target/classes
[INFO] Deleting directory /x1/continuum/working-directory/216/common/xsd/target/test-classes
[INFO] [checkstyle:checkstyle {execution: validate}]
[INFO] Starting audit...
Audit done.

[INFO] Preparing pmd:check
[INFO] [pmd:pmd]
[INFO] [pmd:check {execution: validate}]
[INFO] 
[INFO] [plugin:descriptor]
[INFO] Using 2 extractors.
[INFO] Applying extractor for language: java
[INFO] Extractor for language: java found 1 mojo descriptors.
[INFO] Applying extractor for language: bsh
[INFO] Extractor for language: bsh found 0 mojo descriptors.
[INFO] [remote-resources:process {execution: default}]
[INFO] [resources:resources]
[INFO] Using default encoding to copy filtered resources.
[INFO] [compiler:compile]
[INFO] Compiling 3 source files to /x1/continuum/working-directory/216/common/xsd/target/classes
[INFO] [resources:testResources]
[INFO] Using default encoding to copy filtered resources.
[INFO] [compiler:testCompile]
[INFO] No sources to compile
[INFO] [surefire:test]
[INFO] Surefire report directory: /x1/continuum/working-directory/216/common/xsd/target/surefire-reports

-------------------------------------------------------
 T E S T S
-------------------------------------------------------
There are no tests to run.

Results :

Tests run: 0, Failures: 0, Errors: 0, Skipped: 0

[INFO] [jar:jar]
[INFO] Building jar: /x1/continuum/working-directory/216/common/xsd/target/cxf-common-xsd-2.0-incubator-RC-SNAPSHOT.jar
[INFO] [plugin:addPluginArtifactMetadata]
[INFO] [install:install]
[INFO] Installing /x1/continuum/working-directory/216/common/xsd/target/cxf-common-xsd-2.0-incubator-RC-SNAPSHOT.jar to /home/continuum/.m2/repository/org/apache/cxf/cxf-common-xsd/2.0-incubator-RC-SNAPSHOT/cxf-common-xsd-2.0-incubator-RC-SNAPSHOT.jar
[INFO] [plugin:updateRegistry]
[INFO] ----------------------------------------------------------------------------
[INFO] Building Apache CXF Common Schemas
[INFO]    task-segment: [clean, install]
[INFO] ----------------------------------------------------------------------------
[INFO] [clean:clean]
[INFO] Deleting directory /x1/continuum/working-directory/216/common/schemas/target
[INFO] Deleting directory /x1/continuum/working-directory/216/common/schemas/target/classes
[INFO] Deleting directory /x1/continuum/working-directory/216/common/schemas/target/test-classes
[INFO] [checkstyle:checkstyle {execution: validate}]
[INFO] Starting audit...
Audit done.

[INFO] Preparing pmd:check
[INFO] [pmd:pmd]
[INFO] [pmd:check {execution: validate}]
[INFO] 
[INFO] [remote-resources:process {execution: default}]
[INFO] [resources:resources]
[INFO] Using default encoding to copy filtered resources.
[INFO] [compiler:compile]
[INFO] No sources to compile
[INFO] [resources:testResources]
[INFO] Using default encoding to copy filtered resources.
[INFO] [compiler:testCompile]
[INFO] Not compiling test sources
[INFO] [surefire:test]
[INFO] Tests are skipped.
[INFO] [jar:jar]
[INFO] Building jar: /x1/continuum/working-directory/216/common/schemas/target/cxf-common-schemas-2.0-incubator-RC-SNAPSHOT.jar
[INFO] [install:install]
[INFO] Installing /x1/continuum/working-directory/216/common/schemas/target/cxf-common-schemas-2.0-incubator-RC-SNAPSHOT.jar to /home/continuum/.m2/repository/org/apache/cxf/cxf-common-schemas/2.0-incubator-RC-SNAPSHOT/cxf-common-schemas-2.0-incubator-RC-SNAPSHOT.jar
[INFO] ----------------------------------------------------------------------------
[INFO] Building Apache CXF XJC Default Value Plugin
[INFO]    task-segment: [clean, install]
[INFO] ----------------------------------------------------------------------------
[INFO] [clean:clean]
[INFO] Deleting directory /x1/continuum/working-directory/216/common/xjc/dv/target
[INFO] Deleting directory /x1/continuum/working-directory/216/common/xjc/dv/target/classes
[INFO] Deleting directory /x1/continuum/working-directory/216/common/xjc/dv/target/test-classes
[INFO] [checkstyle:checkstyle {execution: validate}]
[INFO] Starting audit...
Audit done.

[INFO] Preparing pmd:check
[INFO] [pmd:pmd]
[INFO] [pmd:check {execution: validate}]
[INFO] 
[INFO] [remote-resources:process {execution: default}]
[INFO] [resources:resources]
[INFO] Using default encoding to copy filtered resources.
[INFO] [compiler:compile]
[INFO] Compiling 1 source file to /x1/continuum/working-directory/216/common/xjc/dv/target/classes
[INFO] [resources:testResources]
[INFO] Using default encoding to copy filtered resources.
[INFO] [compiler:testCompile]
[INFO] Not compiling test sources
[INFO] [surefire:test]
[INFO] Tests are skipped.
[INFO] [jar:jar]
[INFO] Building jar: /x1/continuum/working-directory/216/common/xjc/dv/target/cxf-xjc-dv-2.0-incubator-RC-SNAPSHOT.jar
[INFO] [install:install]
[INFO] Installing /x1/continuum/working-directory/216/common/xjc/dv/target/cxf-xjc-dv-2.0-incubator-RC-SNAPSHOT.jar to /home/continuum/.m2/repository/org/apache/cxf/cxf-xjc-dv/2.0-incubator-RC-SNAPSHOT/cxf-xjc-dv-2.0-incubator-RC-SNAPSHOT.jar
[INFO] ----------------------------------------------------------------------------
[INFO] Building Apache CXF XJC Default Value Plugin Tests
[INFO]    task-segment: [clean, install]
[INFO] ----------------------------------------------------------------------------
[INFO] [clean:clean]
[INFO] Deleting directory /x1/continuum/working-directory/216/common/xjc/dv-test/target
[INFO] Deleting directory /x1/continuum/working-directory/216/common/xjc/dv-test/target/classes
[INFO] Deleting directory /x1/continuum/working-directory/216/common/xjc/dv-test/target/test-classes
[INFO] [checkstyle:checkstyle {execution: validate}]
[INFO] Starting audit...
Audit done.

[INFO] Preparing pmd:check
[INFO] [pmd:pmd]
[INFO] [pmd:check {execution: validate}]
[INFO] 
[WARNING] 
	Artifact javax.xml.bind:jaxb-api:jar:2.0:runtime retains local scope 'runtime' overriding broader scope 'compile'
	given by a dependency. If this is not intended, modify or remove the local scope.

[WARNING] 
	Artifact com.sun.xml.bind:jaxb-xjc:jar:2.0.2:runtime retains local scope 'runtime' overriding broader scope 'compile'
	given by a dependency. If this is not intended, modify or remove the local scope.

[WARNING] 
	Artifact com.sun.xml.bind:jaxb-impl:jar:2.0.2:runtime retains local scope 'runtime' overriding broader scope 'compile'
	given by a dependency. If this is not intended, modify or remove the local scope.

[INFO] [jaxb:generate {execution: default}]
[INFO] Compiling file:/x1/continuum/working-directory/216/common/xjc/dv-test/src/test/resources/schemas/configuration/foo.xsd
[INFO] Writing output to /x1/continuum/working-directory/216/common/xjc/dv-test/target/generated/src/test/java
[INFO] [remote-resources:process {execution: default}]
[INFO] [resources:resources]
[INFO] Using default encoding to copy filtered resources.
[INFO] [compiler:compile]
[INFO] Compiling 4 source files to /x1/continuum/working-directory/216/common/xjc/dv-test/target/classes
[INFO] [resources:testResources]
[INFO] Using default encoding to copy filtered resources.
[INFO] [compiler:testCompile]
[INFO] Compiling 1 source file to /x1/continuum/working-directory/216/common/xjc/dv-test/target/test-classes
[INFO] [surefire:test]
[INFO] Surefire report directory: /x1/continuum/working-directory/216/common/xjc/dv-test/target/surefire-reports

-------------------------------------------------------
 T E S T S
-------------------------------------------------------
Running org.apache.cxf.xjc.dv.DefaultValueTest
Tests run: 1, Failures: 0, Errors: 0, Skipped: 0, Time elapsed: 0.193 sec

Results :

Tests run: 1, Failures: 0, Errors: 0, Skipped: 0

[INFO] [jar:jar]
[INFO] Building jar: /x1/continuum/working-directory/216/common/xjc/dv-test/target/cxf-xjc-dv-test-2.0-incubator-RC-SNAPSHOT.jar
[INFO] [install:install]
[INFO] Installing /x1/continuum/working-directory/216/common/xjc/dv-test/target/cxf-xjc-dv-test-2.0-incubator-RC-SNAPSHOT.jar to /home/continuum/.m2/repository/org/apache/cxf/cxf-xjc-dv-test/2.0-incubator-RC-SNAPSHOT/cxf-xjc-dv-test-2.0-incubator-RC-SNAPSHOT.jar
[INFO] ----------------------------------------------------------------------------
[INFO] Building Apache CXF XJC Plugins
[INFO]    task-segment: [clean, install]
[INFO] ----------------------------------------------------------------------------
[INFO] [clean:clean]
[INFO] Deleting directory /x1/continuum/working-directory/216/common/xjc/target
[INFO] Deleting directory /x1/continuum/working-directory/216/common/xjc/target/classes
[INFO] Deleting directory /x1/continuum/working-directory/216/common/xjc/target/test-classes
[INFO] [checkstyle:checkstyle {execution: validate}]
[INFO] Source directory does not exist - skipping report.
[INFO] Preparing pmd:check
[INFO] [pmd:pmd]
[INFO] [pmd:check {execution: validate}]
[INFO] [remote-resources:process {execution: default}]
[INFO] [site:attach-descriptor]
[INFO] [install:install]
[INFO] Installing /x1/continuum/working-directory/216/common/xjc/pom.xml to /home/continuum/.m2/repository/org/apache/cxf/cxf-xjc/2.0-incubator-RC-SNAPSHOT/cxf-xjc-2.0-incubator-RC-SNAPSHOT.pom
[INFO] ----------------------------------------------------------------------------
[INFO] Building Apache CXF Common
[INFO]    task-segment: [clean, install]
[INFO] ----------------------------------------------------------------------------
[INFO] [clean:clean]
[INFO] Deleting directory /x1/continuum/working-directory/216/common/target
[INFO] Deleting directory /x1/continuum/working-directory/216/common/target/classes
[INFO] Deleting directory /x1/continuum/working-directory/216/common/target/test-classes
[INFO] [site:attach-descriptor]
[INFO] [install:install]
[INFO] Installing /x1/continuum/working-directory/216/common/pom.xml to /home/continuum/.m2/repository/org/apache/cxf/cxf-common/2.0-incubator-RC-SNAPSHOT/cxf-common-2.0-incubator-RC-SNAPSHOT.pom
[INFO] ----------------------------------------------------------------------------
[INFO] Building Apache CXF API
[INFO]    task-segment: [clean, install]
[INFO] ----------------------------------------------------------------------------
[INFO] [clean:clean]
[INFO] Deleting directory /x1/continuum/working-directory/216/api/target
[INFO] Deleting directory /x1/continuum/working-directory/216/api/target/classes
[INFO] Deleting directory /x1/continuum/working-directory/216/api/target/test-classes
[INFO] [checkstyle:checkstyle {execution: validate}]
[INFO] Starting audit...
Audit done.

[INFO] Preparing pmd:check
[INFO] [pmd:pmd]
[INFO] [pmd:check {execution: validate}]
[INFO] 
[INFO] [dependency:unpack {execution: unpack-schemas}]
[INFO] Configured Artifact: org.apache.cxf:cxf-common-schemas:2.0-incubator-RC-SNAPSHOT:jar
[INFO] Expanding: /home/continuum/.m2/repository/org/apache/cxf/cxf-common-schemas/2.0-incubator-RC-SNAPSHOT/cxf-common-schemas-2.0-incubator-RC-SNAPSHOT.jar into /x1/continuum/working-directory/216/api/target/schemas
[WARNING] 
	Artifact active project artifact:
	artifact = org.apache.cxf:cxf-common-utilities:jar:2.0-incubator-RC-SNAPSHOT:runtime;
	project: org.apache.maven.project.MavenProject@5fe0dfa5 retains local scope 'runtime' overriding broader scope 'compile'
	given by a dependency. If this is not intended, modify or remove the local scope.

[WARNING] 
	Artifact com.sun.xml.bind:jaxb-impl:jar:2.0.5:runtime retains local scope 'runtime' overriding broader scope 'compile'
	given by a dependency. If this is not intended, modify or remove the local scope.

[WARNING] 
	Artifact com.sun.xml.bind:jaxb-xjc:jar:2.0:runtime retains local scope 'runtime' overriding broader scope 'compile'
	given by a dependency. If this is not intended, modify or remove the local scope.

[INFO] [cxf-common-xsd:xsdtojava {execution: generate-sources}]
[INFO] [remote-resources:process {execution: default}]
[INFO] [resources:resources]
[INFO] Using default encoding to copy filtered resources.
[INFO] [compiler:compile]
[INFO] Compiling 193 source files to /x1/continuum/working-directory/216/api/target/classes
[INFO] [cxf-common-xsd:xsdtojava {execution: generate-test-sources}]
[INFO] [resources:testResources]
[INFO] Using default encoding to copy filtered resources.
[INFO] [compiler:testCompile]
[INFO] Compiling 28 source files to /x1/continuum/working-directory/216/api/target/test-classes
[INFO] [surefire:test]
[INFO] Surefire report directory: /x1/continuum/working-directory/216/api/target/surefire-reports

-------------------------------------------------------
 T E S T S
-------------------------------------------------------
Running org.apache.cxf.wsdl.JAXBExtensionHelperTest
Tests run: 2, Failures: 0, Errors: 0, Skipped: 0, Time elapsed: 2.045 sec
Running org.apache.cxf.service.model.BindingMessageInfoTest
Tests run: 1, Failures: 0, Errors: 0, Skipped: 0, Time elapsed: 0.022 sec
Running org.apache.cxf.ws.policy.IntersectorTest
Tests run: 3, Failures: 0, Errors: 0, Skipped: 0, Time elapsed: 0.128 sec
Running org.apache.cxf.ws.policy.builder.jaxb.JaxbAssertionTest
Tests run: 3, Failures: 0, Errors: 0, Skipped: 0, Time elapsed: 0.54 sec
Running org.apache.cxf.ws.policy.builder.jaxb.JaxbAssertionBuilderTest
Tests run: 3, Failures: 0, Errors: 0, Skipped: 0, Time elapsed: 0.169 sec
Running org.apache.cxf.service.model.OperationInfoTest
Tests run: 5, Failures: 0, Errors: 0, Skipped: 0, Time elapsed: 0.091 sec
Running org.apache.cxf.ws.policy.AssertionInfoMapTest
Tests run: 3, Failures: 0, Errors: 0, Skipped: 0, Time elapsed: 0.046 sec
Running org.apache.cxf.BusFactoryTest
Tests run: 1, Failures: 0, Errors: 0, Skipped: 0, Time elapsed: 0.015 sec
Running org.apache.cxf.service.model.FaultInfoTest
Tests run: 1, Failures: 0, Errors: 0, Skipped: 0, Time elapsed: 0.006 sec
Running org.apache.cxf.service.model.SchemaInfoTest
Tests run: 2, Failures: 0, Errors: 0, Skipped: 0, Time elapsed: 0.017 sec
Running org.apache.cxf.service.model.MessagePartInfoTest
Tests run: 3, Failures: 0, Errors: 0, Skipped: 0, Time elapsed: 0.011 sec
Running org.apache.cxf.ws.policy.builder.primitive.NestedPrimitiveAssertionTest
Tests run: 1, Failures: 0, Errors: 0, Skipped: 0, Time elapsed: 0.024 sec
Running org.apache.cxf.service.model.BindingFaultInfoTest
Tests run: 1, Failures: 0, Errors: 0, Skipped: 0, Time elapsed: 0.012 sec
Running org.apache.cxf.ws.policy.builder.primitive.NestedPrimitiveAssertionBuilderTest
Tests run: 5, Failures: 0, Errors: 0, Skipped: 0, Time elapsed: 0.268 sec
Running org.apache.cxf.service.model.InterfaceInfoTest
Tests run: 2, Failures: 0, Errors: 0, Skipped: 0, Time elapsed: 0.041 sec
Running org.apache.cxf.phase.PhaseInterceptorChainTest
Tests run: 16, Failures: 0, Errors: 0, Skipped: 0, Time elapsed: 0.333 sec
Running org.apache.cxf.service.model.BindingOperationInfoTest
Tests run: 6, Failures: 0, Errors: 0, Skipped: 0, Time elapsed: 0.039 sec
Running org.apache.cxf.service.model.MessageInfoTest
Tests run: 2, Failures: 0, Errors: 0, Skipped: 0, Time elapsed: 0.013 sec

Results :

Tests run: 60, Failures: 0, Errors: 0, Skipped: 0

[INFO] [jar:jar]
[INFO] Building jar: /x1/continuum/working-directory/216/api/target/cxf-api-2.0-incubator-RC-SNAPSHOT.jar
[INFO] Preparing javadoc:jar
[WARNING] Removing: check from forked lifecycle, to prevent recursive invocation.
[WARNING] Removing: jar from forked lifecycle, to prevent recursive invocation.
[INFO] [checkstyle:checkstyle {execution: validate}]
[INFO] Starting audit...
Audit done.

[INFO] [dependency:unpack {execution: unpack-schemas}]
[INFO] Configured Artifact: org.apache.cxf:cxf-common-schemas:2.0-incubator-RC-SNAPSHOT:jar
[INFO] cxf-common-schemas-2.0-incubator-RC-SNAPSHOT.jar already unpacked.
[INFO] [cxf-common-xsd:xsdtojava {execution: generate-sources}]
[INFO] [javadoc:jar {execution: package}]
9 warnings
[INFO] Javadoc Warnings
[WARNING] javadoc: warning - Multiple sources of package comments found for package "org.apache.cxf.endpoint"
[WARNING] javadoc: warning - Multiple sources of package comments found for package "org.apache.cxf.transport"
[WARNING] javadoc: warning - Multiple sources of package comments found for package "org.apache.cxf.interceptor"
[WARNING] javadoc: warning - Multiple sources of package comments found for package "org.apache.cxf.service"
[WARNING] javadoc: warning - Multiple sources of package comments found for package "org.apache.cxf.phase"
[WARNING] javadoc: warning - Multiple sources of package comments found for package "org.apache.cxf.binding"
[WARNING] javadoc: warning - Multiple sources of package comments found for package "org.apache.cxf"
[WARNING] /x1/continuum/working-directory/216/api/src/main/java/org/apache/cxf/binding/BindingFactory.java:44: warning - @return tag has no arguments.
[WARNING] /x1/continuum/working-directory/216/api/src/main/java/org/apache/cxf/BusFactory.java:94: warning - @retur is an unknown tag.
[INFO] Building jar: /x1/continuum/working-directory/216/api/target/cxf-api-2.0-incubator-RC-SNAPSHOT-javadoc.jar
[INFO] [install:install]
[INFO] Installing /x1/continuum/working-directory/216/api/target/cxf-api-2.0-incubator-RC-SNAPSHOT.jar to /home/continuum/.m2/repository/org/apache/cxf/cxf-api/2.0-incubator-RC-SNAPSHOT/cxf-api-2.0-incubator-RC-SNAPSHOT.jar
[INFO] Installing /x1/continuum/working-directory/216/api/target/cxf-api-2.0-incubator-RC-SNAPSHOT-javadoc.jar to /home/continuum/.m2/repository/org/apache/cxf/cxf-api/2.0-incubator-RC-SNAPSHOT/cxf-api-2.0-incubator-RC-SNAPSHOT-javadoc.jar
[INFO] ----------------------------------------------------------------------------
[INFO] Building Apache CXF Runtime Core
[INFO]    task-segment: [clean, install]
[INFO] ----------------------------------------------------------------------------
[INFO] [clean:clean]
[INFO] Deleting directory /x1/continuum/working-directory/216/rt/core/target
[INFO] Deleting directory /x1/continuum/working-directory/216/rt/core/target/classes
[INFO] Deleting directory /x1/continuum/working-directory/216/rt/core/target/test-classes
[INFO] [checkstyle:checkstyle {execution: validate}]
[INFO] Starting audit...
Audit done.

[INFO] Preparing pmd:check
[INFO] [pmd:pmd]
[INFO] [pmd:check {execution: validate}]
[INFO] 
[INFO] [remote-resources:process {execution: default}]
[INFO] [resources:resources]
[INFO] Using default encoding to copy filtered resources.
[INFO] [compiler:compile]
[INFO] Compiling 117 source files to /x1/continuum/working-directory/216/rt/core/target/classes
[INFO] [resources:testResources]
[INFO] Using default encoding to copy filtered resources.
[INFO] [compiler:testCompile]
[INFO] Compiling 31 source files to /x1/continuum/working-directory/216/rt/core/target/test-classes
[INFO] [surefire:test]
[INFO] Surefire report directory: /x1/continuum/working-directory/216/rt/core/target/surefire-reports

-------------------------------------------------------
 T E S T S
-------------------------------------------------------
Running org.apache.cxf.interceptor.OutgoingChainInterceptorTest
Tests run: 1, Failures: 0, Errors: 0, Skipped: 0, Time elapsed: 1.241 sec
Running org.apache.cxf.test.XPathAssertTest
Tests run: 2, Failures: 0, Errors: 0, Skipped: 0, Time elapsed: 0.373 sec
Running org.apache.cxf.buslifecycle.CXFBusLifeCycleManagerTest
Tests run: 5, Failures: 0, Errors: 0, Skipped: 0, Time elapsed: 0.041 sec
Running org.apache.cxf.endpoint.EndpointResolverRegistryImplTest
Tests run: 4, Failures: 0, Errors: 0, Skipped: 0, Time elapsed: 0.126 sec
Running org.apache.cxf.bus.extension.ExtensionTest
Tests run: 3, Failures: 0, Errors: 0, Skipped: 0, Time elapsed: 0.026 sec
Running org.apache.cxf.attachment.AttachmentSerializerTest
Tests run: 2, Failures: 0, Errors: 0, Skipped: 0, Time elapsed: 0.388 sec
Running org.apache.cxf.wsdl11.WSDLManagerImplTest
Tests run: 2, Failures: 0, Errors: 0, Skipped: 0, Time elapsed: 0.558 sec
Running org.apache.cxf.configuration.spring.ConfigurerImplTest
Tests run: 3, Failures: 0, Errors: 0, Skipped: 0, Time elapsed: 0.848 sec
Running org.apache.cxf.transport.CachedOutputStreamTest
Tests run: 1, Failures: 0, Errors: 0, Skipped: 0, Time elapsed: 0.186 sec
Running org.apache.cxf.workqueue.AutomaticWorkQueueTest
Tests run: 10, Failures: 0, Errors: 0, Skipped: 0, Time elapsed: 11.76 sec
Running org.apache.cxf.bus.CXFBusImplTest
Tests run: 7, Failures: 0, Errors: 0, Skipped: 0, Time elapsed: 1.013 sec
Running org.apache.cxf.endpoint.ServerRegistryImpTest
Tests run: 1, Failures: 0, Errors: 0, Skipped: 0, Time elapsed: 0.007 sec
Running org.apache.cxf.configuration.spring.JaxbPropertyEditorTest
Tests run: 2, Failures: 0, Errors: 0, Skipped: 0, Time elapsed: 1.302 sec
Running org.apache.cxf.bus.spring.SpringBusFactoryTest
Tests run: 7, Failures: 0, Errors: 0, Skipped: 0, Time elapsed: 1.405 sec
Running org.apache.cxf.interceptor.ServiceInvokerInterceptorTest
Tests run: 1, Failures: 0, Errors: 0, Skipped: 0, Time elapsed: 0.019 sec
Running org.apache.cxf.wsdl11.WSDLDefinitionBuilderTest
Tests run: 2, Failures: 0, Errors: 0, Skipped: 0, Time elapsed: 0.08 sec
Running org.apache.cxf.bus.spring.BusApplicationContextTest
Tests run: 1, Failures: 0, Errors: 0, Skipped: 0, Time elapsed: 0.02 sec
Running org.apache.cxf.bus.extension.ExtensionFragmentParserTest
Tests run: 1, Failures: 0, Errors: 0, Skipped: 0, Time elapsed: 0.01 sec
Running org.apache.cxf.transport.HttpUriMapperTest
Tests run: 2, Failures: 0, Errors: 0, Skipped: 0, Time elapsed: 0.011 sec
Running org.apache.cxf.bus.extension.ExtensionManagerTest
Tests run: 2, Failures: 0, Errors: 0, Skipped: 0, Time elapsed: 0.017 sec
Running org.apache.cxf.wsdl11.ServiceWSDLBuilderTest
Tests run: 8, Failures: 0, Errors: 0, Skipped: 0, Time elapsed: 0.832 sec
Running org.apache.cxf.attachment.AttachmentDeserializerTest
Tests run: 2, Failures: 0, Errors: 0, Skipped: 0, Time elapsed: 0.032 sec
Running org.apache.cxf.wsdl11.WSDLServiceBuilderTest
Tests run: 14, Failures: 0, Errors: 0, Skipped: 0, Time elapsed: 1.479 sec

Results :

Tests run: 83, Failures: 0, Errors: 0, Skipped: 0

[INFO] [jar:jar]
[INFO] Building jar: /x1/continuum/working-directory/216/rt/core/target/cxf-rt-core-2.0-incubator-RC-SNAPSHOT.jar
[INFO] [install:install]
[INFO] Installing /x1/continuum/working-directory/216/rt/core/target/cxf-rt-core-2.0-incubator-RC-SNAPSHOT.jar to /home/continuum/.m2/repository/org/apache/cxf/cxf-rt-core/2.0-incubator-RC-SNAPSHOT/cxf-rt-core-2.0-incubator-RC-SNAPSHOT.jar
[INFO] ----------------------------------------------------------------------------
[INFO] Building Apache CXF Command Line Tools Common
[INFO]    task-segment: [clean, install]
[INFO] ----------------------------------------------------------------------------
[INFO] [clean:clean]
[INFO] Deleting directory /x1/continuum/working-directory/216/tools/common/target
[INFO] Deleting directory /x1/continuum/working-directory/216/tools/common/target/classes
[INFO] Deleting directory /x1/continuum/working-directory/216/tools/common/target/test-classes
[INFO] [checkstyle:checkstyle {execution: validate}]
[INFO] Starting audit...
Audit done.

[INFO] Preparing pmd:check
[INFO] [pmd:pmd]
[INFO] [pmd:check {execution: validate}]
[INFO] 
[INFO] [cxf-common-xsd:xsdtojava {execution: generate-sources}]
[INFO] [remote-resources:process {execution: default}]
[INFO] [resources:resources]
[INFO] Using default encoding to copy filtered resources.
[INFO] [compiler:compile]
[INFO] Compiling 90 source files to /x1/continuum/working-directory/216/tools/common/target/classes
[INFO] [resources:testResources]
[INFO] Using default encoding to copy filtered resources.
[INFO] [compiler:testCompile]
[INFO] Compiling 18 source files to /x1/continuum/working-directory/216/tools/common/target/test-classes
[INFO] [surefire:test]
[INFO] Surefire report directory: /x1/continuum/working-directory/216/tools/common/target/surefire-reports

-------------------------------------------------------
 T E S T S
-------------------------------------------------------
Running org.apache.cxf.tools.common.ToolContextTest
Tests run: 1, Failures: 0, Errors: 0, Skipped: 0, Time elapsed: 0.062 sec
Running org.apache.cxf.tools.common.toolspec.parser.CommandLineParserTest
Tests run: 16, Failures: 0, Errors: 0, Skipped: 0, Time elapsed: 3.57 sec
Running org.apache.cxf.tools.common.ProcessorEnvironmentTest
Tests run: 7, Failures: 0, Errors: 0, Skipped: 0, Time elapsed: 0.023 sec
Running org.apache.cxf.tools.common.toolspec.ToolSupportTest
Tests run: 1, Failures: 0, Errors: 0, Skipped: 0, Time elapsed: 0.018 sec
Running org.apache.cxf.tools.common.model.JavaParameterTest
Tests run: 1, Failures: 0, Errors: 0, Skipped: 0, Time elapsed: 0.02 sec
Running org.apache.cxf.tools.util.URIParserUtilTest
Tests run: 3, Failures: 0, Errors: 0, Skipped: 0, Time elapsed: 0.028 sec
Running org.apache.cxf.tools.common.model.JavaTypeTest
Tests run: 3, Failures: 0, Errors: 0, Skipped: 0, Time elapsed: 0.01 sec
Running org.apache.cxf.tools.common.toolspec.AbstractToolContainerTest
Tests run: 3, Failures: 0, Errors: 0, Skipped: 0, Time elapsed: 0.1 sec
Running org.apache.cxf.tools.common.dom.SchemaValidatingSAXParserTest
Tests run: 1, Failures: 0, Errors: 0, Skipped: 0, Time elapsed: 0.044 sec
Running org.apache.cxf.tools.common.dom.ExtendedDocumentBuilderTest
Tests run: 2, Failures: 0, Errors: 0, Skipped: 0, Time elapsed: 0.028 sec
Running org.apache.cxf.tools.common.WSDLVersionTest
Tests run: 1, Failures: 0, Errors: 0, Skipped: 0, Time elapsed: 0.014 sec
Running org.apache.cxf.tools.util.BuiltInTypesJavaMappingUtilTest
Tests run: 1, Failures: 0, Errors: 0, Skipped: 0, Time elapsed: 0.007 sec
Running org.apache.cxf.tools.util.NameUtilTest
Tests run: 3, Failures: 0, Errors: 0, Skipped: 0, Time elapsed: 0.023 sec
Running org.apache.cxf.tools.util.FileWriterUtilTest
Tests run: 2, Failures: 0, Errors: 0, Skipped: 0, Time elapsed: 0.039 sec
Running org.apache.cxf.tools.common.toolspec.ToolExceptionTest
Tests run: 1, Failures: 0, Errors: 0, Skipped: 0, Time elapsed: 0.004 sec
Running org.apache.cxf.tools.common.dom.DocumentTest
Tests run: 1, Failures: 0, Errors: 0, Skipped: 0, Time elapsed: 0.006 sec
Running org.apache.cxf.tools.common.toolspec.ToolSpecTest
Tests run: 8, Failures: 0, Errors: 0, Skipped: 0, Time elapsed: 0.062 sec

Results :

Tests run: 55, Failures: 0, Errors: 0, Skipped: 0

[INFO] [jar:jar]
[INFO] Building jar: /x1/continuum/working-directory/216/tools/common/target/cxf-tools-common-2.0-incubator-RC-SNAPSHOT.jar
[INFO] [install:install]
[INFO] Installing /x1/continuum/working-directory/216/tools/common/target/cxf-tools-common-2.0-incubator-RC-SNAPSHOT.jar to /home/continuum/.m2/repository/org/apache/cxf/cxf-tools-common/2.0-incubator-RC-SNAPSHOT/cxf-tools-common-2.0-incubator-RC-SNAPSHOT.jar
[INFO] ----------------------------------------------------------------------------
[INFO] Building Apache CXF Command Line Tools Validator
[INFO]    task-segment: [clean, install]
[INFO] ----------------------------------------------------------------------------
[INFO] [clean:clean]
[INFO] Deleting directory /x1/continuum/working-directory/216/tools/validator/target
[INFO] Deleting directory /x1/continuum/working-directory/216/tools/validator/target/classes
[INFO] Deleting directory /x1/continuum/working-directory/216/tools/validator/target/test-classes
[INFO] [checkstyle:checkstyle {execution: validate}]
[INFO] Starting audit...
Audit done.

[INFO] Preparing pmd:check
[INFO] [pmd:pmd]
[INFO] [pmd:check {execution: validate}]
[INFO] 
[WARNING] 
	Artifact org.codehaus.woodstox:wstx-asl:jar:3.2.1:runtime retains local scope 'runtime' overriding broader scope 'compile'
	given by a dependency. If this is not intended, modify or remove the local scope.

[INFO] [remote-resources:process {execution: default}]
[INFO] [resources:resources]
[INFO] Using default encoding to copy filtered resources.
[INFO] [compiler:compile]
[INFO] Compiling 12 source files to /x1/continuum/working-directory/216/tools/validator/target/classes
[INFO] [resources:testResources]
[INFO] Using default encoding to copy filtered resources.
[INFO] [compiler:testCompile]
[INFO] Compiling 1 source file to /x1/continuum/working-directory/216/tools/validator/target/test-classes
[INFO] [surefire:test]
[INFO] Surefire report directory: /x1/continuum/working-directory/216/tools/validator/target/surefire-reports

-------------------------------------------------------
 T E S T S
-------------------------------------------------------
Running org.apache.cxf.tools.validator.WSDLValidationTest
Tests run: 11, Failures: 0, Errors: 0, Skipped: 0, Time elapsed: 8.529 sec

Results :

Tests run: 11, Failures: 0, Errors: 0, Skipped: 0

[INFO] [jar:jar]
[INFO] Building jar: /x1/continuum/working-directory/216/tools/validator/target/cxf-tools-validator-2.0-incubator-RC-SNAPSHOT.jar
[INFO] [install:install]
[INFO] Installing /x1/continuum/working-directory/216/tools/validator/target/cxf-tools-validator-2.0-incubator-RC-SNAPSHOT.jar to /home/continuum/.m2/repository/org/apache/cxf/cxf-tools-validator/2.0-incubator-RC-SNAPSHOT/cxf-tools-validator-2.0-incubator-RC-SNAPSHOT.jar
[INFO] ----------------------------------------------------------------------------
[INFO] Building Apache CXF Command Line Tools WSDLTo Core
[INFO]    task-segment: [clean, install]
[INFO] ----------------------------------------------------------------------------
[INFO] [clean:clean]
[INFO] Deleting directory /x1/continuum/working-directory/216/tools/wsdlto/core/target
[INFO] Deleting directory /x1/continuum/working-directory/216/tools/wsdlto/core/target/classes
[INFO] Deleting directory /x1/continuum/working-directory/216/tools/wsdlto/core/target/test-classes
[INFO] [checkstyle:checkstyle {execution: validate}]
[INFO] Starting audit...
Audit done.

[INFO] Preparing pmd:check
[INFO] [pmd:pmd]
[INFO] [pmd:check {execution: validate}]
[INFO] 
[INFO] [cxf-common-xsd:xsdtojava {execution: generate-sources}]
[INFO] [remote-resources:process {execution: default}]
[INFO] [resources:resources]
[INFO] Using default encoding to copy filtered resources.
[INFO] [compiler:compile]
[INFO] Compiling 20 source files to /x1/continuum/working-directory/216/tools/wsdlto/core/target/classes
[INFO] [resources:testResources]
[INFO] Using default encoding to copy filtered resources.
[INFO] [compiler:testCompile]
[INFO] Compiling 1 source file to /x1/continuum/working-directory/216/tools/wsdlto/core/target/test-classes
[INFO] [surefire:test]
[INFO] Surefire report directory: /x1/continuum/working-directory/216/tools/wsdlto/core/target/surefire-reports

-------------------------------------------------------
 T E S T S
-------------------------------------------------------
Running org.apache.cxf.tools.wsdlto.WSDLToJavaContainerTest
Tests run: 1, Failures: 0, Errors: 0, Skipped: 0, Time elapsed: 0.151 sec

Results :

Tests run: 1, Failures: 0, Errors: 0, Skipped: 0

[INFO] [jar:jar]
[INFO] Building jar: /x1/continuum/working-directory/216/tools/wsdlto/core/target/cxf-tools-wsdlto-core-2.0-incubator-RC-SNAPSHOT.jar
[INFO] [install:install]
[INFO] Installing /x1/continuum/working-directory/216/tools/wsdlto/core/target/cxf-tools-wsdlto-core-2.0-incubator-RC-SNAPSHOT.jar to /home/continuum/.m2/repository/org/apache/cxf/cxf-tools-wsdlto-core/2.0-incubator-RC-SNAPSHOT/cxf-tools-wsdlto-core-2.0-incubator-RC-SNAPSHOT.jar
[INFO] ----------------------------------------------------------------------------
[INFO] Building Apache CXF Command Line Tools WSDLTo JAXWS Frontend
[INFO]    task-segment: [clean, install]
[INFO] ----------------------------------------------------------------------------
[INFO] [clean:clean]
[INFO] Deleting directory /x1/continuum/working-directory/216/tools/wsdlto/frontend/jaxws/target
[INFO] Deleting directory /x1/continuum/working-directory/216/tools/wsdlto/frontend/jaxws/target/classes
[INFO] Deleting directory /x1/continuum/working-directory/216/tools/wsdlto/frontend/jaxws/target/test-classes
[INFO] [checkstyle:checkstyle {execution: validate}]
[INFO] Starting audit...
Audit done.

[INFO] Preparing pmd:check
[INFO] [pmd:pmd]
[INFO] [pmd:check {execution: validate}]
[INFO] 
[INFO] [remote-resources:process {execution: default}]
[INFO] [resources:resources]
[INFO] Using default encoding to copy filtered resources.
[INFO] [compiler:compile]
[INFO] Compiling 39 source files to /x1/continuum/working-directory/216/tools/wsdlto/frontend/jaxws/target/classes
[INFO] [resources:testResources]
[INFO] Using default encoding to copy filtered resources.
[INFO] [compiler:testCompile]
[INFO] Compiling 9 source files to /x1/continuum/working-directory/216/tools/wsdlto/frontend/jaxws/target/test-classes
[INFO] [surefire:test]
[INFO] Surefire report directory: /x1/continuum/working-directory/216/tools/wsdlto/frontend/jaxws/target/surefire-reports

-------------------------------------------------------
 T E S T S
-------------------------------------------------------
Running org.apache.cxf.tools.wsdlto.frontend.jaxws.processor.internal.PortTypeProcessorTest
Tests run: 1, Failures: 0, Errors: 0, Skipped: 0, Time elapsed: 0.064 sec
Running org.apache.cxf.tools.wsdlto.frontend.jaxws.processor.internal.ProcessorUtilTest
Tests run: 1, Failures: 0, Errors: 0, Skipped: 0, Time elapsed: 0.089 sec
Running org.apache.cxf.tools.wsdlto.frontend.jaxws.processor.internal.mapper.MethodMapperTest
Tests run: 3, Failures: 0, Errors: 0, Skipped: 0, Time elapsed: 0.111 sec
Running org.apache.cxf.tools.wsdlto.frontend.jaxws.processor.internal.annotator.WebParamAnnotatorTest
Tests run: 3, Failures: 0, Errors: 0, Skipped: 0, Time elapsed: 0.025 sec
Running org.apache.cxf.tools.wsdlto.frontend.jaxws.processor.internal.annotator.WebMethodAnnotatorTest
Tests run: 2, Failures: 0, Errors: 0, Skipped: 0, Time elapsed: 0.017 sec
Running org.apache.cxf.tools.wsdlto.frontend.jaxws.processor.internal.mapper.InterfaceMapperTest
Tests run: 2, Failures: 0, Errors: 0, Skipped: 0, Time elapsed: 0.032 sec
Running org.apache.cxf.tools.wsdlto.frontend.jaxws.JAXWSProfileTest
Tests run: 1, Failures: 0, Errors: 0, Skipped: 0, Time elapsed: 2.683 sec
Running org.apache.cxf.tools.wsdlto.frontend.jaxws.wsdl11.JAXWSDefinitionBuilderTest
Tests run: 4, Failures: 0, Errors: 0, Skipped: 0, Time elapsed: 3.664 sec

Results :

Tests run: 17, Failures: 0, Errors: 0, Skipped: 0

[INFO] [jar:jar]
[INFO] Building jar: /x1/continuum/working-directory/216/tools/wsdlto/frontend/jaxws/target/cxf-tools-wsdlto-frontend-jaxws-2.0-incubator-RC-SNAPSHOT.jar
[INFO] [install:install]
[INFO] Installing /x1/continuum/working-directory/216/tools/wsdlto/frontend/jaxws/target/cxf-tools-wsdlto-frontend-jaxws-2.0-incubator-RC-SNAPSHOT.jar to /home/continuum/.m2/repository/org/apache/cxf/cxf-tools-wsdlto-frontend-jaxws/2.0-incubator-RC-SNAPSHOT/cxf-tools-wsdlto-frontend-jaxws-2.0-incubator-RC-SNAPSHOT.jar
[INFO] ----------------------------------------------------------------------------
[INFO] Building Apache CXF Command Line Tools WSDLTo JAXB Databinding
[INFO]    task-segment: [clean, install]
[INFO] ----------------------------------------------------------------------------
[INFO] [clean:clean]
[INFO] Deleting directory /x1/continuum/working-directory/216/tools/wsdlto/databinding/jaxb/target
[INFO] Deleting directory /x1/continuum/working-directory/216/tools/wsdlto/databinding/jaxb/target/classes
[INFO] Deleting directory /x1/continuum/working-directory/216/tools/wsdlto/databinding/jaxb/target/test-classes
[INFO] [checkstyle:checkstyle {execution: validate}]
[INFO] Starting audit...
Audit done.

[INFO] Preparing pmd:check
[INFO] [pmd:pmd]
[INFO] [pmd:check {execution: validate}]
[INFO] 
[INFO] [remote-resources:process {execution: default}]
[INFO] [resources:resources]
[INFO] Using default encoding to copy filtered resources.
[INFO] [compiler:compile]
[INFO] Compiling 5 source files to /x1/continuum/working-directory/216/tools/wsdlto/databinding/jaxb/target/classes
[INFO] [resources:testResources]
[INFO] Using default encoding to copy filtered resources.
[INFO] [compiler:testCompile]
[INFO] Nothing to compile - all classes are up to date
[INFO] [surefire:test]
[INFO] Surefire report directory: /x1/continuum/working-directory/216/tools/wsdlto/databinding/jaxb/target/surefire-reports

-------------------------------------------------------
 T E S T S
-------------------------------------------------------
There are no tests to run.

Results :

Tests run: 0, Failures: 0, Errors: 0, Skipped: 0

[INFO] [jar:jar]
[INFO] Building jar: /x1/continuum/working-directory/216/tools/wsdlto/databinding/jaxb/target/cxf-tools-wsdlto-databinding-jaxb-2.0-incubator-RC-SNAPSHOT.jar
[INFO] [install:install]
[INFO] Installing /x1/continuum/working-directory/216/tools/wsdlto/databinding/jaxb/target/cxf-tools-wsdlto-databinding-jaxb-2.0-incubator-RC-SNAPSHOT.jar to /home/continuum/.m2/repository/org/apache/cxf/cxf-tools-wsdlto-databinding-jaxb/2.0-incubator-RC-SNAPSHOT/cxf-tools-wsdlto-databinding-jaxb-2.0-incubator-RC-SNAPSHOT.jar
[INFO] ----------------------------------------------------------------------------
[INFO] Building Apache CXF Command Line Tools WSDLTo Test
[INFO]    task-segment: [clean, install]
[INFO] ----------------------------------------------------------------------------
[INFO] [clean:clean]
[INFO] Deleting directory /x1/continuum/working-directory/216/tools/wsdlto/test/target
[INFO] Deleting directory /x1/continuum/working-directory/216/tools/wsdlto/test/target/classes
[INFO] Deleting directory /x1/continuum/working-directory/216/tools/wsdlto/test/target/test-classes
[INFO] [checkstyle:checkstyle {execution: validate}]
[INFO] Starting audit...
Audit done.

[INFO] Preparing pmd:check
[INFO] [pmd:pmd]
[INFO] [pmd:check {execution: validate}]
[INFO] 
[INFO] [remote-resources:process {execution: default}]
[INFO] [resources:resources]
[INFO] Using default encoding to copy filtered resources.
[INFO] [compiler:compile]
[INFO] No sources to compile
[INFO] [resources:testResources]
[INFO] Using default encoding to copy filtered resources.
[INFO] [compiler:testCompile]
[INFO] Compiling 6 source files to /x1/continuum/working-directory/216/tools/wsdlto/test/target/test-classes
[INFO] [surefire:test]
[INFO] Surefire report directory: /x1/continuum/working-directory/216/tools/wsdlto/test/target/surefire-reports

-------------------------------------------------------
 T E S T S
-------------------------------------------------------
Running org.apache.cxf.tools.wsdlto.WSDLToJavaTest
Tests run: 3, Failures: 0, Errors: 0, Skipped: 0, Time elapsed: 1.438 sec
Running org.apache.cxf.tools.wsdlto.jaxws.CodeGenOptionTest
Tests run: 3, Failures: 0, Errors: 0, Skipped: 0, Time elapsed: 16.985 sec
Running org.apache.cxf.tools.wsdlto.validator.ValidatorTest
Tests run: 1, Failures: 0, Errors: 0, Skipped: 0, Time elapsed: 0.225 sec
Running org.apache.cxf.tools.wsdlto.core.PluginLoaderTest
Tests run: 1, Failures: 0, Errors: 0, Skipped: 0, Time elapsed: 0.006 sec
Running org.apache.cxf.tools.wsdlto.jaxws.CodeGenBugTest
2007-04-13 08:06:22.906::INFO:  Logging to STDERR via org.mortbay.log.StdErrLog
2007-04-13 08:06:23.066::INFO:  jetty-6.1.2rc0
2007-04-13 08:06:23.120::INFO:  Started SocketConnector @ 0.0.0.0:8585
Tests run: 21, Failures: 0, Errors: 0, Skipped: 0, Time elapsed: 55.239 sec
Running org.apache.cxf.tools.wsdlto.jaxws.CodeGenTest
Tests run: 27, Failures: 0, Errors: 0, Skipped: 1, Time elapsed: 71.11 sec

Results :

Tests run: 56, Failures: 0, Errors: 0, Skipped: 1

[INFO] [jar:jar]
[INFO] Building jar: /x1/continuum/working-directory/216/tools/wsdlto/test/target/cxf-tools-wsdlto-test-2.0-incubator-RC-SNAPSHOT.jar
[INFO] [install:install]
[INFO] Installing /x1/continuum/working-directory/216/tools/wsdlto/test/target/cxf-tools-wsdlto-test-2.0-incubator-RC-SNAPSHOT.jar to /home/continuum/.m2/repository/org/apache/cxf/cxf-tools-wsdlto-test/2.0-incubator-RC-SNAPSHOT/cxf-tools-wsdlto-test-2.0-incubator-RC-SNAPSHOT.jar
[INFO] ----------------------------------------------------------------------------
[INFO] Building Apache CXF Command Line Tools WSDLTo Misctools
[INFO]    task-segment: [clean, install]
[INFO] ----------------------------------------------------------------------------
[INFO] [clean:clean]
[INFO] Deleting directory /x1/continuum/working-directory/216/tools/wsdlto/misc/target
[INFO] Deleting directory /x1/continuum/working-directory/216/tools/wsdlto/misc/target/classes
[INFO] Deleting directory /x1/continuum/working-directory/216/tools/wsdlto/misc/target/test-classes
[INFO] [checkstyle:checkstyle {execution: validate}]
[INFO] Starting audit...
Audit done.

[INFO] Preparing pmd:check
[INFO] [pmd:pmd]
[INFO] [pmd:check {execution: validate}]
[INFO] 
[INFO] [remote-resources:process {execution: default}]
[INFO] [resources:resources]
[INFO] Using default encoding to copy filtered resources.
[INFO] [compiler:compile]
[INFO] Compiling 9 source files to /x1/continuum/working-directory/216/tools/wsdlto/misc/target/classes
[INFO] [resources:testResources]
[INFO] Using default encoding to copy filtered resources.
[INFO] [compiler:testCompile]
[INFO] Compiling 4 source files to /x1/continuum/working-directory/216/tools/wsdlto/misc/target/test-classes
[INFO] [surefire:test]
[INFO] Surefire report directory: /x1/continuum/working-directory/216/tools/wsdlto/misc/target/surefire-reports

-------------------------------------------------------
 T E S T S
-------------------------------------------------------
Running org.apache.cxf.tools.misc.processor.WSDLToServiceProcessorTest
Tests run: 6, Failures: 0, Errors: 0, Skipped: 0, Time elapsed: 10.072 sec
Running org.apache.cxf.tools.misc.processor.WSDLToXMLProcessorTest
Tests run: 1, Failures: 0, Errors: 0, Skipped: 0, Time elapsed: 1.369 sec
Running org.apache.cxf.tools.misc.processor.XSDToWSDLProcessorTest
Tests run: 2, Failures: 0, Errors: 0, Skipped: 0, Time elapsed: 0.119 sec
Running org.apache.cxf.tools.misc.processor.WSDLToSoapProcessorTest
Tests run: 9, Failures: 0, Errors: 0, Skipped: 0, Time elapsed: 6.995 sec

Results :

Tests run: 18, Failures: 0, Errors: 0, Skipped: 0

[INFO] [jar:jar]
[INFO] Building jar: /x1/continuum/working-directory/216/tools/wsdlto/misc/target/cxf-tools-misctools-2.0-incubator-RC-SNAPSHOT.jar
[INFO] [install:install]
[INFO] Installing /x1/continuum/working-directory/216/tools/wsdlto/misc/target/cxf-tools-misctools-2.0-incubator-RC-SNAPSHOT.jar to /home/continuum/.m2/repository/org/apache/cxf/cxf-tools-misctools/2.0-incubator-RC-SNAPSHOT/cxf-tools-misctools-2.0-incubator-RC-SNAPSHOT.jar
[INFO] ----------------------------------------------------------------------------
[INFO] Building Apache CXF Command Line Tools
[INFO]    task-segment: [clean, install]
[INFO] ----------------------------------------------------------------------------
[INFO] [clean:clean]
[INFO] Deleting directory /x1/continuum/working-directory/216/tools/target
[INFO] Deleting directory /x1/continuum/working-directory/216/tools/target/classes
[INFO] Deleting directory /x1/continuum/working-directory/216/tools/target/test-classes
[INFO] [site:attach-descriptor]
[INFO] [install:install]
[INFO] Installing /x1/continuum/working-directory/216/tools/pom.xml to /home/continuum/.m2/repository/org/apache/cxf/cxf-tools/2.0-incubator-RC-SNAPSHOT/cxf-tools-2.0-incubator-RC-SNAPSHOT.pom
[INFO] ----------------------------------------------------------------------------
[INFO] Building Apache CXF Command Line Tools WSDLTo
[INFO]    task-segment: [clean, install]
[INFO] ----------------------------------------------------------------------------
[INFO] [clean:clean]
[INFO] Deleting directory /x1/continuum/working-directory/216/tools/wsdlto/target
[INFO] Deleting directory /x1/continuum/working-directory/216/tools/wsdlto/target/classes
[INFO] Deleting directory /x1/continuum/working-directory/216/tools/wsdlto/target/test-classes
[INFO] [site:attach-descriptor]
[INFO] [install:install]
[INFO] Installing /x1/continuum/working-directory/216/tools/wsdlto/pom.xml to /home/continuum/.m2/repository/org/apache/cxf/cxf-tools-wsdlto/2.0-incubator-RC-SNAPSHOT/cxf-tools-wsdlto-2.0-incubator-RC-SNAPSHOT.pom
[INFO] ----------------------------------------------------------------------------
[INFO] Building Apache CXF Code Generation Maven2 Plugins
[INFO]    task-segment: [clean, install]
[INFO] ----------------------------------------------------------------------------
[INFO] [clean:clean]
[INFO] Deleting directory /x1/continuum/working-directory/216/codegen-plugin/target
[INFO] Deleting directory /x1/continuum/working-directory/216/codegen-plugin/target/classes
[INFO] Deleting directory /x1/continuum/working-directory/216/codegen-plugin/target/test-classes
[INFO] [checkstyle:checkstyle {execution: validate}]
[INFO] Starting audit...
Audit done.

[INFO] Preparing pmd:check
[INFO] [pmd:pmd]
[INFO] [pmd:check {execution: validate}]
[INFO] 
[INFO] [plugin:descriptor]
[INFO] Using 2 extractors.
[INFO] Applying extractor for language: java
[INFO] Extractor for language: java found 2 mojo descriptors.
[INFO] Applying extractor for language: bsh
[INFO] Extractor for language: bsh found 0 mojo descriptors.
[INFO] [remote-resources:process {execution: default}]
[INFO] [resources:resources]
[INFO] Using default encoding to copy filtered resources.
[INFO] [compiler:compile]
[INFO] Compiling 4 source files to /x1/continuum/working-directory/216/codegen-plugin/target/classes
[INFO] [resources:testResources]
[INFO] Using default encoding to copy filtered resources.
[INFO] [compiler:testCompile]
[INFO] Nothing to compile - all classes are up to date
[INFO] [surefire:test]
[INFO] Surefire report directory: /x1/continuum/working-directory/216/codegen-plugin/target/surefire-reports

-------------------------------------------------------
 T E S T S
-------------------------------------------------------
There are no tests to run.

Results :

Tests run: 0, Failures: 0, Errors: 0, Skipped: 0

[INFO] [jar:jar]
[INFO] Building jar: /x1/continuum/working-directory/216/codegen-plugin/target/cxf-codegen-plugin-2.0-incubator-RC-SNAPSHOT.jar
[INFO] [plugin:addPluginArtifactMetadata]
[INFO] [install:install]
[INFO] Installing /x1/continuum/working-directory/216/codegen-plugin/target/cxf-codegen-plugin-2.0-incubator-RC-SNAPSHOT.jar to /home/continuum/.m2/repository/org/apache/cxf/cxf-codegen-plugin/2.0-incubator-RC-SNAPSHOT/cxf-codegen-plugin-2.0-incubator-RC-SNAPSHOT.jar
[INFO] [plugin:updateRegistry]
[INFO] ----------------------------------------------------------------------------
[INFO] Building Apache CXF Test Utilities
[INFO]    task-segment: [clean, install]
[INFO] ----------------------------------------------------------------------------
[INFO] [clean:clean]
[INFO] Deleting directory /x1/continuum/working-directory/216/testutils/target
[INFO] Deleting directory /x1/continuum/working-directory/216/testutils/target/classes
[INFO] Deleting directory /x1/continuum/working-directory/216/testutils/target/test-classes
[INFO] [checkstyle:checkstyle {execution: validate}]
[INFO] Starting audit...
Audit done.

[INFO] Preparing pmd:check
[INFO] [pmd:pmd]
[INFO] [pmd:check {execution: validate}]
[INFO] 
[INFO] [antrun:run {execution: validate}]
[INFO] Executing tasks
    [mkdir] Created dir: /x1/continuum/working-directory/216/testutils/target/generated/src/main/resources/wsdl/type_test
     [xslt] Processing /x1/continuum/working-directory/216/testutils/src/main/resources/wsdl/type_test/type_test.xsd to /x1/continuum/working-directory/216/testutils/target/generated/src/main/resources/wsdl/type_test/type_test_1.xsd
     [xslt] Loading stylesheet /x1/continuum/working-directory/216/testutils/src/main/resources/wsdl/type_test/type_test_ID_xsd.xsl
     [xslt] Processing /x1/continuum/working-directory/216/testutils/src/main/resources/wsdl/type_test/type_test.xsd to /x1/continuum/working-directory/216/testutils/target/generated/src/main/resources/wsdl/type_test/type_test_2.xsd
     [xslt] Loading stylesheet /x1/continuum/working-directory/216/testutils/src/main/resources/wsdl/type_test/type_test_ID_xsd.xsl
     [xslt] Processing /x1/continuum/working-directory/216/testutils/src/main/resources/wsdl/type_test/type_test.xsd to /x1/continuum/working-directory/216/testutils/target/generated/src/main/resources/wsdl/type_test/type_test_3.xsd
     [xslt] Loading stylesheet /x1/continuum/working-directory/216/testutils/src/main/resources/wsdl/type_test/type_test_ID_xsd.xsl
     [xslt] Processing /x1/continuum/working-directory/216/testutils/src/main/resources/wsdl/type_test/type_test.xsd to /x1/continuum/working-directory/216/testutils/target/generated/src/main/resources/wsdl/type_test/type_test_doclit.wsdl
     [xslt] Loading stylesheet /x1/continuum/working-directory/216/testutils/src/main/resources/wsdl/type_test/type_test_wsdl.xsl
     [xslt] Processing /x1/continuum/working-directory/216/testutils/src/main/resources/wsdl/type_test/type_test.xsd to /x1/continuum/working-directory/216/testutils/target/generated/src/main/resources/wsdl/type_test/type_test_rpclit.wsdl
     [xslt] Loading stylesheet /x1/continuum/working-directory/216/testutils/src/main/resources/wsdl/type_test/type_test_wsdl.xsl
     [xslt] Processing /x1/continuum/working-directory/216/testutils/src/main/resources/wsdl/type_test/type_test.xsd to /x1/continuum/working-directory/216/testutils/target/generated/src/main/resources/wsdl/type_test/type_test_xml_inc.wsdl
     [xslt] Loading stylesheet /x1/continuum/working-directory/216/testutils/src/main/resources/wsdl/type_test/type_test_wsdl.xsl
     [xslt] Processing /x1/continuum/working-directory/216/testutils/src/main/resources/wsdl/type_test/type_test.xsd to /x1/continuum/working-directory/216/testutils/target/generated/src/main/resources/wsdl/type_test/type_test_xml.wsdl
     [xslt] Loading stylesheet /x1/continuum/working-directory/216/testutils/src/main/resources/wsdl/type_test/type_test_xml_wsdl.xsl
     [xslt] Processing /x1/continuum/working-directory/216/testutils/src/main/resources/wsdl/type_test/type_test.xsd to /x1/continuum/working-directory/216/testutils/target/generated/src/main/resources/wsdl/type_test/type_test_doclit_soap.wsdl
     [xslt] Loading stylesheet /x1/continuum/working-directory/216/testutils/src/main/resources/wsdl/type_test/type_test_soap_wsdl.xsl
     [xslt] Processing /x1/continuum/working-directory/216/testutils/src/main/resources/wsdl/type_test/type_test.xsd to /x1/continuum/working-directory/216/testutils/target/generated/src/main/resources/wsdl/type_test/type_test_rpclit_soap.wsdl
     [xslt] Loading stylesheet /x1/continuum/working-directory/216/testutils/src/main/resources/wsdl/type_test/type_test_soap_wsdl.xsl
    [mkdir] Created dir: /x1/continuum/working-directory/216/testutils/target/generated/src/main/java/org/apache/cxf/systest/type_test
     [xslt] Processing /x1/continuum/working-directory/216/testutils/src/main/resources/wsdl/type_test/type_test.xsd to /x1/continuum/working-directory/216/testutils/target/generated/src/main/java/org/apache/cxf/systest/type_test/TypeTestImpl.java
     [xslt] Loading stylesheet /x1/continuum/working-directory/216/testutils/src/main/resources/wsdl/type_test/type_test_impl_java.xsl
     [xslt] Processing /x1/continuum/working-directory/216/testutils/src/main/resources/wsdl/type_test/type_test.xsd to /x1/continuum/working-directory/216/testutils/target/generated/src/main/java/org/apache/cxf/systest/type_test/TypeTestTester.java
     [xslt] Loading stylesheet /x1/continuum/working-directory/216/testutils/src/main/resources/wsdl/type_test/type_test_tester_java.xsl
[INFO] Executed tasks
[INFO] Registering compile source root /x1/continuum/working-directory/216/testutils/target/generated/src/main/java
[INFO] [cxf-codegen:wsdl2java {execution: generate-sources}]
Apr 13, 2007 8:09:40 AM org.apache.cxf.tools.wsdlto.core.PluginLoader loadPlugin
INFO: Loading plugin jar:file:/x1/continuum/working-directory/216/tools/wsdlto/databinding/jaxb/target/cxf-tools-wsdlto-databinding-jaxb-2.0-incubator-RC-SNAPSHOT.jar!/META-INF/tools-plugin.xml
Apr 13, 2007 8:09:40 AM org.apache.cxf.tools.wsdlto.core.PluginLoader loadPlugin
INFO: Found 1 databindings in <jaxb> plugin.
Apr 13, 2007 8:09:40 AM org.apache.cxf.tools.wsdlto.core.PluginLoader loadPlugin
INFO: Loading <jaxb> databinding from <jaxb> plugin.
Apr 13, 2007 8:09:40 AM org.apache.cxf.tools.wsdlto.core.PluginLoader loadPlugin
INFO: Loading plugin jar:file:/x1/continuum/working-directory/216/tools/wsdlto/frontend/jaxws/target/cxf-tools-wsdlto-frontend-jaxws-2.0-incubator-RC-SNAPSHOT.jar!/META-INF/tools-plugin.xml
Apr 13, 2007 8:09:40 AM org.apache.cxf.tools.wsdlto.core.PluginLoader loadPlugin
INFO: Found 1 frontends in <jaxws> plugin.
Apr 13, 2007 8:09:40 AM org.apache.cxf.tools.wsdlto.core.PluginLoader loadPlugin
INFO: Loading <jaxws> frontend from <jaxws> plugin.
Apr 13, 2007 8:09:42 AM org.springframework.context.support.AbstractApplicationContext refresh
INFO: Refreshing org.apache.cxf.bus.spring.BusApplicationContext@19f52fa: display name [org.apache.cxf.bus.spring.BusApplicationContext@19f52fa]; startup date [Fri Apr 13 08:09:42 PDT 2007]; root of context hierarchy
Apr 13, 2007 8:09:42 AM org.apache.cxf.bus.spring.BusApplicationContext getConfigResources
INFO: Could not find the configuration file cxf.xml on the classpath.
Apr 13, 2007 8:09:42 AM org.springframework.beans.factory.xml.XmlBeanDefinitionReader loadBeanDefinitions
INFO: Loading XML bean definitions from class path resource [META-INF/cxf/cxf.xml]
Apr 13, 2007 8:09:42 AM org.springframework.beans.factory.xml.XmlBeanDefinitionReader loadBeanDefinitions
INFO: Loading XML bean definitions from URL [jar:file:/x1/continuum/working-directory/216/api/target/cxf-api-2.0-incubator-RC-SNAPSHOT.jar!/META-INF/cxf/cxf-property-editors.xml]
Apr 13, 2007 8:09:42 AM org.springframework.context.support.AbstractApplicationContext refresh
INFO: Bean factory for application context [org.apache.cxf.bus.spring.BusApplicationContext@19f52fa]: org.springframework.beans.factory.support.DefaultListableBeanFactory@44c0d2
Apr 13, 2007 8:09:42 AM org.springframework.context.support.AbstractApplicationContext$BeanPostProcessorChecker postProcessAfterInitialization
INFO: Bean 'org.apache.cxf.bus.spring.Jsr250BeanPostProcessor' is not eligible for getting processed by all BeanPostProcessors (for example: not eligible for auto-proxying)
Apr 13, 2007 8:09:42 AM org.springframework.context.support.AbstractApplicationContext$BeanPostProcessorChecker postProcessAfterInitialization
INFO: Bean 'cxf' is not eligible for getting processed by all BeanPostProcessors (for example: not eligible for auto-proxying)
Apr 13, 2007 8:09:42 AM org.springframework.context.support.AbstractApplicationContext$BeanPostProcessorChecker postProcessAfterInitialization
INFO: Bean 'org.apache.cxf.bus.spring.BusExtensionPostProcessor' is not eligible for getting processed by all BeanPostProcessors (for example: not eligible for auto-proxying)
Apr 13, 2007 8:09:42 AM org.springframework.beans.factory.support.DefaultListableBeanFactory preInstantiateSingletons
INFO: Pre-instantiating singletons in org.springframework.beans.factory.support.DefaultListableBeanFactory@44c0d2: defining beans [cxf,org.apache.cxf.bus.spring.Jsr250BeanPostProcessor,org.apache.cxf.bus.spring.BusExtensionPostProcessor,org.apache.cxf.resource.ResourceManager,org.apache.cxf.binding.BindingFactoryManager,org.apache.cxf.transport.DestinationFactoryManager,org.apache.cxf.transport.ConduitInitiatorManager,org.apache.cxf.wsdl.WSDLManager,org.apache.cxf.phase.PhaseManager,org.apache.cxf.workqueue.WorkQueueManager,org.apache.cxf.buslifecycle.BusLifeCycleManager,org.apache.cxf.endpoint.ServerRegistry,org.apache.cxf.endpoint.ServerLifeCycleManager,org.apache.cxf.transports.http.QueryHandlerRegistry,org.apache.cxf.endpoint.EndpointResolverRegistry,org.apache.cxf.configuration.security.customEditorConfigurer]; root of factory hierarchy
[INFO] [remote-resources:process {execution: default}]
[INFO] [resources:resources]
[INFO] Using default encoding to copy filtered resources.
[INFO] [compiler:compile]
[INFO] Compiling 1243 source files to /x1/continuum/working-directory/216/testutils/target/classes
[INFO] [resources:testResources]
[INFO] Using default encoding to copy filtered resources.
[INFO] [compiler:testCompile]
[INFO] Compiling 1 source file to /x1/continuum/working-directory/216/testutils/target/test-classes
[INFO] [surefire:test]
[INFO] Surefire report directory: /x1/continuum/working-directory/216/testutils/target/surefire-reports

-------------------------------------------------------
 T E S T S
-------------------------------------------------------
Running org.apache.header_test.rpc.TestRPCHeaderTest
Tests run: 2, Failures: 0, Errors: 0, Skipped: 0, Time elapsed: 0.155 sec

Results :

Tests run: 2, Failures: 0, Errors: 0, Skipped: 0

[INFO] [jar:jar]
[INFO] Building jar: /x1/continuum/working-directory/216/testutils/target/cxf-testutils-2.0-incubator-RC-SNAPSHOT.jar
[INFO] [install:install]
[INFO] Installing /x1/continuum/working-directory/216/testutils/target/cxf-testutils-2.0-incubator-RC-SNAPSHOT.jar to /home/continuum/.m2/repository/org/apache/cxf/cxf-testutils/2.0-incubator-RC-SNAPSHOT/cxf-testutils-2.0-incubator-RC-SNAPSHOT.jar
[INFO] ----------------------------------------------------------------------------
[INFO] Building Apache CXF Runtime JAXB DataBinding
[INFO]    task-segment: [clean, install]
[INFO] ----------------------------------------------------------------------------
[INFO] [clean:clean]
[INFO] Deleting directory /x1/continuum/working-directory/216/rt/databinding/jaxb/target
[INFO] Deleting directory /x1/continuum/working-directory/216/rt/databinding/jaxb/target/classes
[INFO] Deleting directory /x1/continuum/working-directory/216/rt/databinding/jaxb/target/test-classes
[INFO] [checkstyle:checkstyle {execution: validate}]
[INFO] Starting audit...
Audit done.

[INFO] Preparing pmd:check
[INFO] [pmd:pmd]
[INFO] [pmd:check {execution: validate}]
[INFO] 
[INFO] [remote-resources:process {execution: default}]
[INFO] [resources:resources]
[INFO] Using default encoding to copy filtered resources.
[INFO] [compiler:compile]
[INFO] Compiling 15 source files to /x1/continuum/working-directory/216/rt/databinding/jaxb/target/classes
[INFO] [cxf-common-xsd:xsdtojava {execution: generate-sources}]
[INFO] [dependency:unpack {execution: unpack-schemas}]
[INFO] Configured Artifact: org.apache.cxf:cxf-common-schemas:2.0-incubator-RC-SNAPSHOT:jar
[INFO] Expanding: /home/continuum/.m2/repository/org/apache/cxf/cxf-common-schemas/2.0-incubator-RC-SNAPSHOT/cxf-common-schemas-2.0-incubator-RC-SNAPSHOT.jar into /x1/continuum/working-directory/216/rt/databinding/jaxb/target/generated/src/test/resources
[INFO] [resources:testResources]
[INFO] Using default encoding to copy filtered resources.
[INFO] [compiler:testCompile]
[INFO] Compiling 13 source files to /x1/continuum/working-directory/216/rt/databinding/jaxb/target/test-classes
[INFO] [surefire:test]
[INFO] Surefire report directory: /x1/continuum/working-directory/216/rt/databinding/jaxb/target/surefire-reports

-------------------------------------------------------
 T E S T S
-------------------------------------------------------
Running org.apache.cxf.jaxb.BareInInterceptorTest
Tests run: 4, Failures: 0, Errors: 0, Skipped: 0, Time elapsed: 7.832 sec
Running org.apache.cxf.jaxb.DocLiteralInInterceptorTest
Tests run: 3, Failures: 0, Errors: 0, Skipped: 0, Time elapsed: 2.432 sec
Running org.apache.cxf.jaxb.WrappedInInterceptorTest
Tests run: 2, Failures: 0, Errors: 0, Skipped: 0, Time elapsed: 1.568 sec
Running org.apache.cxf.jaxb.io.XMLStreamDataReaderTest
Tests run: 4, Failures: 0, Errors: 0, Skipped: 0, Time elapsed: 0.093 sec
Running org.apache.cxf.jaxb.io.XMLStreamDataWriterTest
Tests run: 5, Failures: 0, Errors: 0, Skipped: 0, Time elapsed: 0.157 sec
Running org.apache.cxf.jaxb.JAXBEncoderDecoderTest
Tests run: 9, Failures: 0, Errors: 0, Skipped: 0, Time elapsed: 0.801 sec
Running org.apache.cxf.jaxb.BareOutInterceptorTest
Tests run: 2, Failures: 0, Errors: 0, Skipped: 0, Time elapsed: 1.133 sec
Running org.apache.cxf.jaxb.JAXBDataBindingTest
Tests run: 5, Failures: 0, Errors: 0, Skipped: 0, Time elapsed: 0.794 sec

Results :

Tests run: 34, Failures: 0, Errors: 0, Skipped: 0

[INFO] [jar:jar]
[INFO] Building jar: /x1/continuum/working-directory/216/rt/databinding/jaxb/target/cxf-rt-databinding-jaxb-2.0-incubator-RC-SNAPSHOT.jar
[INFO] [install:install]
[INFO] Installing /x1/continuum/working-directory/216/rt/databinding/jaxb/target/cxf-rt-databinding-jaxb-2.0-incubator-RC-SNAPSHOT.jar to /home/continuum/.m2/repository/org/apache/cxf/cxf-rt-databinding-jaxb/2.0-incubator-RC-SNAPSHOT/cxf-rt-databinding-jaxb-2.0-incubator-RC-SNAPSHOT.jar
[INFO] ----------------------------------------------------------------------------
[INFO] Building Apache CXF Runtime SOAP Binding
[INFO]    task-segment: [clean, install]
[INFO] ----------------------------------------------------------------------------
[INFO] [clean:clean]
[INFO] Deleting directory /x1/continuum/working-directory/216/rt/bindings/soap/target
[INFO] Deleting directory /x1/continuum/working-directory/216/rt/bindings/soap/target/classes
[INFO] Deleting directory /x1/continuum/working-directory/216/rt/bindings/soap/target/test-classes
[INFO] [checkstyle:checkstyle {execution: validate}]
[INFO] Starting audit...
Audit done.

[INFO] Preparing pmd:check
[INFO] [pmd:pmd]
[INFO] [pmd:check {execution: validate}]
[INFO] 
[WARNING] 
	Artifact org.apache.geronimo.specs:geronimo-javamail_1.4_spec:jar:1.0-M1:test retains local scope 'test' overriding broader scope 'compile'
	given by a dependency. If this is not intended, modify or remove the local scope.

[WARNING] 
	Artifact org.apache.geronimo.specs:geronimo-activation_1.1_spec:jar:1.0-M1:test retains local scope 'test' overriding broader scope 'compile'
	given by a dependency. If this is not intended, modify or remove the local scope.

[INFO] [remote-resources:process {execution: default}]
[INFO] [resources:resources]
[INFO] Using default encoding to copy filtered resources.
[INFO] [compiler:compile]
[INFO] Compiling 35 source files to /x1/continuum/working-directory/216/rt/bindings/soap/target/classes
[INFO] [resources:testResources]
[INFO] Using default encoding to copy filtered resources.
[INFO] [compiler:testCompile]
[INFO] Compiling 14 source files to /x1/continuum/working-directory/216/rt/bindings/soap/target/test-classes
[INFO] [surefire:test]
[INFO] Surefire report directory: /x1/continuum/working-directory/216/rt/bindings/soap/target/surefire-reports

-------------------------------------------------------
 T E S T S
-------------------------------------------------------
Running org.apache.cxf.binding.soap.SoapDestinationFactoryTest
Tests run: 1, Failures: 0, Errors: 0, Skipped: 0, Time elapsed: 0.151 sec
Running org.apache.cxf.binding.soap.RPCOutInterceptorTest
Tests run: 2, Failures: 0, Errors: 0, Skipped: 0, Time elapsed: 2.364 sec
Running org.apache.cxf.binding.soap.saaj.SAAJInInterceptorTest
Tests run: 1, Failures: 0, Errors: 0, Skipped: 0, Time elapsed: 0.31 sec
Running org.apache.cxf.binding.soap.SoapBindingTest
Tests run: 1, Failures: 0, Errors: 0, Skipped: 0, Time elapsed: 0.019 sec
Running org.apache.cxf.binding.soap.MustUnderstandInterceptorTest
Tests run: 3, Failures: 0, Errors: 0, Skipped: 0, Time elapsed: 0.338 sec
Running org.apache.cxf.binding.soap.interceptor.SoapFaultSerializerTest
Tests run: 2, Failures: 0, Errors: 0, Skipped: 0, Time elapsed: 3.379 sec
Running org.apache.cxf.binding.soap.SoapActionInterceptorTest
Tests run: 1, Failures: 0, Errors: 0, Skipped: 0, Time elapsed: 0.013 sec
Running org.apache.cxf.binding.soap.ServiceModelUtilTest
Tests run: 1, Failures: 0, Errors: 0, Skipped: 0, Time elapsed: 0.065 sec
Running org.apache.cxf.binding.soap.SoapBindingFactoryTest
Tests run: 2, Failures: 0, Errors: 0, Skipped: 0, Time elapsed: 0.192 sec
Running org.apache.cxf.binding.soap.RPCInInterceptorTest
Tests run: 2, Failures: 0, Errors: 0, Skipped: 0, Time elapsed: 0.224 sec
Running org.apache.cxf.binding.soap.ReadHeaderInterceptorTest
Tests run: 1, Failures: 0, Errors: 0, Skipped: 0, Time elapsed: 0.007 sec
Running org.apache.cxf.binding.soap.SoapOutInterceptorTest
Tests run: 1, Failures: 0, Errors: 0, Skipped: 0, Time elapsed: 0.026 sec

Results :

Tests run: 18, Failures: 0, Errors: 0, Skipped: 0

[INFO] [jar:jar]
[INFO] Building jar: /x1/continuum/working-directory/216/rt/bindings/soap/target/cxf-rt-bindings-soap-2.0-incubator-RC-SNAPSHOT.jar
[INFO] [install:install]
[INFO] Installing /x1/continuum/working-directory/216/rt/bindings/soap/target/cxf-rt-bindings-soap-2.0-incubator-RC-SNAPSHOT.jar to /home/continuum/.m2/repository/org/apache/cxf/cxf-rt-bindings-soap/2.0-incubator-RC-SNAPSHOT/cxf-rt-bindings-soap-2.0-incubator-RC-SNAPSHOT.jar
[INFO] ----------------------------------------------------------------------------
[INFO] Building Apache CXF Runtime XML Binding
[INFO]    task-segment: [clean, install]
[INFO] ----------------------------------------------------------------------------
[INFO] [clean:clean]
[INFO] Deleting directory /x1/continuum/working-directory/216/rt/bindings/xml/target
[INFO] Deleting directory /x1/continuum/working-directory/216/rt/bindings/xml/target/classes
[INFO] Deleting directory /x1/continuum/working-directory/216/rt/bindings/xml/target/test-classes
[INFO] [checkstyle:checkstyle {execution: validate}]
[INFO] Starting audit...
Audit done.

[INFO] Preparing pmd:check
[INFO] [pmd:pmd]
[INFO] [pmd:check {execution: validate}]
[INFO] 
[INFO] [remote-resources:process {execution: default}]
[INFO] [resources:resources]
[INFO] Using default encoding to copy filtered resources.
[INFO] [compiler:compile]
[INFO] Compiling 9 source files to /x1/continuum/working-directory/216/rt/bindings/xml/target/classes
[INFO] [resources:testResources]
[INFO] Using default encoding to copy filtered resources.
[INFO] [compiler:testCompile]
[INFO] Compiling 6 source files to /x1/continuum/working-directory/216/rt/bindings/xml/target/test-classes
[INFO] [surefire:test]
[INFO] Surefire report directory: /x1/continuum/working-directory/216/rt/bindings/xml/target/surefire-reports

-------------------------------------------------------
 T E S T S
-------------------------------------------------------
Running org.apache.cxf.binding.xml.interceptor.XMLMessageOutInterceptorTest
Tests run: 3, Failures: 0, Errors: 0, Skipped: 0, Time elapsed: 5.938 sec
Running org.apache.cxf.binding.xml.interceptor.XMLMessageInInterceptorTest
Tests run: 3, Failures: 0, Errors: 0, Skipped: 0, Time elapsed: 2.075 sec
Running org.apache.cxf.binding.xml.interceptor.XMLFaultInterceptorsTest
Tests run: 1, Failures: 0, Errors: 0, Skipped: 0, Time elapsed: 0.761 sec
Running org.apache.cxf.binding.xml.interceptor.XMLFaultOutInterceptorTest
Tests run: 1, Failures: 0, Errors: 0, Skipped: 0, Time elapsed: 0.046 sec
Running org.apache.cxf.binding.xml.XMLBindingFactoryTest
Tests run: 1, Failures: 0, Errors: 0, Skipped: 0, Time elapsed: 0.017 sec

Results :

Tests run: 9, Failures: 0, Errors: 0, Skipped: 0

[INFO] [jar:jar]
[INFO] Building jar: /x1/continuum/working-directory/216/rt/bindings/xml/target/cxf-rt-bindings-xml-2.0-incubator-RC-SNAPSHOT.jar
[INFO] [install:install]
[INFO] Installing /x1/continuum/working-directory/216/rt/bindings/xml/target/cxf-rt-bindings-xml-2.0-incubator-RC-SNAPSHOT.jar to /home/continuum/.m2/repository/org/apache/cxf/cxf-rt-bindings-xml/2.0-incubator-RC-SNAPSHOT/cxf-rt-bindings-xml-2.0-incubator-RC-SNAPSHOT.jar
[INFO] ----------------------------------------------------------------------------
[INFO] Building Apache CXF Runtime Local transport
[INFO]    task-segment: [clean, install]
[INFO] ----------------------------------------------------------------------------
[INFO] [clean:clean]
[INFO] Deleting directory /x1/continuum/working-directory/216/rt/transports/local/target
[INFO] Deleting directory /x1/continuum/working-directory/216/rt/transports/local/target/classes
[INFO] Deleting directory /x1/continuum/working-directory/216/rt/transports/local/target/test-classes
[INFO] [checkstyle:checkstyle {execution: validate}]
[INFO] Starting audit...
Audit done.

[INFO] Preparing pmd:check
[INFO] [pmd:pmd]
[INFO] [pmd:check {execution: validate}]
[INFO] 
[INFO] [remote-resources:process {execution: default}]
[INFO] [resources:resources]
[INFO] Using default encoding to copy filtered resources.
[INFO] [compiler:compile]
[INFO] Compiling 3 source files to /x1/continuum/working-directory/216/rt/transports/local/target/classes
[INFO] [resources:testResources]
[INFO] Using default encoding to copy filtered resources.
[INFO] [compiler:testCompile]
[INFO] Compiling 1 source file to /x1/continuum/working-directory/216/rt/transports/local/target/test-classes
[INFO] [surefire:test]
[INFO] Surefire report directory: /x1/continuum/working-directory/216/rt/transports/local/target/surefire-reports

-------------------------------------------------------
 T E S T S
-------------------------------------------------------
Running org.apache.cxf.transport.local.LocalTransportFactoryTest
Tests run: 2, Failures: 0, Errors: 0, Skipped: 0, Time elapsed: 0.186 sec

Results :

Tests run: 2, Failures: 0, Errors: 0, Skipped: 0

[INFO] [jar:jar]
[INFO] Building jar: /x1/continuum/working-directory/216/rt/transports/local/target/cxf-rt-transports-local-2.0-incubator-RC-SNAPSHOT.jar
[INFO] [install:install]
[INFO] Installing /x1/continuum/working-directory/216/rt/transports/local/target/cxf-rt-transports-local-2.0-incubator-RC-SNAPSHOT.jar to /home/continuum/.m2/repository/org/apache/cxf/cxf-rt-transports-local/2.0-incubator-RC-SNAPSHOT/cxf-rt-transports-local-2.0-incubator-RC-SNAPSHOT.jar
[INFO] ----------------------------------------------------------------------------
[INFO] Building Apache CXF Runtime Simple Frontend
[INFO]    task-segment: [clean, install]
[INFO] ----------------------------------------------------------------------------
[INFO] [clean:clean]
[INFO] Deleting directory /x1/continuum/working-directory/216/rt/frontend/simple/target
[INFO] Deleting directory /x1/continuum/working-directory/216/rt/frontend/simple/target/classes
[INFO] Deleting directory /x1/continuum/working-directory/216/rt/frontend/simple/target/test-classes
[INFO] [checkstyle:checkstyle {execution: validate}]
[INFO] Starting audit...
Audit done.

[INFO] Preparing pmd:check
[INFO] [pmd:pmd]
[INFO] [pmd:check {execution: validate}]
[INFO] 
[INFO] [remote-resources:process {execution: default}]
[INFO] [resources:resources]
[INFO] Using default encoding to copy filtered resources.
[INFO] [compiler:compile]
[INFO] Compiling 9 source files to /x1/continuum/working-directory/216/rt/frontend/simple/target/classes
[INFO] [resources:testResources]
[INFO] Using default encoding to copy filtered resources.
[INFO] [compiler:testCompile]
[INFO] Compiling 7 source files to /x1/continuum/working-directory/216/rt/frontend/simple/target/test-classes
[INFO] [surefire:test]
[INFO] Surefire report directory: /x1/continuum/working-directory/216/rt/frontend/simple/target/surefire-reports

-------------------------------------------------------
 T E S T S
-------------------------------------------------------
Running org.apache.cxf.service.factory.ClientFactoryBeanTest
Tests run: 1, Failures: 0, Errors: 0, Skipped: 0, Time elapsed: 4.314 sec
Running org.apache.cxf.service.factory.ServerFactoryTest
Tests run: 1, Failures: 0, Errors: 0, Skipped: 0, Time elapsed: 1.03 sec
Running org.apache.cxf.service.factory.ReflectionServiceFactoryTest
Tests run: 3, Failures: 0, Errors: 0, Skipped: 0, Time elapsed: 2.694 sec
Running org.apache.cxf.service.factory.RountripTest
Tests run: 1, Failures: 0, Errors: 0, Skipped: 0, Time elapsed: 1.532 sec

Results :

Tests run: 6, Failures: 0, Errors: 0, Skipped: 0

[INFO] [jar:jar]
[INFO] Building jar: /x1/continuum/working-directory/216/rt/frontend/simple/target/cxf-rt-frontend-simple-2.0-incubator-RC-SNAPSHOT.jar
[INFO] [install:install]
[INFO] Installing /x1/continuum/working-directory/216/rt/frontend/simple/target/cxf-rt-frontend-simple-2.0-incubator-RC-SNAPSHOT.jar to /home/continuum/.m2/repository/org/apache/cxf/cxf-rt-frontend-simple/2.0-incubator-RC-SNAPSHOT/cxf-rt-frontend-simple-2.0-incubator-RC-SNAPSHOT.jar
[INFO] ----------------------------------------------------------------------------
[INFO] Building Apache CXF Runtime JAX-WS Frontend
[INFO]    task-segment: [clean, install]
[INFO] ----------------------------------------------------------------------------
[INFO] [clean:clean]
[INFO] Deleting directory /x1/continuum/working-directory/216/rt/frontend/jaxws/target
[INFO] Deleting directory /x1/continuum/working-directory/216/rt/frontend/jaxws/target/classes
[INFO] Deleting directory /x1/continuum/working-directory/216/rt/frontend/jaxws/target/test-classes
[INFO] [checkstyle:checkstyle {execution: validate}]
[INFO] Starting audit...
Audit done.

[INFO] Preparing pmd:check
[INFO] [pmd:pmd]
[INFO] [pmd:check {execution: validate}]
[INFO] 
[INFO] [build-helper:add-source {execution: add-source}]
[INFO] Source directory: /x1/continuum/working-directory/216/rt/frontend/jaxws/src/main/generated added.
[INFO] [remote-resources:process {execution: default}]
[INFO] [resources:resources]
[INFO] Using default encoding to copy filtered resources.
[INFO] [compiler:compile]
[INFO] Compiling 126 source files to /x1/continuum/working-directory/216/rt/frontend/jaxws/target/classes
[INFO] [resources:testResources]
[INFO] Using default encoding to copy filtered resources.
[INFO] [compiler:testCompile]
[INFO] Compiling 48 source files to /x1/continuum/working-directory/216/rt/frontend/jaxws/target/test-classes
[INFO] [surefire:test]
[INFO] Surefire report directory: /x1/continuum/working-directory/216/rt/frontend/jaxws/target/surefire-reports

-------------------------------------------------------
 T E S T S
-------------------------------------------------------
Running org.apache.cxf.jaxws.JaxWsClientTest
Tests run: 3, Failures: 0, Errors: 0, Skipped: 0, Time elapsed: 10.672 sec
Running org.apache.cxf.jaxws.header.HeaderClientServerTest
Tests run: 9, Failures: 0, Errors: 0, Skipped: 1, Time elapsed: 12.666 sec
Running org.apache.cxf.jaxws.SOAPBindingTest
Tests run: 2, Failures: 0, Errors: 0, Skipped: 0, Time elapsed: 2.069 sec
Running org.apache.cxf.jaxws.holder.HolderTest
Tests run: 2, Failures: 0, Errors: 0, Skipped: 0, Time elapsed: 4.171 sec
Running org.apache.cxf.jaxws.provider.ProviderServiceFactoryTest
Tests run: 6, Failures: 0, Errors: 0, Skipped: 0, Time elapsed: 6.941 sec
Running org.apache.cxf.jaxws.handler.InitParamResourceResolverTest
Tests run: 8, Failures: 0, Errors: 0, Skipped: 0, Time elapsed: 0.04 sec
Running org.apache.cxf.jaxws.ServiceModelUtilsTest
Tests run: 4, Failures: 0, Errors: 0, Skipped: 0, Time elapsed: 6.231 sec
Running org.apache.cxf.jaxws.HeaderTest
Tests run: 1, Failures: 0, Errors: 0, Skipped: 0, Time elapsed: 1.206 sec
Running org.apache.cxf.jaxws.javaee.WebservicesTypeTest
Tests run: 1, Failures: 0, Errors: 0, Skipped: 0, Time elapsed: 0.411 sec
Running org.apache.cxf.jaxws.handler.AbstractProtocolHandlerInterceptorTest
Tests run: 2, Failures: 0, Errors: 0, Skipped: 0, Time elapsed: 0.558 sec
Running org.apache.cxf.jaxws.handler.soap.SOAPHandlerInterceptorTest
Tests run: 5, Failures: 0, Errors: 0, Skipped: 0, Time elapsed: 0.283 sec
Running org.apache.cxf.jaxws.GreeterTest
Tests run: 1, Failures: 0, Errors: 0, Skipped: 0, Time elapsed: 1.253 sec
Running org.apache.cxf.jaxws.CodeFirstTest
Tests run: 4, Failures: 0, Errors: 0, Skipped: 0, Time elapsed: 3.976 sec
Running org.apache.cxf.jaxws.spring.SpringBeansTest
Tests run: 3, Failures: 0, Errors: 0, Skipped: 0, Time elapsed: 4.963 sec
Running org.apache.cxf.jaxws.handler.LogicalHandlerInterceptorTest
Tests run: 2, Failures: 0, Errors: 0, Skipped: 0, Time elapsed: 0.048 sec
Running org.apache.cxf.jaxws.context.WebServiceContextImplTest
Tests run: 2, Failures: 0, Errors: 0, Skipped: 0, Time elapsed: 0.012 sec
Running org.apache.cxf.jaxws.JAXWSMethodInvokerTest
Tests run: 1, Failures: 0, Errors: 0, Skipped: 0, Time elapsed: 0.04 sec
Running org.apache.cxf.jaxws.SoapFaultTest
Tests run: 2, Failures: 0, Errors: 0, Skipped: 0, Time elapsed: 4.005 sec
Running org.apache.cxf.jaxws.provider.ProviderTest
Tests run: 1, Failures: 0, Errors: 0, Skipped: 0, Time elapsed: 0.735 sec
Running org.apache.cxf.jaxws.ServiceImplTest
Tests run: 9, Failures: 0, Errors: 0, Skipped: 2, Time elapsed: 6.037 sec
Running org.apache.cxf.jaxws.dispatch.DispatchTest
Tests run: 4, Failures: 0, Errors: 0, Skipped: 0, Time elapsed: 3.455 sec
Running org.apache.cxf.jaxws.support.JaxWsServiceFactoryBeanTest
Tests run: 2, Failures: 0, Errors: 0, Skipped: 0, Time elapsed: 1.887 sec
Running org.apache.cxf.jaxws.handler.AnnotationHandlerChainBuilderTest
Tests run: 1, Failures: 0, Errors: 0, Skipped: 0, Time elapsed: 0.481 sec
Running org.apache.cxf.jaxws.ConfiguredEndpointTest
Tests run: 8, Failures: 0, Errors: 0, Skipped: 2, Time elapsed: 3.646 sec
Running org.apache.cxf.jaxws.support.ContextPropertiesMappingTest
Tests run: 5, Failures: 0, Errors: 0, Skipped: 0, Time elapsed: 0.037 sec
Running org.apache.cxf.jaxws.CodeFirstWSDLTest
Tests run: 2, Failures: 0, Errors: 0, Skipped: 0, Time elapsed: 1.542 sec
Running org.apache.cxf.jaxws.JaxWsServerFactoryBeanTest
Tests run: 2, Failures: 0, Errors: 0, Skipped: 0, Time elapsed: 1.873 sec
Running org.apache.cxf.jaxws.URIMappingInterceptorDocLitTest
Tests run: 5, Failures: 0, Errors: 0, Skipped: 0, Time elapsed: 2.444 sec
Running org.apache.cxf.jaxws.support.JaxWsServiceConfigurationTest
Tests run: 6, Failures: 0, Errors: 0, Skipped: 0, Time elapsed: 0.064 sec
Running org.apache.cxf.jaxws.handler.HandlerChainInvokerTest
Tests run: 15, Failures: 0, Errors: 0, Skipped: 0, Time elapsed: 0.028 sec
Running org.apache.cxf.jaxws.handler.LogicalMessageImplTest
Tests run: 1, Failures: 0, Errors: 0, Skipped: 0, Time elapsed: 0.009 sec
Running org.apache.cxf.jaxws.EndpointImplTest
Tests run: 5, Failures: 0, Errors: 0, Skipped: 0, Time elapsed: 4.467 sec
Running org.apache.cxf.jaxws.handler.HandlerChainBuilderTest
Tests run: 5, Failures: 0, Errors: 0, Skipped: 0, Time elapsed: 0.017 sec
Running org.apache.cxf.jaxws.URIMappingInterceptorRPCTest
Tests run: 6, Failures: 0, Errors: 0, Skipped: 0, Time elapsed: 3.453 sec

Results :

Tests run: 135, Failures: 0, Errors: 0, Skipped: 5

[INFO] [jar:jar]
[INFO] Building jar: /x1/continuum/working-directory/216/rt/frontend/jaxws/target/cxf-rt-frontend-jaxws-2.0-incubator-RC-SNAPSHOT.jar
[INFO] [install:install]
[INFO] Installing /x1/continuum/working-directory/216/rt/frontend/jaxws/target/cxf-rt-frontend-jaxws-2.0-incubator-RC-SNAPSHOT.jar to /home/continuum/.m2/repository/org/apache/cxf/cxf-rt-frontend-jaxws/2.0-incubator-RC-SNAPSHOT/cxf-rt-frontend-jaxws-2.0-incubator-RC-SNAPSHOT.jar
[INFO] ----------------------------------------------------------------------------
[INFO] Building Apache CXF Command Line Tools JavaTo
[INFO]    task-segment: [clean, install]
[INFO] ----------------------------------------------------------------------------
[INFO] [clean:clean]
[INFO] Deleting directory /x1/continuum/working-directory/216/tools/javato/target
[INFO] Deleting directory /x1/continuum/working-directory/216/tools/javato/target/classes
[INFO] Deleting directory /x1/continuum/working-directory/216/tools/javato/target/test-classes
[INFO] [checkstyle:checkstyle {execution: validate}]
[INFO] Starting audit...
Audit done.

[INFO] Preparing pmd:check
[INFO] [pmd:pmd]
[INFO] [pmd:check {execution: validate}]
[INFO] 
[WARNING] 
	Artifact javax.xml.ws:jaxws-api:jar:2.0:provided retains local scope 'provided' overriding broader scope 'compile'
	given by a dependency. If this is not intended, modify or remove the local scope.

[INFO] [remote-resources:process {execution: default}]
[INFO] [resources:resources]
[INFO] Using default encoding to copy filtered resources.
[INFO] [compiler:compile]
[INFO] Compiling 23 source files to /x1/continuum/working-directory/216/tools/javato/target/classes
[INFO] [cxf-codegen:wsdl2java {execution: generate-test-sources}]
[INFO] [resources:testResources]
[INFO] Using default encoding to copy filtered resources.
[INFO] [compiler:testCompile]
[INFO] Compiling 93 source files to /x1/continuum/working-directory/216/tools/javato/target/test-classes
[INFO] [surefire:test]
[INFO] Surefire report directory: /x1/continuum/working-directory/216/tools/javato/target/surefire-reports

-------------------------------------------------------
 T E S T S
-------------------------------------------------------
Running org.apache.cxf.tools.java2wsdl.generator.WSDLGeneratorFactoryTest
Tests run: 1, Failures: 0, Errors: 0, Skipped: 0, Time elapsed: 0.065 sec
Running org.apache.cxf.tools.java2wsdl.processor.internal.jaxws.JaxwsServiceBuilderTest
Tests run: 14, Failures: 0, Errors: 0, Skipped: 12, Time elapsed: 5.012 sec
Running org.apache.cxf.tools.java2wsdl.processor.JavaToProcessorTest
Tests run: 3, Failures: 0, Errors: 0, Skipped: 0, Time elapsed: 1.509 sec
Running org.apache.cxf.tools.java2wsdl.processor.internal.jaxws.WrapperUtilTest
Tests run: 4, Failures: 0, Errors: 0, Skipped: 0, Time elapsed: 0.102 sec
Running org.apache.cxf.tools.java2wsdl.processor.internal.jaxws.JaxwsServiceBuilderNoAnnoTest
Tests run: 3, Failures: 0, Errors: 0, Skipped: 0, Time elapsed: 0.3 sec
Running org.apache.cxf.tools.java2wsdl.processor.internal.ServiceBuilderFactoryTest
Tests run: 3, Failures: 0, Errors: 0, Skipped: 0, Time elapsed: 0.171 sec
Running org.apache.cxf.tools.java2wsdl.processor.JavaToWSDLNoAnnoTest
Tests run: 3, Failures: 0, Errors: 0, Skipped: 0, Time elapsed: 0.263 sec
Running org.apache.cxf.tools.java2wsdl.processor.FrontendFactoryTest
Tests run: 3, Failures: 0, Errors: 0, Skipped: 0, Time elapsed: 0.285 sec
Running org.apache.cxf.tools.java2wsdl.JavaToWSDLTest
Tests run: 6, Failures: 0, Errors: 0, Skipped: 0, Time elapsed: 1.963 sec
Running org.apache.cxf.tools.java2wsdl.processor.JavaToWSDLProcessorTest
Tests run: 12, Failures: 0, Errors: 0, Skipped: 0, Time elapsed: 23.179 sec

Results :

Tests run: 52, Failures: 0, Errors: 0, Skipped: 12

[INFO] [jar:jar]
[INFO] Building jar: /x1/continuum/working-directory/216/tools/javato/target/cxf-tools-java2wsdl-2.0-incubator-RC-SNAPSHOT.jar
[INFO] [install:install]
[INFO] Installing /x1/continuum/working-directory/216/tools/javato/target/cxf-tools-java2wsdl-2.0-incubator-RC-SNAPSHOT.jar to /home/continuum/.m2/repository/org/apache/cxf/cxf-tools-java2wsdl/2.0-incubator-RC-SNAPSHOT/cxf-tools-java2wsdl-2.0-incubator-RC-SNAPSHOT.jar
[INFO] ----------------------------------------------------------------------------
[INFO] Building Apache CXF Runtime HTTP transport
[INFO]    task-segment: [clean, install]
[INFO] ----------------------------------------------------------------------------
[INFO] [clean:clean]
[INFO] Deleting directory /x1/continuum/working-directory/216/rt/transports/http/target
[INFO] Deleting directory /x1/continuum/working-directory/216/rt/transports/http/target/classes
[INFO] Deleting directory /x1/continuum/working-directory/216/rt/transports/http/target/test-classes
[INFO] [checkstyle:checkstyle {execution: validate}]
[INFO] Starting audit...
Audit done.

[INFO] Preparing pmd:check
[INFO] [pmd:pmd]
[INFO] [pmd:check {execution: validate}]
[INFO] 
[INFO] [cxf-common-xsd:xsdtojava {execution: generate-sources}]
[INFO] [remote-resources:process {execution: default}]
[INFO] [resources:resources]
[INFO] Using default encoding to copy filtered resources.
[INFO] [compiler:compile]
[INFO] Compiling 33 source files to /x1/continuum/working-directory/216/rt/transports/http/target/classes
[INFO] [resources:testResources]
[INFO] Using default encoding to copy filtered resources.
[INFO] [compiler:testCompile]
[INFO] Compiling 7 source files to /x1/continuum/working-directory/216/rt/transports/http/target/test-classes
[INFO] [surefire:test]
[INFO] Surefire report directory: /x1/continuum/working-directory/216/rt/transports/http/target/surefire-reports

-------------------------------------------------------
 T E S T S
-------------------------------------------------------
Running org.apache.cxf.transport.http.policy.PolicyUtilsTest
Tests run: 12, Failures: 0, Errors: 0, Skipped: 0, Time elapsed: 0.412 sec
Running org.apache.cxf.transport.http.policy.HTTPClientAssertionBuilderTest
Tests run: 3, Failures: 0, Errors: 0, Skipped: 0, Time elapsed: 2.359 sec
Running org.apache.cxf.transport.http.HTTPConduitTest
Tests run: 6, Failures: 0, Errors: 0, Skipped: 0, Time elapsed: 1.291 sec
Running org.apache.cxf.transport.https.HttpsURLConnectionFactoryTest
Tests run: 12, Failures: 0, Errors: 0, Skipped: 0, Time elapsed: 12.544 sec
Running org.apache.cxf.transport.http.policy.HTTPServerAssertionBuilderTest
Tests run: 3, Failures: 0, Errors: 0, Skipped: 0, Time elapsed: 1.171 sec

Results :

Tests run: 36, Failures: 0, Errors: 0, Skipped: 0

[INFO] [jar:jar]
[INFO] Building jar: /x1/continuum/working-directory/216/rt/transports/http/target/cxf-rt-transports-http-2.0-incubator-RC-SNAPSHOT.jar
[INFO] [install:install]
[INFO] Installing /x1/continuum/working-directory/216/rt/transports/http/target/cxf-rt-transports-http-2.0-incubator-RC-SNAPSHOT.jar to /home/continuum/.m2/repository/org/apache/cxf/cxf-rt-transports-http/2.0-incubator-RC-SNAPSHOT/cxf-rt-transports-http-2.0-incubator-RC-SNAPSHOT.jar
[INFO] ----------------------------------------------------------------------------
[INFO] Building Apache CXF Runtime HTTP Jetty transport
[INFO]    task-segment: [clean, install]
[INFO] ----------------------------------------------------------------------------
[INFO] [clean:clean]
[INFO] Deleting directory /x1/continuum/working-directory/216/rt/transports/http-jetty/target
[INFO] Deleting directory /x1/continuum/working-directory/216/rt/transports/http-jetty/target/classes
[INFO] Deleting directory /x1/continuum/working-directory/216/rt/transports/http-jetty/target/test-classes
[INFO] [checkstyle:checkstyle {execution: validate}]
[INFO] Starting audit...
Audit done.

[INFO] Preparing pmd:check
[INFO] [pmd:pmd]
[INFO] [pmd:check {execution: validate}]
[INFO] 
[INFO] [remote-resources:process {execution: default}]
[INFO] [resources:resources]
[INFO] Using default encoding to copy filtered resources.
[INFO] [compiler:compile]
[INFO] Compiling 8 source files to /x1/continuum/working-directory/216/rt/transports/http-jetty/target/classes
[INFO] [resources:testResources]
[INFO] Using default encoding to copy filtered resources.
[INFO] [compiler:testCompile]
[INFO] Compiling 6 source files to /x1/continuum/working-directory/216/rt/transports/http-jetty/target/test-classes
[INFO] [surefire:test]
[INFO] Surefire report directory: /x1/continuum/working-directory/216/rt/transports/http-jetty/target/surefire-reports

-------------------------------------------------------
 T E S T S
-------------------------------------------------------
Running org.apache.cxf.transport.http_jetty.JettyHTTPServerEngineTest
Tests run: 4, Failures: 0, Errors: 0, Skipped: 0, Time elapsed: 2.415 sec
Running org.apache.cxf.transport.http_jetty.JettyHTTPDestinationTest
Tests run: 13, Failures: 0, Errors: 0, Skipped: 0, Time elapsed: 1.88 sec
Running org.apache.cxf.transport.http_jetty.JettyContextInspectorTest
Tests run: 1, Failures: 0, Errors: 0, Skipped: 0, Time elapsed: 0.374 sec
Running org.apache.cxf.transport.http_jetty.spring.BeanDefinitionParsersTest
Tests run: 2, Failures: 0, Errors: 0, Skipped: 0, Time elapsed: 1.315 sec
Running org.apache.cxf.transport.http_jetty.spring.ApplicationContextTest
Tests run: 1, Failures: 0, Errors: 0, Skipped: 0, Time elapsed: 3.729 sec
Running org.apache.cxf.transport.https_jetty.JettySslConnectorFactoryTest
Tests run: 8, Failures: 0, Errors: 0, Skipped: 0, Time elapsed: 3.979 sec

Results :

Tests run: 29, Failures: 0, Errors: 0, Skipped: 0

[INFO] [jar:jar]
[INFO] Building jar: /x1/continuum/working-directory/216/rt/transports/http-jetty/target/cxf-rt-transports-http-jetty-2.0-incubator-RC-SNAPSHOT.jar
[INFO] [install:install]
[INFO] Installing /x1/continuum/working-directory/216/rt/transports/http-jetty/target/cxf-rt-transports-http-jetty-2.0-incubator-RC-SNAPSHOT.jar to /home/continuum/.m2/repository/org/apache/cxf/cxf-rt-transports-http-jetty/2.0-incubator-RC-SNAPSHOT/cxf-rt-transports-http-jetty-2.0-incubator-RC-SNAPSHOT.jar
[INFO] ----------------------------------------------------------------------------
[INFO] Building Apache CXF Runtime Aegis Databinding
[INFO]    task-segment: [clean, install]
[INFO] ----------------------------------------------------------------------------
[INFO] [clean:clean]
[INFO] Deleting directory /x1/continuum/working-directory/216/rt/databinding/aegis/target
[INFO] Deleting directory /x1/continuum/working-directory/216/rt/databinding/aegis/target/classes
[INFO] Deleting directory /x1/continuum/working-directory/216/rt/databinding/aegis/target/test-classes
[INFO] [checkstyle:checkstyle {execution: validate}]
[INFO] Starting audit...
Audit done.

[INFO] Preparing pmd:check
[INFO] [pmd:pmd]
[INFO] [pmd:check {execution: validate}]
[INFO] 
[INFO] [build-helper:add-source {execution: add-source}]
[INFO] Source directory: /x1/continuum/working-directory/216/rt/databinding/aegis/src/main/generated added.
[WARNING] 
	Artifact active project artifact:
	artifact = org.apache.cxf:cxf-tools-common:jar:2.0-incubator-RC-SNAPSHOT:test;
	project: org.apache.maven.project.MavenProject@afbebeda retains local scope 'test' overriding broader scope 'compile'
	given by a dependency. If this is not intended, modify or remove the local scope.

[INFO] [remote-resources:process {execution: default}]
[INFO] [resources:resources]
[INFO] Using default encoding to copy filtered resources.
[INFO] [compiler:compile]
[INFO] Compiling 92 source files to /x1/continuum/working-directory/216/rt/databinding/aegis/target/classes
[INFO] [resources:testResources]
[INFO] Using default encoding to copy filtered resources.
[INFO] [compiler:testCompile]
[INFO] Compiling 80 source files to /x1/continuum/working-directory/216/rt/databinding/aegis/target/test-classes
[INFO] [surefire:test]
[INFO] Surefire report directory: /x1/continuum/working-directory/216/rt/databinding/aegis/target/surefire-reports

-------------------------------------------------------
 T E S T S
-------------------------------------------------------
Running org.apache.cxf.aegis.xml.stax.WriterTest
Tests run: 2, Failures: 0, Errors: 0, Skipped: 0, Time elapsed: 8.625 sec
Running org.apache.cxf.aegis.services.base64.BinaryDataTest
Tests run: 1, Failures: 0, Errors: 0, Skipped: 0, Time elapsed: 3.085 sec
Running org.codehaus.xfire.aegis.inheritance.intf.InterfaceInheritanceTest
Tests run: 1, Failures: 0, Errors: 0, Skipped: 0, Time elapsed: 2.991 sec
Running org.apache.cxf.aegis.type.java5.DualOutServiceTest
Tests run: 1, Failures: 0, Errors: 0, Skipped: 0, Time elapsed: 2.788 sec
Running org.codehaus.xfire.aegis.inheritance.ExceptionInheritanceTest
Tests run: 1, Failures: 0, Errors: 0, Skipped: 0, Time elapsed: 1.89 sec
Running org.apache.cxf.aegis.xml.stax.ReaderTest
Tests run: 2, Failures: 0, Errors: 0, Skipped: 0, Time elapsed: 3.085 sec
Running org.apache.cxf.aegis.type.java5.AnnotatedTypeTest
Tests run: 7, Failures: 0, Errors: 0, Skipped: 0, Time elapsed: 12.866 sec
Running org.apache.cxf.aegis.type.java5.ConfigurationTest
Tests run: 6, Failures: 0, Errors: 0, Skipped: 0, Time elapsed: 9.969 sec
Running org.codehaus.xfire.aegis.inheritance.InheritancePOJOTest
Tests run: 3, Failures: 0, Errors: 0, Skipped: 0, Time elapsed: 5.056 sec
Running org.apache.cxf.aegis.type.java5.OperationNSTest
Tests run: 1, Failures: 0, Errors: 0, Skipped: 0, Time elapsed: 1.49 sec
Running org.apache.cxf.aegis.type.java5.CollectionTest
Tests run: 8, Failures: 0, Errors: 0, Skipped: 0, Time elapsed: 12.423 sec
Running org.apache.cxf.aegis.client.HeaderTest
Tests run: 1, Failures: 0, Errors: 0, Skipped: 1, Time elapsed: 0.008 sec
Running org.apache.cxf.aegis.type.java5.MapTest
Tests run: 6, Failures: 0, Errors: 0, Skipped: 0, Time elapsed: 10.089 sec
Running org.apache.cxf.aegis.type.java5.EnumTypeTest
Tests run: 6, Failures: 0, Errors: 0, Skipped: 0, Time elapsed: 10.742 sec
Running org.apache.cxf.aegis.integration.WrappedTest
Tests run: 2, Failures: 0, Errors: 0, Skipped: 0, Time elapsed: 3.686 sec
Running org.apache.cxf.aegis.type.java5.XmlParamTypeTest
Tests run: 2, Failures: 0, Errors: 0, Skipped: 0, Time elapsed: 3.579 sec

Results :

Tests run: 50, Failures: 0, Errors: 0, Skipped: 1

[INFO] [jar:jar]
[INFO] Building jar: /x1/continuum/working-directory/216/rt/databinding/aegis/target/cxf-rt-databinding-aegis-2.0-incubator-RC-SNAPSHOT.jar
[INFO] [install:install]
[INFO] Installing /x1/continuum/working-directory/216/rt/databinding/aegis/target/cxf-rt-databinding-aegis-2.0-incubator-RC-SNAPSHOT.jar to /home/continuum/.m2/repository/org/apache/cxf/cxf-rt-databinding-aegis/2.0-incubator-RC-SNAPSHOT/cxf-rt-databinding-aegis-2.0-incubator-RC-SNAPSHOT.jar
[INFO] ----------------------------------------------------------------------------
[INFO] Building Apache CXF Runtime HTTP Binding
[INFO]    task-segment: [clean, install]
[INFO] ----------------------------------------------------------------------------
[INFO] [clean:clean]
[INFO] Deleting directory /x1/continuum/working-directory/216/rt/bindings/http/target
[INFO] Deleting directory /x1/continuum/working-directory/216/rt/bindings/http/target/classes
[INFO] Deleting directory /x1/continuum/working-directory/216/rt/bindings/http/target/test-classes
[INFO] [checkstyle:checkstyle {execution: validate}]
[INFO] Starting audit...
Audit done.

[INFO] Preparing pmd:check
[INFO] [pmd:pmd]
[INFO] [pmd:check {execution: validate}]
[INFO] 
[INFO] [remote-resources:process {execution: default}]
[INFO] [resources:resources]
[INFO] Using default encoding to copy filtered resources.
[INFO] [compiler:compile]
[INFO] Compiling 16 source files to /x1/continuum/working-directory/216/rt/bindings/http/target/classes
[INFO] [cxf-common-xsd:xsdtojava {execution: generate-sources}]
[INFO] [resources:testResources]
[INFO] Using default encoding to copy filtered resources.
[INFO] [compiler:testCompile]
[INFO] Compiling 24 source files to /x1/continuum/working-directory/216/rt/bindings/http/target/test-classes
[INFO] [surefire:test]
[INFO] Surefire report directory: /x1/continuum/working-directory/216/rt/bindings/http/target/surefire-reports

-------------------------------------------------------
 T E S T S
-------------------------------------------------------
Running org.apache.cxf.binding.http.InflectorTest
Tests run: 2, Failures: 0, Errors: 0, Skipped: 0, Time elapsed: 0.121 sec
Running org.apache.cxf.binding.http.mtom.MtomTest
2007-04-13 08:19:32.858::INFO:  Logging to STDERR via org.mortbay.log.StdErrLog
2007-04-13 08:19:32.879::INFO:  jetty-6.1.2rc0
2007-04-13 08:19:33.012::INFO:  Started SelectChannelConnector @ 0.0.0.0:9001
Tests run: 1, Failures: 0, Errors: 0, Skipped: 0, Time elapsed: 8.395 sec
Running org.apache.cxf.binding.http.IriDecoderTest
Tests run: 1, Failures: 0, Errors: 0, Skipped: 0, Time elapsed: 0.019 sec
Running org.apache.cxf.binding.http.wrapped.WrappedServiceTest
Tests run: 2, Failures: 0, Errors: 0, Skipped: 0, Time elapsed: 5.771 sec
Running org.apache.cxf.binding.http.bare.ClientTest
Tests run: 1, Failures: 0, Errors: 0, Skipped: 0, Time elapsed: 2.607 sec
Running org.apache.cxf.binding.http.bare.BareServiceTest
Tests run: 2, Failures: 0, Errors: 0, Skipped: 0, Time elapsed: 4.249 sec

Results :

Tests run: 9, Failures: 0, Errors: 0, Skipped: 0

[INFO] [jar:jar]
[INFO] Building jar: /x1/continuum/working-directory/216/rt/bindings/http/target/cxf-rt-bindings-http-2.0-incubator-RC-SNAPSHOT.jar
[INFO] [install:install]
[INFO] Installing /x1/continuum/working-directory/216/rt/bindings/http/target/cxf-rt-bindings-http-2.0-incubator-RC-SNAPSHOT.jar to /home/continuum/.m2/repository/org/apache/cxf/cxf-rt-bindings-http/2.0-incubator-RC-SNAPSHOT/cxf-rt-bindings-http-2.0-incubator-RC-SNAPSHOT.jar
[INFO] ----------------------------------------------------------------------------
[INFO] Building Apache CXF Runtime Object Binding
[INFO]    task-segment: [clean, install]
[INFO] ----------------------------------------------------------------------------
[INFO] [clean:clean]
[INFO] Deleting directory /x1/continuum/working-directory/216/rt/bindings/object/target
[INFO] Deleting directory /x1/continuum/working-directory/216/rt/bindings/object/target/classes
[INFO] Deleting directory /x1/continuum/working-directory/216/rt/bindings/object/target/test-classes
[INFO] [checkstyle:checkstyle {execution: validate}]
[INFO] Starting audit...
Audit done.

[INFO] Preparing pmd:check
[INFO] [pmd:pmd]
[INFO] [pmd:check {execution: validate}]
[INFO] 
[INFO] [remote-resources:process {execution: default}]
[INFO] [resources:resources]
[INFO] Using default encoding to copy filtered resources.
[INFO] [compiler:compile]
[INFO] Compiling 8 source files to /x1/continuum/working-directory/216/rt/bindings/object/target/classes
[INFO] [resources:testResources]
[INFO] Using default encoding to copy filtered resources.
[INFO] [compiler:testCompile]
[INFO] Compiling 4 source files to /x1/continuum/working-directory/216/rt/bindings/object/target/test-classes
[INFO] [surefire:test]
[INFO] Surefire report directory: /x1/continuum/working-directory/216/rt/bindings/object/target/surefire-reports

-------------------------------------------------------
 T E S T S
-------------------------------------------------------
Running org.apache.cxf.binding.object.LocalServerRegistrationTest
2007-04-13 08:20:10.924::INFO:  Logging to STDERR via org.mortbay.log.StdErrLog
2007-04-13 08:20:10.957::INFO:  jetty-6.1.2rc0
2007-04-13 08:20:11.075::INFO:  Started SelectChannelConnector @ 0.0.0.0:9001
Tests run: 1, Failures: 0, Errors: 0, Skipped: 0, Time elapsed: 7.79 sec
Running org.apache.cxf.binding.object.ObjectBindingTest
Tests run: 3, Failures: 0, Errors: 0, Skipped: 0, Time elapsed: 7.75 sec

Results :

Tests run: 4, Failures: 0, Errors: 0, Skipped: 0

[INFO] [jar:jar]
[INFO] Building jar: /x1/continuum/working-directory/216/rt/bindings/object/target/cxf-rt-bindings-object-2.0-incubator-RC-SNAPSHOT.jar
[INFO] [install:install]
[INFO] Installing /x1/continuum/working-directory/216/rt/bindings/object/target/cxf-rt-bindings-object-2.0-incubator-RC-SNAPSHOT.jar to /home/continuum/.m2/repository/org/apache/cxf/cxf-rt-bindings-object/2.0-incubator-RC-SNAPSHOT/cxf-rt-bindings-object-2.0-incubator-RC-SNAPSHOT.jar
[INFO] ----------------------------------------------------------------------------
[INFO] Building Apache CXF Colocated Binding
[INFO]    task-segment: [clean, install]
[INFO] ----------------------------------------------------------------------------
[INFO] [clean:clean]
[INFO] Deleting directory /x1/continuum/working-directory/216/rt/bindings/coloc/target
[INFO] Deleting directory /x1/continuum/working-directory/216/rt/bindings/coloc/target/classes
[INFO] Deleting directory /x1/continuum/working-directory/216/rt/bindings/coloc/target/test-classes
[INFO] [checkstyle:checkstyle {execution: validate}]
[INFO] Starting audit...
Audit done.

[INFO] Preparing pmd:check
[INFO] [pmd:pmd]
[INFO] [pmd:check {execution: validate}]
[INFO] 
[INFO] [remote-resources:process {execution: default}]
[INFO] [resources:resources]
[INFO] Using default encoding to copy filtered resources.
[INFO] [compiler:compile]
[INFO] Compiling 7 source files to /x1/continuum/working-directory/216/rt/bindings/coloc/target/classes
[INFO] [resources:testResources]
[INFO] Using default encoding to copy filtered resources.
[INFO] [compiler:testCompile]
[INFO] Compiling 3 source files to /x1/continuum/working-directory/216/rt/bindings/coloc/target/test-classes
[INFO] [surefire:test]
[INFO] Surefire report directory: /x1/continuum/working-directory/216/rt/bindings/coloc/target/surefire-reports

-------------------------------------------------------
 T E S T S
-------------------------------------------------------
Running org.apache.cxf.binding.coloc.ColocMessageObserverTest
Tests run: 2, Failures: 0, Errors: 0, Skipped: 0, Time elapsed: 1.139 sec
Running org.apache.cxf.binding.coloc.ColocUtilTest
Tests run: 4, Failures: 0, Errors: 0, Skipped: 0, Time elapsed: 0.128 sec
Running org.apache.cxf.binding.coloc.ColocOutInterceptorTest
Tests run: 8, Failures: 0, Errors: 0, Skipped: 0, Time elapsed: 0.413 sec

Results :

Tests run: 14, Failures: 0, Errors: 0, Skipped: 0

[INFO] [jar:jar]
[INFO] Building jar: /x1/continuum/working-directory/216/rt/bindings/coloc/target/cxf-rt-bindings-coloc-2.0-incubator-RC-SNAPSHOT.jar
[INFO] [install:install]
[INFO] Installing /x1/continuum/working-directory/216/rt/bindings/coloc/target/cxf-rt-bindings-coloc-2.0-incubator-RC-SNAPSHOT.jar to /home/continuum/.m2/repository/org/apache/cxf/cxf-rt-bindings-coloc/2.0-incubator-RC-SNAPSHOT/cxf-rt-bindings-coloc-2.0-incubator-RC-SNAPSHOT.jar
[INFO] ----------------------------------------------------------------------------
[INFO] Building Apache CXF Runtime
[INFO]    task-segment: [clean, install]
[INFO] ----------------------------------------------------------------------------
[INFO] [clean:clean]
[INFO] Deleting directory /x1/continuum/working-directory/216/rt/target
[INFO] Deleting directory /x1/continuum/working-directory/216/rt/target/classes
[INFO] Deleting directory /x1/continuum/working-directory/216/rt/target/test-classes
[INFO] [site:attach-descriptor]
[INFO] [install:install]
[INFO] Installing /x1/continuum/working-directory/216/rt/pom.xml to /home/continuum/.m2/repository/org/apache/cxf/cxf-rt/2.0-incubator-RC-SNAPSHOT/cxf-rt-2.0-incubator-RC-SNAPSHOT.pom
[INFO] ----------------------------------------------------------------------------
[INFO] Building Apache CXF Runtime Bindings
[INFO]    task-segment: [clean, install]
[INFO] ----------------------------------------------------------------------------
[INFO] [clean:clean]
[INFO] Deleting directory /x1/continuum/working-directory/216/rt/bindings/target
[INFO] Deleting directory /x1/continuum/working-directory/216/rt/bindings/target/classes
[INFO] Deleting directory /x1/continuum/working-directory/216/rt/bindings/target/test-classes
[INFO] [site:attach-descriptor]
[INFO] [install:install]
[INFO] Installing /x1/continuum/working-directory/216/rt/bindings/pom.xml to /home/continuum/.m2/repository/org/apache/cxf/cxf-rt-bindings/2.0-incubator-RC-SNAPSHOT/cxf-rt-bindings-2.0-incubator-RC-SNAPSHOT.pom
[INFO] ----------------------------------------------------------------------------
[INFO] Building Apache CXF Runtime JavaScript Frontend
[INFO]    task-segment: [clean, install]
[INFO] ----------------------------------------------------------------------------
[INFO] [clean:clean]
[INFO] Deleting directory /x1/continuum/working-directory/216/rt/frontend/js/target
[INFO] Deleting directory /x1/continuum/working-directory/216/rt/frontend/js/target/classes
[INFO] Deleting directory /x1/continuum/working-directory/216/rt/frontend/js/target/test-classes
[INFO] [checkstyle:checkstyle {execution: validate}]
[INFO] Starting audit...
Audit done.

[INFO] Preparing pmd:check
[INFO] [pmd:pmd]
[INFO] [pmd:check {execution: validate}]
[INFO] 
[INFO] [remote-resources:process {execution: default}]
[INFO] [resources:resources]
[INFO] Using default encoding to copy filtered resources.
[INFO] [compiler:compile]
[INFO] Compiling 6 source files to /x1/continuum/working-directory/216/rt/frontend/js/target/classes
[INFO] [resources:testResources]
[INFO] Using default encoding to copy filtered resources.
[INFO] [compiler:testCompile]
[INFO] Compiling 3 source files to /x1/continuum/working-directory/216/rt/frontend/js/target/test-classes
[INFO] [surefire:test]
[INFO] Surefire report directory: /x1/continuum/working-directory/216/rt/frontend/js/target/surefire-reports

-------------------------------------------------------
 T E S T S
-------------------------------------------------------
Running org.apache.cxf.js.rhino.AbstractDOMProviderTest
Tests run: 7, Failures: 0, Errors: 0, Skipped: 0, Time elapsed: 0.501 sec
Running org.apache.cxf.js.rhino.ServerAppTest
Tests run: 13, Failures: 0, Errors: 0, Skipped: 0, Time elapsed: 0.356 sec
Running org.apache.cxf.js.rhino.ProviderFactoryTest
Tests run: 7, Failures: 0, Errors: 0, Skipped: 0, Time elapsed: 0.591 sec

Results :

Tests run: 27, Failures: 0, Errors: 0, Skipped: 0

[INFO] [jar:jar]
[INFO] Building jar: /x1/continuum/working-directory/216/rt/frontend/js/target/cxf-rt-frontend-js-2.0-incubator-RC-SNAPSHOT.jar
[INFO] [install:install]
[INFO] Installing /x1/continuum/working-directory/216/rt/frontend/js/target/cxf-rt-frontend-js-2.0-incubator-RC-SNAPSHOT.jar to /home/continuum/.m2/repository/org/apache/cxf/cxf-rt-frontend-js/2.0-incubator-RC-SNAPSHOT/cxf-rt-frontend-js-2.0-incubator-RC-SNAPSHOT.jar
[INFO] ----------------------------------------------------------------------------
[INFO] Building Apache CXF Runtime Management
[INFO]    task-segment: [clean, install]
[INFO] ----------------------------------------------------------------------------
[INFO] [clean:clean]
[INFO] Deleting directory /x1/continuum/working-directory/216/rt/management/target
[INFO] Deleting directory /x1/continuum/working-directory/216/rt/management/target/classes
[INFO] Deleting directory /x1/continuum/working-directory/216/rt/management/target/test-classes
[INFO] [checkstyle:checkstyle {execution: validate}]
[INFO] Starting audit...
Audit done.

[INFO] Preparing pmd:check
[INFO] [pmd:pmd]
[INFO] [pmd:check {execution: validate}]
[INFO] 
[INFO] [cxf-common-xsd:xsdtojava {execution: generate-sources}]
[INFO] [remote-resources:process {execution: default}]
[INFO] [resources:resources]
[INFO] Using default encoding to copy filtered resources.
[INFO] [compiler:compile]
[INFO] Compiling 10 source files to /x1/continuum/working-directory/216/rt/management/target/classes
[INFO] [resources:testResources]
[INFO] Using default encoding to copy filtered resources.
[INFO] [compiler:testCompile]
[INFO] Compiling 8 source files to /x1/continuum/working-directory/216/rt/management/target/test-classes
[INFO] [surefire:test]
[INFO] Surefire report directory: /x1/continuum/working-directory/216/rt/management/target/surefire-reports

-------------------------------------------------------
 T E S T S
-------------------------------------------------------
Running org.apache.cxf.management.jmx.MBServerConnectorTest
Tests run: 1, Failures: 0, Errors: 0, Skipped: 0, Time elapsed: 1.882 sec
Running org.apache.cxf.management.InstrumentationManagerTest
Tests run: 2, Failures: 0, Errors: 0, Skipped: 0, Time elapsed: 2.358 sec
Running org.apache.cxf.management.counters.CountersTest
Tests run: 1, Failures: 0, Errors: 0, Skipped: 0, Time elapsed: 0.02 sec
Running org.apache.cxf.management.jmx.export.ModelMBeanAssemblerTest
Tests run: 10, Failures: 0, Errors: 0, Skipped: 0, Time elapsed: 0.356 sec
Running org.apache.cxf.management.jmx.JMXManagedComponentManagerTest
Tests run: 2, Failures: 0, Errors: 0, Skipped: 0, Time elapsed: 4.147 sec

Results :

Tests run: 16, Failures: 0, Errors: 0, Skipped: 0

[INFO] [jar:jar]
[INFO] Building jar: /x1/continuum/working-directory/216/rt/management/target/cxf-rt-management-2.0-incubator-RC-SNAPSHOT.jar
[INFO] [install:install]
[INFO] Installing /x1/continuum/working-directory/216/rt/management/target/cxf-rt-management-2.0-incubator-RC-SNAPSHOT.jar to /home/continuum/.m2/repository/org/apache/cxf/cxf-rt-management/2.0-incubator-RC-SNAPSHOT/cxf-rt-management-2.0-incubator-RC-SNAPSHOT.jar
[INFO] ----------------------------------------------------------------------------
[INFO] Building Apache CXF Runtime JMS Transport
[INFO]    task-segment: [clean, install]
[INFO] ----------------------------------------------------------------------------
[INFO] [clean:clean]
[INFO] Deleting directory /x1/continuum/working-directory/216/rt/transports/jms/target
[INFO] Deleting directory /x1/continuum/working-directory/216/rt/transports/jms/target/classes
[INFO] Deleting directory /x1/continuum/working-directory/216/rt/transports/jms/target/test-classes
[INFO] [checkstyle:checkstyle {execution: validate}]
[INFO] Starting audit...
Audit done.

[INFO] Preparing pmd:check
[INFO] [pmd:pmd]
[INFO] [pmd:check {execution: validate}]
[INFO] 
[INFO] [remote-resources:process {execution: default}]
[INFO] [resources:resources]
[INFO] Using default encoding to copy filtered resources.
[INFO] [compiler:compile]
[INFO] Compiling 13 source files to /x1/continuum/working-directory/216/rt/transports/jms/target/classes
[INFO] [resources:testResources]
[INFO] Using default encoding to copy filtered resources.
[INFO] [compiler:testCompile]
[INFO] Compiling 6 source files to /x1/continuum/working-directory/216/rt/transports/jms/target/test-classes
[INFO] [surefire:test]
[INFO] Surefire report directory: /x1/continuum/working-directory/216/rt/transports/jms/target/surefire-reports

-------------------------------------------------------
 T E S T S
-------------------------------------------------------
Running org.apache.cxf.transport.jms.JMSConduitTest
Tests run: 3, Failures: 0, Errors: 0, Skipped: 0, Time elapsed: 13.637 sec
Running org.apache.cxf.transport.jms.PooledSessionTest
Tests run: 1, Failures: 0, Errors: 0, Skipped: 0, Time elapsed: 0.053 sec
Running org.apache.cxf.transport.jms.JMSDestinationTest
Tests run: 4, Failures: 0, Errors: 0, Skipped: 0, Time elapsed: 10.574 sec
Running org.apache.cxf.transport.jms.JMSUtilsTest
Tests run: 1, Failures: 0, Errors: 0, Skipped: 0, Time elapsed: 0.011 sec

Results :

Tests run: 9, Failures: 0, Errors: 0, Skipped: 0

[INFO] [jar:jar]
[INFO] Building jar: /x1/continuum/working-directory/216/rt/transports/jms/target/cxf-rt-transports-jms-2.0-incubator-RC-SNAPSHOT.jar
[INFO] [install:install]
[INFO] Installing /x1/continuum/working-directory/216/rt/transports/jms/target/cxf-rt-transports-jms-2.0-incubator-RC-SNAPSHOT.jar to /home/continuum/.m2/repository/org/apache/cxf/cxf-rt-transports-jms/2.0-incubator-RC-SNAPSHOT/cxf-rt-transports-jms-2.0-incubator-RC-SNAPSHOT.jar
[INFO] ----------------------------------------------------------------------------
[INFO] Building Apache CXF Runtime WS Policy
[INFO]    task-segment: [clean, install]
[INFO] ----------------------------------------------------------------------------
[INFO] [clean:clean]
[INFO] Deleting directory /x1/continuum/working-directory/216/rt/ws/policy/target
[INFO] Deleting directory /x1/continuum/working-directory/216/rt/ws/policy/target/classes
[INFO] Deleting directory /x1/continuum/working-directory/216/rt/ws/policy/target/test-classes
[INFO] [checkstyle:checkstyle {execution: validate}]
[INFO] Starting audit...
Audit done.

[INFO] Preparing pmd:check
[INFO] [pmd:pmd]
[INFO] [pmd:check {execution: validate}]
[INFO] 
[INFO] [cxf-common-xsd:xsdtojava {execution: generate-sources}]
[INFO] [remote-resources:process {execution: default}]
[INFO] [resources:resources]
[INFO] Using default encoding to copy filtered resources.
[INFO] [compiler:compile]
[INFO] Compiling 48 source files to /x1/continuum/working-directory/216/rt/ws/policy/target/classes
[INFO] [cxf-codegen:wsdl2java {execution: generate-test-sources}]
[INFO] [resources:testResources]
[INFO] Using default encoding to copy filtered resources.
[INFO] [compiler:testCompile]
[INFO] Compiling 29 source files to /x1/continuum/working-directory/216/rt/ws/policy/target/test-classes
[INFO] [surefire:test]
[INFO] Surefire report directory: /x1/continuum/working-directory/216/rt/ws/policy/target/surefire-reports

-------------------------------------------------------
 T E S T S
-------------------------------------------------------
Running org.apache.cxf.ws.policy.attachment.external.EndpointReferenceDomainExpressionTest
Tests run: 1, Failures: 0, Errors: 0, Skipped: 0, Time elapsed: 1.259 sec
Running org.apache.cxf.ws.policy.attachment.external.DomainExpressionBuilderRegistryTest
Tests run: 2, Failures: 0, Errors: 0, Skipped: 0, Time elapsed: 0.089 sec
Running org.apache.cxf.ws.policy.attachment.wsdl11.Wsdl11AttachmentPolicyProviderTest
Tests run: 7, Failures: 0, Errors: 0, Skipped: 0, Time elapsed: 3.619 sec
Running org.apache.cxf.ws.policy.PolicyVerificationInFaultInterceptorTest
Tests run: 1, Failures: 0, Errors: 0, Skipped: 0, Time elapsed: 0.606 sec
Running org.apache.cxf.ws.policy.PolicyInterceptorProviderRegistryImplTest
Tests run: 1, Failures: 0, Errors: 0, Skipped: 0, Time elapsed: 0.014 sec
Running org.apache.cxf.ws.policy.PolicyInterceptorsTest
Tests run: 8, Failures: 0, Errors: 0, Skipped: 0, Time elapsed: 0.54 sec
Running org.apache.cxf.ws.policy.PolicyTest
Tests run: 4, Failures: 0, Errors: 0, Skipped: 3, Time elapsed: 0.024 sec
Running org.apache.cxf.ws.policy.attachment.reference.ReferenceResolverTest
Tests run: 3, Failures: 0, Errors: 0, Skipped: 0, Time elapsed: 0.171 sec
Running org.apache.cxf.ws.policy.PolicyEngineTest
Tests run: 27, Failures: 0, Errors: 0, Skipped: 0, Time elapsed: 0.535 sec
Running org.apache.cxf.ws.policy.EffectivePolicyImplTest
Tests run: 9, Failures: 0, Errors: 0, Skipped: 0, Time elapsed: 0.129 sec
Running org.apache.cxf.ws.policy.PolicyVerificationInInterceptorTest
Tests run: 2, Failures: 0, Errors: 0, Skipped: 0, Time elapsed: 0.092 sec
Running org.apache.cxf.ws.policy.PolicyExtensionsTest
Tests run: 1, Failures: 0, Errors: 0, Skipped: 0, Time elapsed: 1.389 sec
Running org.apache.cxf.ws.policy.builder.primitive.NestedPrimitiveAssertionTest
Tests run: 3, Failures: 0, Errors: 0, Skipped: 0, Time elapsed: 0.317 sec
Running org.apache.cxf.ws.policy.attachment.external.ExternalAttachmentProviderTest
Tests run: 11, Failures: 0, Errors: 0, Skipped: 0, Time elapsed: 0.24 sec
Running org.apache.cxf.ws.policy.EndpointPolicyImplTest
Tests run: 8, Failures: 0, Errors: 0, Skipped: 0, Time elapsed: 0.195 sec
Running org.apache.cxf.ws.policy.attachment.external.PolicyAttachmentTest
Tests run: 6, Failures: 0, Errors: 0, Skipped: 0, Time elapsed: 0.051 sec
Running org.apache.cxf.ws.policy.PolicyRegistryImplTest
Tests run: 1, Failures: 0, Errors: 0, Skipped: 0, Time elapsed: 0.018 sec
Running org.apache.cxf.ws.policy.PolicyBuilderTest
Tests run: 3, Failures: 0, Errors: 0, Skipped: 0, Time elapsed: 0.101 sec
Running org.apache.cxf.ws.policy.PolicyVerificationOutInterceptorTest
Tests run: 1, Failures: 0, Errors: 0, Skipped: 0, Time elapsed: 0.055 sec
Running org.apache.cxf.ws.policy.NormalizeTest
Tests run: 1, Failures: 0, Errors: 0, Skipped: 0, Time elapsed: 0.309 sec

Results :

Tests run: 100, Failures: 0, Errors: 0, Skipped: 3

[INFO] [jar:jar]
[INFO] Building jar: /x1/continuum/working-directory/216/rt/ws/policy/target/cxf-rt-ws-policy-2.0-incubator-RC-SNAPSHOT.jar
[INFO] [install:install]
[INFO] Installing /x1/continuum/working-directory/216/rt/ws/policy/target/cxf-rt-ws-policy-2.0-incubator-RC-SNAPSHOT.jar to /home/continuum/.m2/repository/org/apache/cxf/cxf-rt-ws-policy/2.0-incubator-RC-SNAPSHOT/cxf-rt-ws-policy-2.0-incubator-RC-SNAPSHOT.jar
[INFO] ----------------------------------------------------------------------------
[INFO] Building Apache CXF Runtime WS Addressing
[INFO]    task-segment: [clean, install]
[INFO] ----------------------------------------------------------------------------
[INFO] [clean:clean]
[INFO] Deleting directory /x1/continuum/working-directory/216/rt/ws/addr/target
[INFO] Deleting directory /x1/continuum/working-directory/216/rt/ws/addr/target/classes
[INFO] Deleting directory /x1/continuum/working-directory/216/rt/ws/addr/target/test-classes
[INFO] [checkstyle:checkstyle {execution: validate}]
[INFO] Starting audit...
Audit done.

[INFO] Preparing pmd:check
[INFO] [pmd:pmd]
[INFO] [pmd:check {execution: validate}]
[INFO] 
[INFO] [remote-resources:process {execution: default}]
[INFO] [resources:resources]
[INFO] Using default encoding to copy filtered resources.
[INFO] [compiler:compile]
[INFO] Compiling 12 source files to /x1/continuum/working-directory/216/rt/ws/addr/target/classes
[INFO] [resources:testResources]
[INFO] Using default encoding to copy filtered resources.
[INFO] [compiler:testCompile]
[INFO] Compiling 5 source files to /x1/continuum/working-directory/216/rt/ws/addr/target/test-classes
[INFO] [surefire:test]
[INFO] Surefire report directory: /x1/continuum/working-directory/216/rt/ws/addr/target/surefire-reports

-------------------------------------------------------
 T E S T S
-------------------------------------------------------
Running org.apache.cxf.ws.addressing.AddressingBuilderImplTest
Tests run: 2, Failures: 0, Errors: 0, Skipped: 0, Time elapsed: 0.113 sec
Running org.apache.cxf.ws.addressing.soap.MAPCodecTest
Tests run: 12, Failures: 0, Errors: 0, Skipped: 0, Time elapsed: 1.533 sec
Running org.apache.cxf.ws.addressing.AddressingConstantsImplTest
Tests run: 33, Failures: 0, Errors: 0, Skipped: 0, Time elapsed: 0.094 sec
Running org.apache.cxf.ws.addressing.AddressingBuilderTest
Tests run: 1, Failures: 0, Errors: 0, Skipped: 0, Time elapsed: 0.005 sec
Running org.apache.cxf.ws.addressing.MAPAggregatorTest
Tests run: 24, Failures: 0, Errors: 0, Skipped: 0, Time elapsed: 1.019 sec

Results :

Tests run: 72, Failures: 0, Errors: 0, Skipped: 0

[INFO] [jar:jar]
[INFO] Building jar: /x1/continuum/working-directory/216/rt/ws/addr/target/cxf-rt-ws-addr-2.0-incubator-RC-SNAPSHOT.jar
[INFO] [install:install]
[INFO] Installing /x1/continuum/working-directory/216/rt/ws/addr/target/cxf-rt-ws-addr-2.0-incubator-RC-SNAPSHOT.jar to /home/continuum/.m2/repository/org/apache/cxf/cxf-rt-ws-addr/2.0-incubator-RC-SNAPSHOT/cxf-rt-ws-addr-2.0-incubator-RC-SNAPSHOT.jar
[INFO] ----------------------------------------------------------------------------
[INFO] Building Apache CXF Runtime WS Reliable Messaging
[INFO]    task-segment: [clean, install]
[INFO] ----------------------------------------------------------------------------
[INFO] [clean:clean]
[INFO] Deleting directory /x1/continuum/working-directory/216/rt/ws/rm/target
[INFO] Deleting directory /x1/continuum/working-directory/216/rt/ws/rm/target/classes
[INFO] Deleting directory /x1/continuum/working-directory/216/rt/ws/rm/target/test-classes
[INFO] [cobertura:clean {execution: default}]
[INFO] [checkstyle:checkstyle {execution: validate}]
[INFO] Starting audit...
Audit done.

[INFO] Preparing pmd:check
[INFO] [pmd:pmd]
[INFO] [pmd:check {execution: validate}]
[INFO] 
[INFO] [cxf-common-xsd:xsdtojava {execution: generate-sources}]
[INFO] [remote-resources:process {execution: default}]
[INFO] [resources:resources]
[INFO] Using default encoding to copy filtered resources.
[INFO] [compiler:compile]
[INFO] Compiling 55 source files to /x1/continuum/working-directory/216/rt/ws/rm/target/classes
[INFO] [resources:testResources]
[INFO] Using default encoding to copy filtered resources.
[INFO] [compiler:testCompile]
[INFO] Compiling 15 source files to /x1/continuum/working-directory/216/rt/ws/rm/target/test-classes
[INFO] [surefire:test]
[INFO] Surefire report directory: /x1/continuum/working-directory/216/rt/ws/rm/target/surefire-reports

-------------------------------------------------------
 T E S T S
-------------------------------------------------------
Running org.apache.cxf.ws.rm.AbstractRMInterceptorTest
Tests run: 3, Failures: 0, Errors: 0, Skipped: 0, Time elapsed: 0.952 sec
Running org.apache.cxf.ws.rm.AbstractEndpointTest
Tests run: 2, Failures: 0, Errors: 0, Skipped: 0, Time elapsed: 0.299 sec
Running org.apache.cxf.ws.rm.DestinationSequenceTest
Tests run: 18, Failures: 0, Errors: 0, Skipped: 0, Time elapsed: 3.38 sec
Running org.apache.cxf.ws.rm.RMContextUtilsTest
Tests run: 10, Failures: 0, Errors: 0, Skipped: 0, Time elapsed: 0.169 sec
Running org.apache.cxf.ws.rm.RMManagerTest
Tests run: 8, Failures: 0, Errors: 0, Skipped: 1, Time elapsed: 2.522 sec
Running org.apache.cxf.ws.rm.AbstractSequenceTest
Tests run: 1, Failures: 0, Errors: 0, Skipped: 0, Time elapsed: 0.011 sec
Running org.apache.cxf.ws.rm.policy.PolicyUtilsTest
Tests run: 3, Failures: 0, Errors: 0, Skipped: 0, Time elapsed: 0.334 sec
Running org.apache.cxf.ws.rm.RMEndpointTest
Tests run: 14, Failures: 0, Errors: 0, Skipped: 0, Time elapsed: 1.162 sec
Running org.apache.cxf.ws.rm.soap.RMSoapInterceptorTest
Tests run: 7, Failures: 0, Errors: 0, Skipped: 0, Time elapsed: 0.868 sec
Running org.apache.cxf.ws.rm.ProxyTest
Tests run: 11, Failures: 0, Errors: 0, Skipped: 0, Time elapsed: 0.819 sec
Running org.apache.cxf.ws.rm.DestinationTest
Tests run: 6, Failures: 0, Errors: 0, Skipped: 0, Time elapsed: 0.095 sec
Running org.apache.cxf.ws.rm.RMInInterceptorTest
Tests run: 13, Failures: 0, Errors: 0, Skipped: 0, Time elapsed: 0.235 sec
Running org.apache.cxf.ws.rm.RMOutInterceptorTest
Tests run: 2, Failures: 0, Errors: 0, Skipped: 0, Time elapsed: 0.088 sec
Running org.apache.cxf.ws.rm.soap.RetransmissionQueueImplTest
Tests run: 12, Failures: 0, Errors: 0, Skipped: 0, Time elapsed: 0.42 sec
Running org.apache.cxf.ws.rm.SourceSequenceTest
Tests run: 8, Failures: 0, Errors: 0, Skipped: 0, Time elapsed: 1.094 sec

Results :

Tests run: 118, Failures: 0, Errors: 0, Skipped: 1

[INFO] [jar:jar]
[INFO] Building jar: /x1/continuum/working-directory/216/rt/ws/rm/target/cxf-rt-ws-rm-2.0-incubator-RC-SNAPSHOT.jar
[INFO] [install:install]
[INFO] Installing /x1/continuum/working-directory/216/rt/ws/rm/target/cxf-rt-ws-rm-2.0-incubator-RC-SNAPSHOT.jar to /home/continuum/.m2/repository/org/apache/cxf/cxf-rt-ws-rm/2.0-incubator-RC-SNAPSHOT/cxf-rt-ws-rm-2.0-incubator-RC-SNAPSHOT.jar
[INFO] ----------------------------------------------------------------------------
[INFO] Building Apache CXF Runtime WS Security
[INFO]    task-segment: [clean, install]
[INFO] ----------------------------------------------------------------------------
[INFO] [clean:clean]
[INFO] Deleting directory /x1/continuum/working-directory/216/rt/ws/security/target
[INFO] Deleting directory /x1/continuum/working-directory/216/rt/ws/security/target/classes
[INFO] Deleting directory /x1/continuum/working-directory/216/rt/ws/security/target/test-classes
[INFO] [checkstyle:checkstyle {execution: validate}]
[INFO] Starting audit...
Audit done.

[INFO] Preparing pmd:check
[INFO] [pmd:pmd]
[INFO] [pmd:check {execution: validate}]
[INFO] 
Downloading: http://repo1.maven.org/maven2/wss4j/wss4j/1.5.1/wss4j-1.5.1.pom
[WARNING] Unable to get resource 'wss4j:wss4j:pom:1.5.1' from repository central (http://repo1.maven.org/maven2)
Downloading: http://repo1.maven.org/maven2/xml-security/xmlsec/1.3.0/xmlsec-1.3.0.pom
[WARNING] Unable to get resource 'xml-security:xmlsec:pom:1.3.0' from repository central (http://repo1.maven.org/maven2)
[WARNING] 
	Artifact active project artifact:
	artifact = org.apache.cxf:cxf-tools-common:jar:2.0-incubator-RC-SNAPSHOT:test;
	project: org.apache.maven.project.MavenProject@afbebeda retains local scope 'test' overriding broader scope 'compile'
	given by a dependency. If this is not intended, modify or remove the local scope.

[INFO] [remote-resources:process {execution: default}]
[INFO] [resources:resources]
[INFO] Using default encoding to copy filtered resources.
[INFO] [compiler:compile]
[INFO] Compiling 7 source files to /x1/continuum/working-directory/216/rt/ws/security/target/classes
[INFO] [resources:testResources]
[INFO] Using default encoding to copy filtered resources.
[INFO] [compiler:testCompile]
[INFO] Compiling 7 source files to /x1/continuum/working-directory/216/rt/ws/security/target/test-classes
[INFO] [surefire:test]
[INFO] Surefire report directory: /x1/continuum/working-directory/216/rt/ws/security/target/surefire-reports

-------------------------------------------------------
 T E S T S
-------------------------------------------------------
Running org.apache.cxf.ws.security.wss4j.RoundTripTest
Tests run: 3, Failures: 0, Errors: 0, Skipped: 0, Time elapsed: 41.932 sec
Running org.apache.cxf.ws.security.wss4j.WSS4JInOutTest
Tests run: 1, Failures: 0, Errors: 0, Skipped: 0, Time elapsed: 1.024 sec
Running org.apache.cxf.ws.security.wss4j.WSS4JOutInterceptorTest
Tests run: 4, Failures: 0, Errors: 0, Skipped: 0, Time elapsed: 3.656 sec

Results :

Tests run: 8, Failures: 0, Errors: 0, Skipped: 0

[INFO] [jar:jar]
[INFO] Building jar: /x1/continuum/working-directory/216/rt/ws/security/target/cxf-rt-ws-security-2.0-incubator-RC-SNAPSHOT.jar
[INFO] [install:install]
[INFO] Installing /x1/continuum/working-directory/216/rt/ws/security/target/cxf-rt-ws-security-2.0-incubator-RC-SNAPSHOT.jar to /home/continuum/.m2/repository/org/apache/cxf/cxf-rt-ws-security/2.0-incubator-RC-SNAPSHOT/cxf-rt-ws-security-2.0-incubator-RC-SNAPSHOT.jar
[INFO] ----------------------------------------------------------------------------
[INFO] Building Apache CXF JBI Integration
[INFO]    task-segment: [clean, install]
[INFO] ----------------------------------------------------------------------------
[INFO] [clean:clean]
[INFO] Deleting directory /x1/continuum/working-directory/216/integration/jbi/target
[INFO] Deleting directory /x1/continuum/working-directory/216/integration/jbi/target/classes
[INFO] Deleting directory /x1/continuum/working-directory/216/integration/jbi/target/test-classes
[INFO] [checkstyle:checkstyle {execution: validate}]
[INFO] Starting audit...
Audit done.

[INFO] Preparing pmd:check
[INFO] [pmd:pmd]
[INFO] [pmd:check {execution: validate}]
[INFO] 
[INFO] [remote-resources:process {execution: default}]
[INFO] [resources:resources]
[INFO] Using default encoding to copy filtered resources.
[INFO] [compiler:compile]
[INFO] Compiling 23 source files to /x1/continuum/working-directory/216/integration/jbi/target/classes
[INFO] [resources:testResources]
[INFO] Using default encoding to copy filtered resources.
[INFO] [compiler:testCompile]
[INFO] Compiling 6 source files to /x1/continuum/working-directory/216/integration/jbi/target/test-classes
[INFO] [surefire:test]
[INFO] Surefire report directory: /x1/continuum/working-directory/216/integration/jbi/target/surefire-reports

-------------------------------------------------------
 T E S T S
-------------------------------------------------------
Running org.apache.cxf.jbi.se.CXFServiceUnitManagerTest
Tests run: 20, Failures: 0, Errors: 0, Skipped: 0, Time elapsed: 20.05 sec
Running org.apache.cxf.jbi.se.CXFServiceUnitTest
Tests run: 5, Failures: 0, Errors: 0, Skipped: 0, Time elapsed: 3.128 sec
Running org.apache.cxf.jbi.se.state.ServiceEngineShutdownTest
Tests run: 4, Failures: 0, Errors: 0, Skipped: 0, Time elapsed: 0.041 sec
Running org.apache.cxf.jbi.se.state.ServiceEngineStartTest
Tests run: 4, Failures: 0, Errors: 0, Skipped: 0, Time elapsed: 0.016 sec
Running org.apache.cxf.jbi.se.state.ServiceEngineStateFactoryTest
Tests run: 2, Failures: 0, Errors: 0, Skipped: 0, Time elapsed: 0.006 sec
Running org.apache.cxf.jbi.se.state.ServiceEngineStopTest
Tests run: 4, Failures: 0, Errors: 0, Skipped: 0, Time elapsed: 0.017 sec

Results :

Tests run: 39, Failures: 0, Errors: 0, Skipped: 0

[INFO] [jar:jar]
[INFO] Building jar: /x1/continuum/working-directory/216/integration/jbi/target/cxf-integration-jbi-2.0-incubator-RC-SNAPSHOT.jar
[INFO] [install:install]
[INFO] Installing /x1/continuum/working-directory/216/integration/jbi/target/cxf-integration-jbi-2.0-incubator-RC-SNAPSHOT.jar to /home/continuum/.m2/repository/org/apache/cxf/cxf-integration-jbi/2.0-incubator-RC-SNAPSHOT/cxf-integration-jbi-2.0-incubator-RC-SNAPSHOT.jar
[INFO] ----------------------------------------------------------------------------
[INFO] Building Apache CXF JCA Connection
[INFO]    task-segment: [clean, install]
[INFO] ----------------------------------------------------------------------------
[INFO] [clean:clean]
[INFO] Deleting directory /x1/continuum/working-directory/216/integration/jca/target
[INFO] Deleting directory /x1/continuum/working-directory/216/integration/jca/target/classes
[INFO] Deleting directory /x1/continuum/working-directory/216/integration/jca/target/test-classes
[INFO] [checkstyle:checkstyle {execution: validate}]
[INFO] Starting audit...
Audit done.

[INFO] Preparing pmd:check
[INFO] [pmd:pmd]
[INFO] [pmd:check {execution: validate}]
[INFO] 
[INFO] [remote-resources:process {execution: default}]
[INFO] [resources:resources]
[INFO] Using default encoding to copy filtered resources.
[INFO] [compiler:compile]
[INFO] Compiling 35 source files to /x1/continuum/working-directory/216/integration/jca/target/classes
[INFO] [resources:testResources]
[INFO] Using default encoding to copy filtered resources.
[INFO] [compiler:testCompile]
[INFO] Compiling 35 source files to /x1/continuum/working-directory/216/integration/jca/target/test-classes
[INFO] [surefire:test]
[INFO] Surefire report directory: /x1/continuum/working-directory/216/integration/jca/target/surefire-reports

-------------------------------------------------------
 T E S T S
-------------------------------------------------------
Running org.apache.cxf.jca.servant.CXFConnectEJBServantTest
Tests run: 2, Failures: 0, Errors: 0, Skipped: 0, Time elapsed: 0.664 sec
Running org.apache.cxf.jca.core.logging.LoggerHelperTest
Tests run: 3, Failures: 0, Errors: 0, Skipped: 0, Time elapsed: 0.079 sec
Running org.apache.cxf.jca.cxf.handlers.ObjectMethodInvocationHandlerTest
Tests run: 9, Failures: 0, Errors: 0, Skipped: 0, Time elapsed: 0.034 sec
Running org.apache.cxf.jca.core.classloader.PlugInClassLoaderTest
Tests run: 10, Failures: 0, Errors: 0, Skipped: 0, Time elapsed: 0.212 sec
Running org.apache.cxf.jca.cxf.handlers.InvocationHandlerFactoryTest
Tests run: 2, Failures: 0, Errors: 0, Skipped: 0, Time elapsed: 0.017 sec
Running org.apache.cxf.jca.cxf.ConnectionFactoryImplTest
Tests run: 7, Failures: 0, Errors: 0, Skipped: 0, Time elapsed: 0.094 sec
Running org.apache.cxf.jca.cxf.AssociatedManagedConnectionFactoryImplTest
Tests run: 22, Failures: 0, Errors: 0, Skipped: 0, Time elapsed: 6.859 sec
Running org.apache.cxf.jca.core.resourceadapter.HandlerTest
Tests run: 2, Failures: 0, Errors: 0, Skipped: 0, Time elapsed: 0.009 sec
Running org.apache.cxf.jca.core.resourceadapter.ResourceAdapterInternalExceptionTest
Tests run: 6, Failures: 0, Errors: 0, Skipped: 0, Time elapsed: 0.028 sec
Running org.apache.cxf.jca.cxf.handlers.ProxyInvocationHandlerTest
Tests run: 6, Failures: 0, Errors: 0, Skipped: 0, Time elapsed: 2.259 sec
Running org.apache.cxf.jca.cxf.ManagedConnectionFactoryImplTest
Tests run: 18, Failures: 0, Errors: 0, Skipped: 0, Time elapsed: 2.961 sec
Running org.apache.cxf.jca.core.resourceadapter.ResourceBeanTest
Tests run: 1, Failures: 0, Errors: 0, Skipped: 0, Time elapsed: 0.013 sec
Running org.apache.cxf.jca.cxf.handlers.InvokingInvocationHandlerTest
Tests run: 6, Failures: 0, Errors: 0, Skipped: 0, Time elapsed: 0.024 sec
Running org.apache.cxf.jca.jarloader.JarLoaderTest
Tests run: 2, Failures: 0, Errors: 0, Skipped: 0, Time elapsed: 0.023 sec
Running org.apache.cxf.jca.core.resourceadapter.ManagedConnectionFactoryImplTest
Tests run: 8, Failures: 0, Errors: 0, Skipped: 0, Time elapsed: 0.139 sec
Running org.apache.cxf.jca.cxf.JCABusFactoryTest
Tests run: 13, Failures: 0, Errors: 0, Skipped: 0, Time elapsed: 28.004 sec
Running org.apache.cxf.jca.core.resourceadapter.ManagedConnectionImplTest
Tests run: 13, Failures: 0, Errors: 0, Skipped: 0, Time elapsed: 0.031 sec
Running org.apache.cxf.jca.core.resourceadapter.UriHandlerInitTest
Tests run: 1, Failures: 0, Errors: 0, Skipped: 0, Time elapsed: 0.009 sec
Running org.apache.cxf.jca.cxf.ManagedConnectionImplTest
Apr 13, 2007 8:26:34 AM org.apache.cxf.jca.core.resourceadapter.ResourceAdapterInternalException <init>
WARNING: java.lang.ClassCastException: $Proxy65
Tests run: 9, Failures: 0, Errors: 0, Skipped: 0, Time elapsed: 14.572 sec
Running org.apache.cxf.jca.cxf.CXFConnectionRequestInfoTest
Tests run: 1, Failures: 0, Errors: 0, Skipped: 0, Time elapsed: 0.003 sec
Running org.apache.cxf.jca.cxf.ResourceAdapterImplTest
Tests run: 9, Failures: 0, Errors: 0, Skipped: 0, Time elapsed: 0.072 sec

Results :

Tests run: 150, Failures: 0, Errors: 0, Skipped: 0

[INFO] [jar:jar]
[INFO] Building jar: /x1/continuum/working-directory/216/integration/jca/target/cxf-integration-jca-2.0-incubator-RC-SNAPSHOT.jar
[INFO] [install:install]
[INFO] Installing /x1/continuum/working-directory/216/integration/jca/target/cxf-integration-jca-2.0-incubator-RC-SNAPSHOT.jar to /home/continuum/.m2/repository/org/apache/cxf/cxf-integration-jca/2.0-incubator-RC-SNAPSHOT/cxf-integration-jca-2.0-incubator-RC-SNAPSHOT.jar
[INFO] ----------------------------------------------------------------------------
[INFO] Building Apache CXF Integration
[INFO]    task-segment: [clean, install]
[INFO] ----------------------------------------------------------------------------
[INFO] [clean:clean]
[INFO] Deleting directory /x1/continuum/working-directory/216/integration/target
[INFO] Deleting directory /x1/continuum/working-directory/216/integration/target/classes
[INFO] Deleting directory /x1/continuum/working-directory/216/integration/target/test-classes
[INFO] [site:attach-descriptor]
[INFO] [install:install]
[INFO] Installing /x1/continuum/working-directory/216/integration/pom.xml to /home/continuum/.m2/repository/org/apache/cxf/cxf-integration/2.0-incubator-RC-SNAPSHOT/cxf-integration-2.0-incubator-RC-SNAPSHOT.pom
[INFO] ----------------------------------------------------------------------------
[INFO] Building Apache CXF System Tests
[INFO]    task-segment: [clean, install]
[INFO] ----------------------------------------------------------------------------
[INFO] [clean:clean]
[INFO] Deleting directory /x1/continuum/working-directory/216/systests/target
[INFO] Deleting directory /x1/continuum/working-directory/216/systests/target/classes
[INFO] Deleting directory /x1/continuum/working-directory/216/systests/target/test-classes
[INFO] [checkstyle:checkstyle {execution: validate}]
[INFO] Starting audit...
Audit done.

[INFO] Preparing pmd:check
[INFO] [pmd:pmd]
[INFO] [pmd:check {execution: validate}]
[INFO] 
[INFO] [remote-resources:process {execution: default}]
[INFO] [resources:resources]
[INFO] Using default encoding to copy filtered resources.
[INFO] [compiler:compile]
[INFO] No sources to compile
[INFO] [resources:testResources]
[INFO] Using default encoding to copy filtered resources.
[INFO] [compiler:testCompile]
[INFO] Compiling 149 source files to /x1/continuum/working-directory/216/systests/target/test-classes
[INFO] [surefire:test]
[INFO] Surefire report directory: /x1/continuum/working-directory/216/systests/target/surefire-reports

-------------------------------------------------------
 T E S T S
-------------------------------------------------------
Running org.apache.cxf.systest.jaxws.ClientServerMiscTest
Tests run: 4, Failures: 0, Errors: 0, Skipped: 0, Time elapsed: 19.288 sec

Results :

Tests run: 4, Failures: 0, Errors: 0, Skipped: 0


-------------------------------------------------------
 T E S T S
-------------------------------------------------------
Running org.apache.cxf.systest.provider.AttachmentProviderXMLClientServerTest
Tests run: 1, Failures: 0, Errors: 0, Skipped: 0, Time elapsed: 12.069 sec

Results :

Tests run: 5, Failures: 0, Errors: 0, Skipped: 0


-------------------------------------------------------
 T E S T S
-------------------------------------------------------
Running org.apache.cxf.systest.ws.addressing.MAPTest
2007-04-13 08:28:18.285::INFO:  Logging to STDERR via org.mortbay.log.StdErrLog
2007-04-13 08:28:18.305::INFO:  jetty-6.1.2rc0
2007-04-13 08:28:18.413::INFO:  Started SelectChannelConnector @ 0.0.0.0:9999
Tests run: 7, Failures: 0, Errors: 0, Skipped: 2, Time elapsed: 25.198 sec

Results :

Tests run: 12, Failures: 0, Errors: 0, Skipped: 2


-------------------------------------------------------
 T E S T S
-------------------------------------------------------
Running org.apache.cxf.systest.dispatch.DispatchClientServerTest
Tests run: 8, Failures: 0, Errors: 0, Skipped: 0, Time elapsed: 24.814 sec

Results :

Tests run: 20, Failures: 0, Errors: 0, Skipped: 2


-------------------------------------------------------
 T E S T S
-------------------------------------------------------
Running org.apache.cxf.systest.mtom.MtomServerTest
2007-04-13 08:29:02.975::INFO:  Logging to STDERR via org.mortbay.log.StdErrLog
2007-04-13 08:29:03.010::INFO:  jetty-6.1.2rc0
2007-04-13 08:29:03.120::INFO:  Started SelectChannelConnector @ 0.0.0.0:9036
Tests run: 1, Failures: 0, Errors: 0, Skipped: 0, Time elapsed: 10.156 sec

Results :

Tests run: 21, Failures: 0, Errors: 0, Skipped: 2


-------------------------------------------------------
 T E S T S
-------------------------------------------------------
Running org.apache.cxf.systest.jaxws.ClientServerXMLTest
Tests run: 7, Failures: 0, Errors: 0, Skipped: 0, Time elapsed: 24.411 sec

Results :

Tests run: 28, Failures: 0, Errors: 0, Skipped: 2


-------------------------------------------------------
 T E S T S
-------------------------------------------------------
Running org.apache.cxf.systest.coloc.ColocHeaderRpcLitTest
2007-04-13 08:29:44.596::INFO:  Logging to STDERR via org.mortbay.log.StdErrLog
2007-04-13 08:29:44.640::INFO:  jetty-6.1.2rc0
2007-04-13 08:29:44.835::INFO:  Started SelectChannelConnector @ 0.0.0.0:9222
Tests run: 7, Failures: 0, Errors: 0, Skipped: 0, Time elapsed: 31.072 sec

Results :

Tests run: 35, Failures: 0, Errors: 0, Skipped: 2


-------------------------------------------------------
 T E S T S
-------------------------------------------------------
Running org.apache.cxf.systest.jaxws.ClientServerMixedStyleTest
Tests run: 1, Failures: 0, Errors: 0, Skipped: 0, Time elapsed: 19.487 sec

Results :

Tests run: 36, Failures: 0, Errors: 0, Skipped: 2


-------------------------------------------------------
 T E S T S
-------------------------------------------------------
Running org.apache.cxf.systest.servlet.SpringServletTest
Tests run: 1, Failures: 0, Errors: 0, Skipped: 0, Time elapsed: 9.181 sec

Results :

Tests run: 37, Failures: 0, Errors: 0, Skipped: 2


-------------------------------------------------------
 T E S T S
-------------------------------------------------------
Running org.apache.cxf.systest.type_test.soap.SOAPRpcLitClientTypeTest
Tests run: 176, Failures: 0, Errors: 0, Skipped: 0, Time elapsed: 43.929 sec

Results :

Tests run: 213, Failures: 0, Errors: 0, Skipped: 2


-------------------------------------------------------
 T E S T S
-------------------------------------------------------
Running org.apache.cxf.systest.coloc.ColocHeaderDocLitTest
2007-04-13 08:31:42.769::INFO:  Logging to STDERR via org.mortbay.log.StdErrLog
2007-04-13 08:31:42.796::INFO:  jetty-6.1.2rc0
2007-04-13 08:31:42.926::INFO:  Started SelectChannelConnector @ 0.0.0.0:9111
Tests run: 5, Failures: 0, Errors: 0, Skipped: 0, Time elapsed: 25.363 sec

Results :

Tests run: 218, Failures: 0, Errors: 0, Skipped: 2


-------------------------------------------------------
 T E S T S
-------------------------------------------------------
Running org.apache.cxf.systest.ws.policy.HTTPClientPolicyTest
Tests run: 1, Failures: 0, Errors: 0, Skipped: 0, Time elapsed: 23.897 sec

Results :

Tests run: 219, Failures: 0, Errors: 0, Skipped: 2


-------------------------------------------------------
 T E S T S
-------------------------------------------------------
Running org.apache.cxf.systest.basicDOCBare.DOCBareClientServerTest
Tests run: 2, Failures: 0, Errors: 0, Skipped: 0, Time elapsed: 14.267 sec

Results :

Tests run: 221, Failures: 0, Errors: 0, Skipped: 2


-------------------------------------------------------
 T E S T S
-------------------------------------------------------
Running org.apache.cxf.systest.dispatch.DispatchXMLClientServerTest
Tests run: 2, Failures: 0, Errors: 0, Skipped: 0, Time elapsed: 20.28 sec

Results :

Tests run: 223, Failures: 0, Errors: 0, Skipped: 2


-------------------------------------------------------
 T E S T S
-------------------------------------------------------
Running org.apache.cxf.systest.handlers.HandlerInvocationUsingAddNumbersTest
Tests run: 5, Failures: 0, Errors: 0, Skipped: 0, Time elapsed: 23.828 sec

Results :

Tests run: 228, Failures: 0, Errors: 0, Skipped: 2


-------------------------------------------------------
 T E S T S
-------------------------------------------------------
Running org.apache.cxf.systest.type_test.soap.SOAPDocLitClientTypeTest
Tests run: 176, Failures: 0, Errors: 0, Skipped: 0, Time elapsed: 48.233 sec

Results :

Tests run: 404, Failures: 0, Errors: 0, Skipped: 2


-------------------------------------------------------
 T E S T S
-------------------------------------------------------
Running org.apache.cxf.systest.ws.rm.DecoupledBareTest
2007-04-13 08:34:50.215::INFO:  Logging to STDERR via org.mortbay.log.StdErrLog
2007-04-13 08:34:50.235::INFO:  jetty-6.1.2rc0
2007-04-13 08:34:50.331::INFO:  Started SelectChannelConnector @ 0.0.0.0:9995
Tests run: 1, Failures: 0, Errors: 0, Skipped: 0, Time elapsed: 22.692 sec

Results :

Tests run: 405, Failures: 0, Errors: 0, Skipped: 2


-------------------------------------------------------
 T E S T S
-------------------------------------------------------
Running org.apache.cxf.systest.jaxws.LocatorClientServerTest
Tests run: 1, Failures: 0, Errors: 0, Skipped: 0, Time elapsed: 23.386 sec

Results :

Tests run: 406, Failures: 0, Errors: 0, Skipped: 2


-------------------------------------------------------
 T E S T S
-------------------------------------------------------
Running org.apache.cxf.systest.provider.ProviderXMLClientServerTest
Tests run: 1, Failures: 0, Errors: 0, Skipped: 0, Time elapsed: 20.595 sec

Results :

Tests run: 407, Failures: 0, Errors: 0, Skipped: 2


-------------------------------------------------------
 T E S T S
-------------------------------------------------------
Running org.apache.cxf.systest.handlers.HandlerInvocationTest
Tests run: 11, Failures: 0, Errors: 0, Skipped: 5, Time elapsed: 36.524 sec

Results :

Tests run: 418, Failures: 0, Errors: 0, Skipped: 7


-------------------------------------------------------
 T E S T S
-------------------------------------------------------
Running org.apache.cxf.systest.management.ManagedClientServerTest
running server in-process
2007-04-13 08:36:35.860::INFO:  Logging to STDERR via org.mortbay.log.StdErrLog
2007-04-13 08:36:35.879::INFO:  jetty-6.1.2rc0
2007-04-13 08:36:35.976::INFO:  Started SelectChannelConnector @ 0.0.0.0:9000
signal ready
server ready
ObjectName: org.apache.cxf:type=Bus.Service.Endpoint,Bus.ID=BUS.ID.cxf,Service="{http://apache.org/hello_world_soap_http}SOAPService",name="{http://apache.org/hello_world_soap_http}SoapPort"
server passed
Tests run: 1, Failures: 0, Errors: 0, Skipped: 0, Time elapsed: 10.669 sec

Results :

Tests run: 419, Failures: 0, Errors: 0, Skipped: 7


-------------------------------------------------------
 T E S T S
-------------------------------------------------------
Running org.apache.cxf.systest.jaxws.ClientServerRPCLitTest
Tests run: 2, Failures: 0, Errors: 0, Skipped: 0, Time elapsed: 20.435 sec

Results :

Tests run: 421, Failures: 0, Errors: 0, Skipped: 7


-------------------------------------------------------
 T E S T S
-------------------------------------------------------
Running org.apache.cxf.systest.management.ManagedBusTest
Tests run: 2, Failures: 0, Errors: 0, Skipped: 0, Time elapsed: 11.014 sec

Results :

Tests run: 423, Failures: 0, Errors: 0, Skipped: 7


-------------------------------------------------------
 T E S T S
-------------------------------------------------------
Running org.apache.cxf.systest.bus.SpringBusFactoryTest
Tests run: 1, Failures: 0, Errors: 0, Skipped: 0, Time elapsed: 6.645 sec

Results :

Tests run: 424, Failures: 0, Errors: 0, Skipped: 7


-------------------------------------------------------
 T E S T S
-------------------------------------------------------
Running org.apache.cxf.systest.jaxws.ClientServerGreeterNoWsdlTest
Tests run: 1, Failures: 0, Errors: 0, Skipped: 0, Time elapsed: 21.679 sec

Results :

Tests run: 425, Failures: 0, Errors: 0, Skipped: 7


-------------------------------------------------------
 T E S T S
-------------------------------------------------------
Running org.apache.cxf.systest.servlet.JsFrontEndServletTest
Tests run: 1, Failures: 0, Errors: 0, Skipped: 0, Time elapsed: 12.291 sec

Results :

Tests run: 426, Failures: 0, Errors: 0, Skipped: 7


-------------------------------------------------------
 T E S T S
-------------------------------------------------------
Running org.apache.cxf.systest.jaxws.ClientServerGreeterBaseTest
Tests run: 1, Failures: 0, Errors: 0, Skipped: 0, Time elapsed: 20.781 sec

Results :

Tests run: 427, Failures: 0, Errors: 0, Skipped: 7


-------------------------------------------------------
 T E S T S
-------------------------------------------------------
Running org.apache.cxf.systest.ws.policy.RMPolicyTest
2007-04-13 08:38:52.831::INFO:  Logging to STDERR via org.mortbay.log.StdErrLog
2007-04-13 08:38:52.858::INFO:  jetty-6.1.2rc0
2007-04-13 08:38:53.005::INFO:  Started SelectChannelConnector @ 0.0.0.0:9999
Tests run: 1, Failures: 0, Errors: 0, Skipped: 0, Time elapsed: 24.872 sec

Results :

Tests run: 428, Failures: 0, Errors: 0, Skipped: 7


-------------------------------------------------------
 T E S T S
-------------------------------------------------------
Running org.apache.cxf.systest.ws.rm.SequenceTest
2007-04-13 08:39:50.174::INFO:  Logging to STDERR via org.mortbay.log.StdErrLog
2007-04-13 08:39:50.203::INFO:  jetty-6.1.2rc0
2007-04-13 08:39:50.296::INFO:  Started SelectChannelConnector @ 0.0.0.0:9999
2007-04-13 08:40:30.522::INFO:  jetty-6.1.2rc0
2007-04-13 08:40:30.525::INFO:  Started SelectChannelConnector @ 0.0.0.0:9998
2007-04-13 08:40:37.566::INFO:  jetty-6.1.2rc0
2007-04-13 08:40:37.568::INFO:  Started SelectChannelConnector @ 0.0.0.0:9997
2007-04-13 08:40:44.592::INFO:  jetty-6.1.2rc0
2007-04-13 08:40:44.596::INFO:  Started SelectChannelConnector @ 0.0.0.0:9996
2007-04-13 08:40:52.777::INFO:  jetty-6.1.2rc0
2007-04-13 08:40:52.808::INFO:  Started SelectChannelConnector @ 0.0.0.0:9995
2007-04-13 08:41:18.467::INFO:  jetty-6.1.2rc0
2007-04-13 08:41:18.470::INFO:  Started SelectChannelConnector @ 0.0.0.0:9994
2007-04-13 08:41:28.924::INFO:  jetty-6.1.2rc0
2007-04-13 08:41:28.929::INFO:  Started SelectChannelConnector @ 0.0.0.0:9993
2007-04-13 08:41:38.876::INFO:  jetty-6.1.2rc0
2007-04-13 08:41:38.879::INFO:  Started SelectChannelConnector @ 0.0.0.0:9992
2007-04-13 08:41:44.515::INFO:  jetty-6.1.2rc0
2007-04-13 08:41:44.524::INFO:  Started SelectChannelConnector @ 0.0.0.0:9991
Tests run: 17, Failures: 0, Errors: 0, Skipped: 1, Time elapsed: 163.58 sec

Results :

Tests run: 445, Failures: 0, Errors: 0, Skipped: 8


-------------------------------------------------------
 T E S T S
-------------------------------------------------------
Running org.apache.cxf.systest.versioning.ClientServerVersioningTest
Tests run: 1, Failures: 0, Errors: 0, Skipped: 0, Time elapsed: 19.213 sec

Results :

Tests run: 446, Failures: 0, Errors: 0, Skipped: 8


-------------------------------------------------------
 T E S T S
-------------------------------------------------------
Running org.apache.cxf.systest.schema_validation.ValidationClientServerTest
Tests run: 1, Failures: 0, Errors: 0, Skipped: 0, Time elapsed: 21.05 sec

Results :

Tests run: 447, Failures: 0, Errors: 0, Skipped: 8


-------------------------------------------------------
 T E S T S
-------------------------------------------------------
Running org.apache.cxf.systest.js.JSClientServerTest
Tests run: 2, Failures: 0, Errors: 0, Skipped: 0, Time elapsed: 21.263 sec

Results :

Tests run: 449, Failures: 0, Errors: 0, Skipped: 8


-------------------------------------------------------
 T E S T S
-------------------------------------------------------
Running org.apache.cxf.systest.ws.policy.HTTPServerPolicyTest
Tests run: 1, Failures: 0, Errors: 0, Skipped: 0, Time elapsed: 19.603 sec

Results :

Tests run: 450, Failures: 0, Errors: 0, Skipped: 8


-------------------------------------------------------
 T E S T S
-------------------------------------------------------
Running org.apache.cxf.systest.provider.ProviderRPCClientServerTest
Tests run: 6, Failures: 0, Errors: 0, Skipped: 0, Time elapsed: 20.586 sec

Results :

Tests run: 456, Failures: 0, Errors: 0, Skipped: 8


-------------------------------------------------------
 T E S T S
-------------------------------------------------------
Running org.apache.cxf.systest.jca.OutBoundConnectionTest
Tests run: 1, Failures: 0, Errors: 0, Skipped: 0, Time elapsed: 23.55 sec

Results :

Tests run: 457, Failures: 0, Errors: 0, Skipped: 8


-------------------------------------------------------
 T E S T S
-------------------------------------------------------
Running org.apache.cxf.systest.handlers.TrivialSOAPHandlerTest
Tests run: 1, Failures: 0, Errors: 0, Skipped: 0, Time elapsed: 19.521 sec

Results :

Tests run: 458, Failures: 0, Errors: 0, Skipped: 8


-------------------------------------------------------
 T E S T S
-------------------------------------------------------
Running org.apache.cxf.systest.callback.CallbackClientServerTest
2007-04-13 08:44:52.830::INFO:  Logging to STDERR via org.mortbay.log.StdErrLog
2007-04-13 08:44:52.850::INFO:  jetty-6.1.2rc0
2007-04-13 08:44:52.949::INFO:  Started SelectChannelConnector @ 0.0.0.0:9005
Tests run: 1, Failures: 0, Errors: 0, Skipped: 0, Time elapsed: 21.72 sec

Results :

Tests run: 459, Failures: 0, Errors: 0, Skipped: 8


-------------------------------------------------------
 T E S T S
-------------------------------------------------------
Running org.apache.cxf.systest.mtom.ClientMtomXopTest
Tests run: 1, Failures: 0, Errors: 0, Skipped: 0, Time elapsed: 19.48 sec

Results :

Tests run: 460, Failures: 0, Errors: 0, Skipped: 8


-------------------------------------------------------
 T E S T S
-------------------------------------------------------
Running org.apache.cxf.systest.jaxws.ClientServerGreeterBaseNoWsdlTest
Tests run: 1, Failures: 0, Errors: 0, Skipped: 0, Time elapsed: 18.804 sec

Results :

Tests run: 461, Failures: 0, Errors: 0, Skipped: 8


-------------------------------------------------------
 T E S T S
-------------------------------------------------------
Running org.apache.cxf.systest.jms.JMSClientServerTest
Tests run: 5, Failures: 0, Errors: 0, Skipped: 0, Time elapsed: 30.613 sec

Results :

Tests run: 466, Failures: 0, Errors: 0, Skipped: 8


-------------------------------------------------------
 T E S T S
-------------------------------------------------------
Running org.apache.cxf.systest.rest.RestClientServerTest
Tests run: 4, Failures: 0, Errors: 0, Skipped: 0, Time elapsed: 17.508 sec

Results :

Tests run: 470, Failures: 0, Errors: 0, Skipped: 8


-------------------------------------------------------
 T E S T S
-------------------------------------------------------
Running org.apache.cxf.systest.ws.rm.DecoupledClientServerTest
2007-04-13 08:46:58.607::INFO:  Logging to STDERR via org.mortbay.log.StdErrLog
2007-04-13 08:46:58.638::INFO:  jetty-6.1.2rc0
2007-04-13 08:46:58.731::INFO:  Started SelectChannelConnector @ 0.0.0.0:9995
Tests run: 1, Failures: 0, Errors: 0, Skipped: 0, Time elapsed: 25.419 sec

Results :

Tests run: 471, Failures: 0, Errors: 0, Skipped: 8


-------------------------------------------------------
 T E S T S
-------------------------------------------------------
Running org.apache.cxf.systest.type_test.xml.XMLClientTypeTest
Tests run: 174, Failures: 0, Errors: 0, Skipped: 2, Time elapsed: 44.001 sec

Results :

Tests run: 645, Failures: 0, Errors: 0, Skipped: 10


-------------------------------------------------------
 T E S T S
-------------------------------------------------------
Running org.apache.cxf.systest.jaxws.ClientServerTest
running server in-process
2007-04-13 08:48:04.572::INFO:  Logging to STDERR via org.mortbay.log.StdErrLog
2007-04-13 08:48:04.596::INFO:  jetty-6.1.2rc0
2007-04-13 08:48:04.698::INFO:  Started SelectChannelConnector @ 0.0.0.0:9020
2007-04-13 08:48:05.148::INFO:  jetty-6.1.2rc0
2007-04-13 08:48:05.152::INFO:  Started SelectChannelConnector @ 0.0.0.0:9021
2007-04-13 08:48:05.314::INFO:  jetty-6.1.2rc0
2007-04-13 08:48:05.317::INFO:  Started SelectChannelConnector @ 0.0.0.0:9000
2007-04-13 08:48:05.447::INFO:  jetty-6.1.2rc0
2007-04-13 08:48:05.450::INFO:  Started SelectChannelConnector @ 0.0.0.0:7600
2007-04-13 08:48:05.598::INFO:  jetty-6.1.2rc0
2007-04-13 08:48:05.600::INFO:  Started SelectChannelConnector @ 0.0.0.0:9015
signal ready
server ready
the testNillable is invoked
the testNillable is invoked
*********  greetMeOneWay: Milestone-0
Bonjour
server passed
Tests run: 21, Failures: 0, Errors: 0, Skipped: 1, Time elapsed: 31.318 sec

Results :

Tests run: 666, Failures: 0, Errors: 0, Skipped: 11


-------------------------------------------------------
 T E S T S
-------------------------------------------------------
Running org.apache.cxf.systest.provider.ProviderClientServerTest
Tests run: 1, Failures: 0, Errors: 0, Skipped: 0, Time elapsed: 18.898 sec

Results :

Tests run: 667, Failures: 0, Errors: 0, Skipped: 11


-------------------------------------------------------
 T E S T S
-------------------------------------------------------
Running org.apache.cxf.systest.ws.policy.RMPolicyWsdlTest
2007-04-13 08:49:11.430::INFO:  Logging to STDERR via org.mortbay.log.StdErrLog
2007-04-13 08:49:11.449::INFO:  jetty-6.1.2rc0
2007-04-13 08:49:11.537::INFO:  Started SelectChannelConnector @ 0.0.0.0:9999
Tests run: 1, Failures: 0, Errors: 0, Skipped: 0, Time elapsed: 22.372 sec

Results :

Tests run: 668, Failures: 0, Errors: 0, Skipped: 11


-------------------------------------------------------
 T E S T S
-------------------------------------------------------
Running org.apache.cxf.systest.soap12.Soap12ClientServerTest
Tests run: 5, Failures: 0, Errors: 0, Skipped: 0, Time elapsed: 18.113 sec

Results :

Tests run: 673, Failures: 0, Errors: 0, Skipped: 11


-------------------------------------------------------
 T E S T S
-------------------------------------------------------
Running org.apache.cxf.systest.ws.policy.AddressingPolicyTest
2007-04-13 08:49:57.877::INFO:  Logging to STDERR via org.mortbay.log.StdErrLog
2007-04-13 08:49:57.905::INFO:  jetty-6.1.2rc0
2007-04-13 08:49:57.998::INFO:  Started SelectChannelConnector @ 0.0.0.0:9999
Tests run: 1, Failures: 0, Errors: 0, Skipped: 0, Time elapsed: 20.873 sec

Results :

Tests run: 674, Failures: 0, Errors: 0, Skipped: 11


-------------------------------------------------------
 T E S T S
-------------------------------------------------------
Running org.apache.cxf.systest.jaxws.OASISCatalogTest
Tests run: 4, Failures: 0, Errors: 0, Skipped: 0, Time elapsed: 7.626 sec

Results :

Tests run: 678, Failures: 0, Errors: 0, Skipped: 11


-------------------------------------------------------
 T E S T S
-------------------------------------------------------
Running org.apache.cxf.systest.ws.addressing.NonDecoupledTest
Tests run: 7, Failures: 0, Errors: 0, Skipped: 2, Time elapsed: 20.369 sec

Results :

Tests run: 685, Failures: 0, Errors: 0, Skipped: 13


-------------------------------------------------------
 T E S T S
-------------------------------------------------------
Running org.apache.cxf.systest.servlet.CXFServletTest
Tests run: 6, Failures: 0, Errors: 0, Skipped: 0, Time elapsed: 33.43 sec

Results :

Tests run: 691, Failures: 0, Errors: 0, Skipped: 13


-------------------------------------------------------
 T E S T S
-------------------------------------------------------
Running org.apache.cxf.systest.rest.RestClientServerHttpBindingTest
Tests run: 3, Failures: 0, Errors: 0, Skipped: 0, Time elapsed: 17.112 sec

Results :

Tests run: 694, Failures: 0, Errors: 0, Skipped: 13


-------------------------------------------------------
 T E S T S
-------------------------------------------------------
Running org.apache.cxf.systest.servlet.ExternalServicesServletTest
Tests run: 1, Failures: 0, Errors: 0, Skipped: 0, Time elapsed: 11.927 sec

Results :

Tests run: 695, Failures: 0, Errors: 0, Skipped: 13


-------------------------------------------------------
 T E S T S
-------------------------------------------------------
Running org.apache.cxf.systest.swa.ClientServerSwaTest
Tests run: 1, Failures: 0, Errors: 0, Skipped: 0, Time elapsed: 17.267 sec

Results :

Tests run: 696, Failures: 0, Errors: 0, Skipped: 13

[INFO] [jar:jar]
[INFO] Building jar: /x1/continuum/working-directory/216/systests/target/cxf-systests-2.0-incubator-RC-SNAPSHOT.jar
[INFO] [jar:test-jar {execution: attach-sources}]
[INFO] Building jar: /x1/continuum/working-directory/216/systests/target/cxf-systests-2.0-incubator-RC-SNAPSHOT-tests.jar
[INFO] [install:install]
[INFO] Installing /x1/continuum/working-directory/216/systests/target/cxf-systests-2.0-incubator-RC-SNAPSHOT.jar to /home/continuum/.m2/repository/org/apache/cxf/cxf-systests/2.0-incubator-RC-SNAPSHOT/cxf-systests-2.0-incubator-RC-SNAPSHOT.jar
[INFO] Installing /x1/continuum/working-directory/216/systests/target/cxf-systests-2.0-incubator-RC-SNAPSHOT-tests.jar to /home/continuum/.m2/repository/org/apache/cxf/cxf-systests/2.0-incubator-RC-SNAPSHOT/cxf-systests-2.0-incubator-RC-SNAPSHOT-tests.jar
[INFO] 
[INFO] 
[INFO] ------------------------------------------------------------------------
[INFO] Reactor Summary:
[INFO] ------------------------------------------------------------------------
[INFO] Apache CXF ............................................ SUCCESS [4.711s]
[INFO] Apache CXF Buildtools ................................. SUCCESS [4.582s]
[INFO] Apache CXF Parent ..................................... SUCCESS [11.644s]
[INFO] Apache CXF Common Utilities ........................... SUCCESS [37.884s]
[INFO] Apache CXF Common XSD2Java  Plugins ................... SUCCESS [11.826s]
[INFO] Apache CXF Common Schemas ............................. SUCCESS [5.886s]
[INFO] Apache CXF XJC Default Value Plugin ................... SUCCESS [8.889s]
[INFO] Apache CXF XJC Default Value Plugin Tests ............. SUCCESS [16.333s]
[INFO] Apache CXF XJC Plugins ................................ SUCCESS [0.941s]
[INFO] Apache CXF Common ..................................... SUCCESS [0.043s]
[INFO] Apache CXF API ........................................ SUCCESS [1:01.762s]
[INFO] Apache CXF Runtime Core ............................... SUCCESS [48.547s]
[INFO] Apache CXF Command Line Tools Common .................. SUCCESS [24.473s]
[INFO] Apache CXF Command Line Tools Validator ............... SUCCESS [22.434s]
[INFO] Apache CXF Command Line Tools WSDLTo Core ............. SUCCESS [14.469s]
[INFO] Apache CXF Command Line Tools WSDLTo JAXWS Frontend ... SUCCESS [24.187s]
[INFO] Apache CXF Command Line Tools WSDLTo JAXB Databinding . SUCCESS [9.561s]
[INFO] Apache CXF Command Line Tools WSDLTo Test ............. SUCCESS [2:38.384s]
[INFO] Apache CXF Command Line Tools WSDLTo Misctools ........ SUCCESS [36.951s]
[INFO] Apache CXF Command Line Tools ......................... SUCCESS [0.040s]
[INFO] Apache CXF Command Line Tools WSDLTo .................. SUCCESS [0.040s]
[INFO] Apache CXF Code Generation Maven2 Plugins ............. SUCCESS [11.267s]
[INFO] Apache CXF Test Utilities ............................. SUCCESS [1:46.954s]
[INFO] Apache CXF Runtime JAXB DataBinding ................... SUCCESS [32.574s]
[INFO] Apache CXF Runtime SOAP Binding ....................... SUCCESS [25.145s]
[INFO] Apache CXF Runtime XML Binding ........................ SUCCESS [22.408s]
[INFO] Apache CXF Runtime Local transport .................... SUCCESS [12.955s]
[INFO] Apache CXF Runtime Simple Frontend .................... SUCCESS [25.826s]
[INFO] Apache CXF Runtime JAX-WS Frontend .................... SUCCESS [1:59.759s]
[INFO] Apache CXF Command Line Tools JavaTo .................. SUCCESS [54.267s]
[INFO] Apache CXF Runtime HTTP transport ..................... SUCCESS [39.334s]
[INFO] Apache CXF Runtime HTTP Jetty transport ............... SUCCESS [30.986s]
[INFO] Apache CXF Runtime Aegis Databinding .................. SUCCESS [1:59.639s]
[INFO] Apache CXF Runtime HTTP Binding ....................... SUCCESS [40.064s]
[INFO] Apache CXF Runtime Object Binding ..................... SUCCESS [32.777s]
[INFO] Apache CXF Colocated Binding .......................... SUCCESS [15.289s]
[INFO] Apache CXF Runtime .................................... SUCCESS [0.050s]
[INFO] Apache CXF Runtime Bindings ........................... SUCCESS [0.055s]
[INFO] Apache CXF Runtime JavaScript Frontend ................ SUCCESS [15.855s]
[INFO] Apache CXF Runtime Management ......................... SUCCESS [25.427s]
[INFO] Apache CXF Runtime JMS Transport ...................... SUCCESS [41.573s]
[INFO] Apache CXF Runtime WS Policy .......................... SUCCESS [36.601s]
[INFO] Apache CXF Runtime WS Addressing ...................... SUCCESS [19.446s]
[INFO] Apache CXF Runtime WS Reliable Messaging .............. SUCCESS [38.696s]
[INFO] Apache CXF Runtime WS Security ........................ SUCCESS [1:02.734s]
[INFO] Apache CXF JBI Integration ............................ SUCCESS [41.131s]
[INFO] Apache CXF JCA Connection ............................. SUCCESS [1:19.086s]
[INFO] Apache CXF Integration ................................ SUCCESS [0.129s]
[INFO] Apache CXF System Tests ............................... SUCCESS [25:32.323s]
[INFO] ------------------------------------------------------------------------
[INFO] ------------------------------------------------------------------------
[INFO] BUILD SUCCESSFUL
[INFO] ------------------------------------------------------------------------
[INFO] Total time: 51 minutes 34 seconds
[INFO] Finished at: Fri Apr 13 08:52:08 PDT 2007
[INFO] Final Memory: 47M/63M
[INFO] ------------------------------------------------------------------------

****************************************************************************



Mime
View raw message