cxf-notifications mailing list archives

Site index · List index
Message view « Date » · « Thread »
Top « Date » · « Thread »
From "Continuum@vmbuild.apache.org" <cxf-notificati...@incubator.apache.org>
Subject [continuum] BUILD FAILURE: Apache CXF
Date Sat, 03 Mar 2007 02:44:32 GMT
Online report : http://vmbuild.apache.org/continuum/servlet/continuum/target/ProjectBuild.vm/view/ProjectBuild/id/216/buildId/67815
Build statistics:
  State: Failed
  Previous State: Failed
  Started at: Fri, 2 Mar 2007 18:44:28 -0800
  Finished at: Fri, 2 Mar 2007 18:44:32 -0800
  Total time: 4s
  Build Trigger: Forced
  Exit code: 1
  Building machine hostname: vmbuild.apache.org
  Operating system : Linux(unknown)
  Java version : 1.5.0_06(Sun Microsystems Inc.)

Changes
         dkulp          Fix for 2.3 with the non-standard modules

             /incubator/cxf/trunk/distribution/pom.xml
            /incubator/cxf/trunk/tools/eclipse-plugin/pom.xml
            /incubator/cxf/trunk/tools/eclipse3.1-plugin/pom.xml
           seanoc          Modified to check if InputStream can be got from jar: URL before
attempting to find the resource on the classpath.
Added a test for this.
             /incubator/cxf/trunk/common/common/src/main/java/org/apache/cxf/resource/URIResolver.java
            /incubator/cxf/trunk/common/common/src/test/java/org/apache/cxf/resource/URIResolverTest.java
            /incubator/cxf/trunk/common/common/src/test/java/org/apache/cxf/resource/resources
            /incubator/cxf/trunk/common/common/src/test/java/org/apache/cxf/resource/resources/helloworld.bpr
           seanoc          removed System.out
             /incubator/cxf/trunk/common/common/src/main/java/org/apache/cxf/resource/URIResolver.java
           dkulp          Fix not running the common/common tests

             /incubator/cxf/trunk/common/common/pom.xml
        
****************************************************************************
Output:
****************************************************************************
[INFO] Scanning for projects...
[INFO] ------------------------------------------------------------------------
[ERROR] BUILD FAILURE
[INFO] ------------------------------------------------------------------------
[INFO] Unable to build project '/x1/continuum/working-directory/216/pom.xml; it requires Maven
version 2.0.5
[INFO] ------------------------------------------------------------------------
[INFO] For more information, run Maven with the -e switch
[INFO] ------------------------------------------------------------------------
[INFO] Total time: 1 second
[INFO] Finished at: Fri Mar 02 18:44:32 PST 2007
[INFO] Final Memory: 1M/2M
[INFO] ------------------------------------------------------------------------

****************************************************************************



Mime
View raw message