cxf-notifications mailing list archives

Site index · List index
Message view « Date » · « Thread »
Top « Date » · « Thread »
From "Continuum@vmbuild.apache.org" <cxf-notificati...@incubator.apache.org>
Subject [continuum] BUILD FAILURE: Apache CXF System Tests
Date Wed, 28 Feb 2007 00:02:56 GMT
Online report : http://vmbuild.apache.org/continuum/servlet/continuum/target/ProjectBuild.vm/view/ProjectBuild/id/257/buildId/65009
Build statistics:
  State: Failed
  Previous State: Failed
  Started at: Tue, 27 Feb 2007 16:02:28 -0800
  Finished at: Tue, 27 Feb 2007 16:02:56 -0800
  Total time: 28s
  Build Trigger: Schedule
  Exit code: 1
  Building machine hostname: vmbuild.apache.org
  Operating system : Linux(unknown)
  Java version : 1.5.0_06(Sun Microsystems Inc.)

Changes
         dkulp          * Update to jaxws-api jar 2.1 (not sure if I'll keep this, may back
it out)
* Stub out methods for jaxws 2.1 (throw an exception for now)
* Update -Psetup.eclipse to just do the workspace stuff once (in top level)
* Remove all the topDirectoryLocation stuff
* Update prereq tag to say maven 2.0.5 is required


             /incubator/cxf/trunk/api/pom.xml
            /incubator/cxf/trunk/codegen-plugin/pom.xml
            /incubator/cxf/trunk/codegen-plugin2/pom.xml
            /incubator/cxf/trunk/common/common/pom.xml
            /incubator/cxf/trunk/common/pom.xml
            /incubator/cxf/trunk/common/schemas/pom.xml
            /incubator/cxf/trunk/common/xsd/pom.xml
            /incubator/cxf/trunk/distribution/pom.xml
            /incubator/cxf/trunk/integration/jbi/pom.xml
            /incubator/cxf/trunk/integration/jca/pom.xml
            /incubator/cxf/trunk/integration/pom.xml
            /incubator/cxf/trunk/metacode/pom.xml
            /incubator/cxf/trunk/parent/pom.xml
            /incubator/cxf/trunk/pom.xml
            /incubator/cxf/trunk/rt/bindings/http/pom.xml
            /incubator/cxf/trunk/rt/bindings/pom.xml
            /incubator/cxf/trunk/rt/bindings/soap/pom.xml
            /incubator/cxf/trunk/rt/bindings/xml/pom.xml
            /incubator/cxf/trunk/rt/core/pom.xml
            /incubator/cxf/trunk/rt/databinding/jaxb/pom.xml
            /incubator/cxf/trunk/rt/frontend/jaxws/pom.xml
            /incubator/cxf/trunk/rt/frontend/jaxws/src/main/java/org/apache/cxf/jaxws/BindingProviderImpl.java
            /incubator/cxf/trunk/rt/frontend/jaxws/src/main/java/org/apache/cxf/jaxws/EndpointImpl.java
            /incubator/cxf/trunk/rt/frontend/jaxws/src/main/java/org/apache/cxf/jaxws/JaxWsClientProxy.java
            /incubator/cxf/trunk/rt/frontend/jaxws/src/main/java/org/apache/cxf/jaxws/ServiceImpl.java
            /incubator/cxf/trunk/rt/frontend/jaxws/src/main/java/org/apache/cxf/jaxws/binding/BindingImpl.java
            /incubator/cxf/trunk/rt/frontend/jaxws/src/main/java/org/apache/cxf/jaxws/context/WebServiceContextImpl.java
            /incubator/cxf/trunk/rt/frontend/jaxws/src/main/java/org/apache/cxf/jaxws/spi/ProviderImpl.java
            /incubator/cxf/trunk/rt/frontend/js/pom.xml
            /incubator/cxf/trunk/rt/frontend/simple/pom.xml
            /incubator/cxf/trunk/rt/management/pom.xml
            /incubator/cxf/trunk/rt/pom.xml
            /incubator/cxf/trunk/rt/transports/http/pom.xml
            /incubator/cxf/trunk/rt/transports/http2/pom.xml
            /incubator/cxf/trunk/rt/transports/jms/pom.xml
            /incubator/cxf/trunk/rt/transports/local/pom.xml
            /incubator/cxf/trunk/rt/ws/addr/pom.xml
            /incubator/cxf/trunk/rt/ws/policy/pom.xml
            /incubator/cxf/trunk/rt/ws/rm/pom.xml
            /incubator/cxf/trunk/systests/pom.xml
            /incubator/cxf/trunk/testutils/pom.xml
            /incubator/cxf/trunk/tools/common/pom.xml
            /incubator/cxf/trunk/tools/eclipse-plugin/pom.xml
            /incubator/cxf/trunk/tools/eclipse3.1-plugin/pom.xml
            /incubator/cxf/trunk/tools/java2wsdl/pom.xml
            /incubator/cxf/trunk/tools/misctools/pom.xml
            /incubator/cxf/trunk/tools/pom.xml
            /incubator/cxf/trunk/tools/validator/pom.xml
            /incubator/cxf/trunk/tools/wsdl2java/pom.xml
            /incubator/cxf/trunk/tools/xjc/dv/pom.xml
            /incubator/cxf/trunk/tools/xjc/dv-test/pom.xml
            /incubator/cxf/trunk/tools/xjc/pom.xml
            /incubator/cxf/trunk/tools2/common/pom.xml
            /incubator/cxf/trunk/tools2/javato/pom.xml
            /incubator/cxf/trunk/tools2/pom.xml
            /incubator/cxf/trunk/tools2/validator/pom.xml
            /incubator/cxf/trunk/tools2/wsdlto/core/pom.xml
            /incubator/cxf/trunk/tools2/wsdlto/databinding/jaxb/pom.xml
            /incubator/cxf/trunk/tools2/wsdlto/frontend/jaxws/pom.xml
            /incubator/cxf/trunk/tools2/wsdlto/misc/pom.xml
            /incubator/cxf/trunk/tools2/wsdlto/pom.xml
            /incubator/cxf/trunk/tools2/wsdlto/test/pom.xml
        
****************************************************************************
Output:
****************************************************************************
[INFO] Scanning for projects...
[INFO] ----------------------------------------------------------------------------
[INFO] Building Apache CXF System Tests
[INFO]    task-segment: [install]
[INFO] ----------------------------------------------------------------------------
[INFO] Setting property: classpath.resource.loader.class => 'org.codehaus.plexus.velocity.ContextClassLoaderResourceLoader'.
[INFO] Setting property: velocimacro.messages.on => 'false'.
[INFO] Setting property: resource.loader => 'classpath'.
[INFO] Setting property: resource.manager.logwhenfound => 'false'.
[INFO] ************************************************************** 
[INFO] Starting Jakarta Velocity v1.4
[INFO] RuntimeInstance initializing.
[INFO] Default Properties File: org/apache/velocity/runtime/defaults/velocity.properties
[INFO] Default ResourceManager initializing. (class org.apache.velocity.runtime.resource.ResourceManagerImpl)
[INFO] Resource Loader Instantiated: org.codehaus.plexus.velocity.ContextClassLoaderResourceLoader
[INFO] ClasspathResourceLoader : initialization starting.
[INFO] ClasspathResourceLoader : initialization complete.
[INFO] ResourceCache : initialized. (class org.apache.velocity.runtime.resource.ResourceCacheImpl)
[INFO] Default ResourceManager initialization complete.
[INFO] Loaded System Directive: org.apache.velocity.runtime.directive.Literal
[INFO] Loaded System Directive: org.apache.velocity.runtime.directive.Macro
[INFO] Loaded System Directive: org.apache.velocity.runtime.directive.Parse
[INFO] Loaded System Directive: org.apache.velocity.runtime.directive.Include
[INFO] Loaded System Directive: org.apache.velocity.runtime.directive.Foreach
[INFO] Created: 20 parsers.
[INFO] Velocimacro : initialization starting.
[INFO] Velocimacro : adding VMs from VM library template : VM_global_library.vm
[ERROR] ResourceManager : unable to find resource 'VM_global_library.vm' in any resource loader.
[INFO] Velocimacro : error using  VM library template VM_global_library.vm : org.apache.velocity.exception.ResourceNotFoundException:
Unable to find resource 'VM_global_library.vm'
[INFO] Velocimacro :  VM library template macro registration complete.
[INFO] Velocimacro : allowInline = true : VMs can be defined inline in templates
[INFO] Velocimacro : allowInlineToOverride = false : VMs defined inline may NOT replace previous
VM definitions
[INFO] Velocimacro : allowInlineLocal = false : VMs defined inline will be  global in scope
if allowed.
[INFO] Velocimacro : initialization complete.
[INFO] Velocity successfully started.
[INFO] [checkstyle:checkstyle {execution: process-sources}]
[INFO] Starting audit...
Audit done.

[INFO] Preparing pmd:check
[INFO] [pmd:pmd]
[INFO] [pmd:check {execution: process-sources}]
[WARNING] POM for 'org.apache.cxf:cxf-tools-common:pom:2.0-incubator-RC-SNAPSHOT:compile'
is invalid. It will be ignored for artifact resolution. Reason: Failed to validate POM
[WARNING] POM for 'org.apache.cxf:cxf-common-utilities:pom:2.0-incubator-RC-SNAPSHOT:compile'
is invalid. It will be ignored for artifact resolution. Reason: Failed to validate POM
Downloading: http://repo1.maven.org/maven2/org/apache/geronimo/specs/geronimo-j2ee-management_1.0_spec/1.0/geronimo-j2ee-management_1.0_spec-1.0.pom
190b downloaded
Downloading: http://repo1.maven.org/maven2/org/apache/activemq/activeio-core/3.0.0-incubator/activeio-core-3.0.0-incubator.pom
[WARNING] Unable to get resource from repository central (http://repo1.maven.org/maven2)
[WARNING] POM for 'org.apache.cxf:cxf-api:pom:2.0-incubator-RC-SNAPSHOT:compile' is invalid.
It will be ignored for artifact resolution. Reason: Failed to validate POM
[WARNING] POM for 'org.apache.cxf:cxf-rt-frontend-jaxws:pom:2.0-incubator-RC-SNAPSHOT:compile'
is invalid. It will be ignored for artifact resolution. Reason: Failed to validate POM
[WARNING] POM for 'org.apache.cxf:cxf-rt-databinding-jaxb:pom:2.0-incubator-RC-SNAPSHOT:compile'
is invalid. It will be ignored for artifact resolution. Reason: Failed to validate POM
[WARNING] POM for 'org.apache.cxf:cxf-tools-validator:pom:2.0-incubator-RC-SNAPSHOT:compile'
is invalid. It will be ignored for artifact resolution. Reason: Failed to validate POM
[INFO] ------------------------------------------------------------------------
[ERROR] BUILD ERROR
[INFO] ------------------------------------------------------------------------
[INFO] Failed to resolve artifact.

Missing:
----------
1) org.apache.cxf:cxf-rt-transports-http:jar:2.0-incubator-RC-SNAPSHOT

  Try downloading the file manually from the project website.

  Then, install it using the command: 
      mvn install:install-file -DgroupId=org.apache.cxf -DartifactId=cxf-rt-transports-http
\
          -Dversion=2.0-incubator-RC-SNAPSHOT -Dpackaging=jar -Dfile=/path/to/file

  Path to dependency: 
  	1) org.apache.cxf:cxf-systests:jar:2.0-incubator-RC-SNAPSHOT
  	2) org.apache.cxf:cxf-rt-transports-http:jar:2.0-incubator-RC-SNAPSHOT

2) org.apache.cxf:cxf-rt-transports-local:jar:2.0-incubator-RC-SNAPSHOT

  Try downloading the file manually from the project website.

  Then, install it using the command: 
      mvn install:install-file -DgroupId=org.apache.cxf -DartifactId=cxf-rt-transports-local
\
          -Dversion=2.0-incubator-RC-SNAPSHOT -Dpackaging=jar -Dfile=/path/to/file

  Path to dependency: 
  	1) org.apache.cxf:cxf-systests:jar:2.0-incubator-RC-SNAPSHOT
  	2) org.apache.cxf:cxf-rt-transports-local:jar:2.0-incubator-RC-SNAPSHOT

3) org.apache.cxf:cxf-rt-transports-jms:jar:2.0-incubator-RC-SNAPSHOT

  Try downloading the file manually from the project website.

  Then, install it using the command: 
      mvn install:install-file -DgroupId=org.apache.cxf -DartifactId=cxf-rt-transports-jms
\
          -Dversion=2.0-incubator-RC-SNAPSHOT -Dpackaging=jar -Dfile=/path/to/file

  Path to dependency: 
  	1) org.apache.cxf:cxf-systests:jar:2.0-incubator-RC-SNAPSHOT
  	2) org.apache.cxf:cxf-rt-transports-jms:jar:2.0-incubator-RC-SNAPSHOT

4) org.apache.cxf:cxf-tools-java2wsdl:jar:2.0-incubator-RC-SNAPSHOT

  Try downloading the file manually from the project website.

  Then, install it using the command: 
      mvn install:install-file -DgroupId=org.apache.cxf -DartifactId=cxf-tools-java2wsdl \
          -Dversion=2.0-incubator-RC-SNAPSHOT -Dpackaging=jar -Dfile=/path/to/file

  Path to dependency: 
  	1) org.apache.cxf:cxf-systests:jar:2.0-incubator-RC-SNAPSHOT
  	2) org.apache.cxf:cxf-tools-java2wsdl:jar:2.0-incubator-RC-SNAPSHOT

5) org.apache.cxf:cxf-rt-ws-addr:jar:2.0-incubator-RC-SNAPSHOT

  Try downloading the file manually from the project website.

  Then, install it using the command: 
      mvn install:install-file -DgroupId=org.apache.cxf -DartifactId=cxf-rt-ws-addr \
          -Dversion=2.0-incubator-RC-SNAPSHOT -Dpackaging=jar -Dfile=/path/to/file

  Path to dependency: 
  	1) org.apache.cxf:cxf-systests:jar:2.0-incubator-RC-SNAPSHOT
  	2) org.apache.cxf:cxf-rt-ws-addr:jar:2.0-incubator-RC-SNAPSHOT

6) org.apache.cxf:cxf-rt-ws-rm:jar:2.0-incubator-RC-SNAPSHOT

  Try downloading the file manually from the project website.

  Then, install it using the command: 
      mvn install:install-file -DgroupId=org.apache.cxf -DartifactId=cxf-rt-ws-rm \
          -Dversion=2.0-incubator-RC-SNAPSHOT -Dpackaging=jar -Dfile=/path/to/file

  Path to dependency: 
  	1) org.apache.cxf:cxf-systests:jar:2.0-incubator-RC-SNAPSHOT
  	2) org.apache.cxf:cxf-rt-ws-rm:jar:2.0-incubator-RC-SNAPSHOT

7) org.apache.cxf:cxf-rt-ws-policy:jar:2.0-incubator-RC-SNAPSHOT

  Try downloading the file manually from the project website.

  Then, install it using the command: 
      mvn install:install-file -DgroupId=org.apache.cxf -DartifactId=cxf-rt-ws-policy \
          -Dversion=2.0-incubator-RC-SNAPSHOT -Dpackaging=jar -Dfile=/path/to/file

  Path to dependency: 
  	1) org.apache.cxf:cxf-systests:jar:2.0-incubator-RC-SNAPSHOT
  	2) org.apache.cxf:cxf-rt-ws-policy:jar:2.0-incubator-RC-SNAPSHOT

8) org.apache.cxf:cxf-rt-frontend-js:jar:2.0-incubator-RC-SNAPSHOT

  Try downloading the file manually from the project website.

  Then, install it using the command: 
      mvn install:install-file -DgroupId=org.apache.cxf -DartifactId=cxf-rt-frontend-js \
          -Dversion=2.0-incubator-RC-SNAPSHOT -Dpackaging=jar -Dfile=/path/to/file

  Path to dependency: 
  	1) org.apache.cxf:cxf-systests:jar:2.0-incubator-RC-SNAPSHOT
  	2) org.apache.cxf:cxf-rt-frontend-js:jar:2.0-incubator-RC-SNAPSHOT

9) org.apache.cxf:cxf-rt-management:jar:2.0-incubator-RC-SNAPSHOT

  Try downloading the file manually from the project website.

  Then, install it using the command: 
      mvn install:install-file -DgroupId=org.apache.cxf -DartifactId=cxf-rt-management \
          -Dversion=2.0-incubator-RC-SNAPSHOT -Dpackaging=jar -Dfile=/path/to/file

  Path to dependency: 
  	1) org.apache.cxf:cxf-systests:jar:2.0-incubator-RC-SNAPSHOT
  	2) org.apache.cxf:cxf-rt-management:jar:2.0-incubator-RC-SNAPSHOT

10) org.apache.cxf:cxf-rt-bindings-soap:jar:2.0-incubator-RC-SNAPSHOT

  Try downloading the file manually from the project website.

  Then, install it using the command: 
      mvn install:install-file -DgroupId=org.apache.cxf -DartifactId=cxf-rt-bindings-soap
\
          -Dversion=2.0-incubator-RC-SNAPSHOT -Dpackaging=jar -Dfile=/path/to/file

  Path to dependency: 
  	1) org.apache.cxf:cxf-systests:jar:2.0-incubator-RC-SNAPSHOT
  	2) org.apache.cxf:cxf-rt-bindings-soap:jar:2.0-incubator-RC-SNAPSHOT

11) org.apache.cxf:cxf-tools-misctools:jar:2.0-incubator-RC-SNAPSHOT

  Try downloading the file manually from the project website.

  Then, install it using the command: 
      mvn install:install-file -DgroupId=org.apache.cxf -DartifactId=cxf-tools-misctools \
          -Dversion=2.0-incubator-RC-SNAPSHOT -Dpackaging=jar -Dfile=/path/to/file

  Path to dependency: 
  	1) org.apache.cxf:cxf-systests:jar:2.0-incubator-RC-SNAPSHOT
  	2) org.apache.cxf:cxf-tools-misctools:jar:2.0-incubator-RC-SNAPSHOT

12) org.apache.cxf:cxf-rt-core:jar:2.0-incubator-RC-SNAPSHOT

  Try downloading the file manually from the project website.

  Then, install it using the command: 
      mvn install:install-file -DgroupId=org.apache.cxf -DartifactId=cxf-rt-core \
          -Dversion=2.0-incubator-RC-SNAPSHOT -Dpackaging=jar -Dfile=/path/to/file

  Path to dependency: 
  	1) org.apache.cxf:cxf-systests:jar:2.0-incubator-RC-SNAPSHOT
  	2) org.apache.cxf:cxf-rt-core:jar:2.0-incubator-RC-SNAPSHOT

13) org.apache.cxf:cxf-integration-jca:jar:2.0-incubator-RC-SNAPSHOT

  Try downloading the file manually from the project website.

  Then, install it using the command: 
      mvn install:install-file -DgroupId=org.apache.cxf -DartifactId=cxf-integration-jca \
          -Dversion=2.0-incubator-RC-SNAPSHOT -Dpackaging=jar -Dfile=/path/to/file

  Path to dependency: 
  	1) org.apache.cxf:cxf-systests:jar:2.0-incubator-RC-SNAPSHOT
  	2) org.apache.cxf:cxf-integration-jca:jar:2.0-incubator-RC-SNAPSHOT

----------
13 required artifacts are missing.

for artifact: 
  org.apache.cxf:cxf-systests:jar:2.0-incubator-RC-SNAPSHOT

from the specified remote repositories:
  central (http://repo1.maven.org/maven2)


[INFO] ------------------------------------------------------------------------
[INFO] For more information, run Maven with the -e switch
[INFO] ------------------------------------------------------------------------
[INFO] Total time: 24 seconds
[INFO] Finished at: Tue Feb 27 16:02:56 PST 2007
[INFO] Final Memory: 9M/20M
[INFO] ------------------------------------------------------------------------

****************************************************************************



Mime
View raw message