cxf-notifications mailing list archives

Site index · List index
Message view « Date » · « Thread »
Top « Date » · « Thread »
From "Continuum@vmbuild.apache.org" <cxf-notificati...@incubator.apache.org>
Subject [continuum] BUILD FAILURE: Apache CXF
Date Wed, 28 Feb 2007 11:00:45 GMT
Online report : http://vmbuild.apache.org/continuum/servlet/continuum/target/ProjectBuild.vm/view/ProjectBuild/id/216/buildId/65571
Build statistics:
  State: Failed
  Previous State: Failed
  Started at: Wed, 28 Feb 2007 03:00:41 -0800
  Finished at: Wed, 28 Feb 2007 03:00:45 -0800
  Total time: 3s
  Build Trigger: Schedule
  Exit code: 1
  Building machine hostname: vmbuild.apache.org
  Operating system : Linux(unknown)
  Java version : 1.5.0_06(Sun Microsystems Inc.)

Changes
         andreasmyth          Removed System.out.println left in MAPAggregator.
Suppressed policy verification for partial responses (server outbound and client inbound).
             /incubator/cxf/trunk/rt/ws/addr/src/main/java/org/apache/cxf/ws/addressing/MAPAggregator.java
            /incubator/cxf/trunk/rt/ws/policy/src/main/java/org/apache/cxf/ws/policy/PolicyVerificationInFaultInterceptor.java
            /incubator/cxf/trunk/rt/ws/policy/src/main/java/org/apache/cxf/ws/policy/PolicyVerificationInInterceptor.java
            /incubator/cxf/trunk/rt/ws/policy/src/main/java/org/apache/cxf/ws/policy/PolicyVerificationOutInterceptor.java
            /incubator/cxf/trunk/rt/ws/policy/src/test/java/org/apache/cxf/ws/policy/PolicyInterceptorsTest.java
            /incubator/cxf/trunk/rt/ws/policy/src/test/java/org/apache/cxf/ws/policy/PolicyVerificationOutInterceptorTest.java
        
****************************************************************************
Output:
****************************************************************************
[INFO] Scanning for projects...
[INFO] ------------------------------------------------------------------------
[ERROR] BUILD FAILURE
[INFO] ------------------------------------------------------------------------
[INFO] Unable to build project '/x1/continuum/working-directory/216/pom.xml; it requires Maven
version 2.0.5
[INFO] ------------------------------------------------------------------------
[INFO] For more information, run Maven with the -e switch
[INFO] ------------------------------------------------------------------------
[INFO] Total time: 1 second
[INFO] Finished at: Wed Feb 28 03:00:45 PST 2007
[INFO] Final Memory: 1M/2M
[INFO] ------------------------------------------------------------------------

****************************************************************************



Mime
View raw message