cxf-issues mailing list archives

Site index · List index
Message view « Date » · « Thread »
Top « Date » · « Thread »
From "Freeman Fang (JIRA)" <j...@apache.org>
Subject [jira] [Commented] (CXF-7270) CXF on java 9 build 159 fails
Date Tue, 14 Mar 2017 03:45:41 GMT

    [ https://issues.apache.org/jira/browse/CXF-7270?page=com.atlassian.jira.plugin.system.issuetabpanels:comment-tabpanel&focusedCommentId=15923504#comment-15923504
] 

Freeman Fang commented on CXF-7270:
-----------------------------------

failed test in ws-security module
Failed tests: 
  PolicyBasedWss4JInOutTest.testEncryptedPartsPolicyWithCompleteCoverage:302->AbstractPolicySecurityTest.runInInterceptorAndValidate:152->AbstractPolicySecurityTest.runInInterceptorAndValidate:171->AbstractPolicySecurityTest.runInInterceptorAndValidate:197->AbstractPolicySecurityTest.checkAssertion:242->Assert.assertTrue:41->Assert.fail:88
{http://docs.oasis-open.org/ws-sx/ws-securitypolicy/200702}EncryptedParts policy erroneously
failed.
Tests in error: 
  CryptoCoverageCheckerTest.testEncryptedSignedWithCompleteCoverage:170->runInterceptorAndValidate:220
» SoapFault
  CryptoCoverageCheckerTest.testEncryptedSignedWithIncompleteCoverage:160->runInterceptorAndValidate:220
» SoapFault
  CryptoCoverageCheckerTest.testEncryptedWithCompleteCoverage:136->runInterceptorAndValidate:223
» Runtime
  CryptoCoverageCheckerTest.testEncryptedWithIncompleteCoverage:112->runInterceptorAndValidate:223
» Runtime
  CryptoCoverageCheckerTest.testSignedWithCompleteCoverage:96->runInterceptorAndValidate:220
» SoapFault
  CryptoCoverageCheckerTest.testSignedWithIncompleteCoverage:71->runInterceptorAndValidate:223
» Runtime
  DefaultCryptoCoverageCheckerTest.testSignedWithCompleteCoverage:73->runInterceptorAndValidate:107
» SoapFault
  DefaultCryptoCoverageCheckerTest.testSignedWithIncompleteCoverage:48->runInterceptorAndValidate:110
» Runtime
  PolicyBasedWss4JInOutTest.testAsymmetricBindingAlgorithmSuitePolicy:62->AbstractPolicySecurityTest.runAndValidate:93->AbstractPolicySecurityTest.runAndValidate:122->AbstractPolicySecurityTest.runOutInterceptorAndValidate:281->AbstractPolicySecurityTest.runOutInterceptorAndValidate:291
» Fault
  PolicyBasedWss4JInOutTest.testContentEncryptedElementsPolicyWithCompleteCoverage:259->AbstractPolicySecurityTest.runAndValidate:93->AbstractPolicySecurityTest.runAndValidate:122->AbstractPolicySecurityTest.runOutInterceptorAndValidate:281->AbstractPolicySecurityTest.runOutInterceptorAndValidate:291
» Fault
  PolicyBasedWss4JInOutTest.testContentEncryptedElementsPolicyWithIncompleteCoverage:242->AbstractPolicySecurityTest.runInInterceptorAndValidate:152->AbstractPolicySecurityTest.runInInterceptorAndValidate:171->AbstractPolicySecurityTest.runInInterceptorAndValidate:185->AbstractPolicySecurityTest.runInInterceptorAndValidateWss:256
» IllegalArgument
  PolicyBasedWss4JInOutTest.testEncryptedElementsPolicyWithCompleteCoverage:214->AbstractPolicySecurityTest.runAndValidate:93->AbstractPolicySecurityTest.runAndValidate:122->AbstractPolicySecurityTest.runOutInterceptorAndValidate:281->AbstractPolicySecurityTest.runOutInterceptorAndValidate:291
» Fault
  PolicyBasedWss4JInOutTest.testEncryptedPartsPolicyWithIncompleteCoverage:278->AbstractPolicySecurityTest.runInInterceptorAndValidate:152->AbstractPolicySecurityTest.runInInterceptorAndValidate:171->AbstractPolicySecurityTest.runInInterceptorAndValidate:185->AbstractPolicySecurityTest.runInInterceptorAndValidateWss:256
» IllegalArgument
  PolicyBasedWss4JInOutTest.testEncryptedSignedPartsWithCompleteCoverage:416->AbstractPolicySecurityTest.runInInterceptorAndValidate:171->AbstractPolicySecurityTest.runInInterceptorAndValidate:185->AbstractPolicySecurityTest.runInInterceptorAndValidateWss:256
» SoapFault
  PolicyBasedWss4JInOutTest.testEncryptedSignedPartsWithIncompleteCoverage:406->AbstractPolicySecurityTest.runInInterceptorAndValidate:171->AbstractPolicySecurityTest.runInInterceptorAndValidate:185->AbstractPolicySecurityTest.runInInterceptorAndValidateWss:256
» SoapFault
  PolicyBasedWss4JInOutTest.testProtectTokenAssertion:484->AbstractPolicySecurityTest.runAndValidate:122->AbstractPolicySecurityTest.runOutInterceptorAndValidate:281->AbstractPolicySecurityTest.runOutInterceptorAndValidate:291
» Fault
  PolicyBasedWss4JInOutTest.testSignedElementsPolicyWithCompleteCoverage:43->AbstractPolicySecurityTest.runInInterceptorAndValidate:152->AbstractPolicySecurityTest.runInInterceptorAndValidate:171->AbstractPolicySecurityTest.runInInterceptorAndValidate:185->AbstractPolicySecurityTest.runInInterceptorAndValidateWss:256
» SoapFault
  PolicyBasedWss4JInOutTest.testSignedElementsWithIssuedSAMLToken:82->AbstractPolicySecurityTest.runOutInterceptorAndValidateSamlTokenAttached:362->AbstractPolicySecurityTest.runOutInterceptorAndValidate:291
» Fault
  PolicyBasedWss4JInOutTest.testSignedEncryptedPartsWithCompleteCoverage:383->AbstractPolicySecurityTest.runInInterceptorAndValidate:171->AbstractPolicySecurityTest.runInInterceptorAndValidate:185->AbstractPolicySecurityTest.runInInterceptorAndValidateWss:256
» SoapFault
  PolicyBasedWss4JInOutTest.testSignedEncryptedPartsWithIncompleteCoverage:369->AbstractPolicySecurityTest.runInInterceptorAndValidate:171->AbstractPolicySecurityTest.runInInterceptorAndValidate:185->AbstractPolicySecurityTest.runInInterceptorAndValidateWss:256
» SoapFault
  PolicyBasedWss4JInOutTest.testSignedPartsPolicyWithCompleteCoverage:112->AbstractPolicySecurityTest.runInInterceptorAndValidate:152->AbstractPolicySecurityTest.runInInterceptorAndValidate:171->AbstractPolicySecurityTest.runInInterceptorAndValidate:185->AbstractPolicySecurityTest.runInInterceptorAndValidateWss:256
» SoapFault
  SecurityActionTokenTest.testSignature:70->AbstractSecurityTest.makeInvocation:159 »
SoapFault
  SignatureConfirmationTest.testSignatureConfirmationRequest:116 » SoapFault A s...
  WSS4JFaultCodeTest.testSignedEncryptedSOAP12Fault:263 » SoapFault A security e...
  WSS4JInOutTest.testDirectReferenceSignature:133->AbstractSecurityTest.makeInvocation:159
» SoapFault
  WSS4JInOutTest.testPKIPath:418->AbstractSecurityTest.makeInvocation:159 » SoapFault
  WSS4JInOutTest.testSignature:105->AbstractSecurityTest.makeInvocation:159 » SoapFault
  WSS4JInOutTest.testUsernameTokenSignature:461->AbstractSecurityTest.makeInvocation:159
» SoapFault
  SamlTokenTest.testSaml1TokenHOK:283->makeInvocation:586 » SoapFault A security...
  SamlTokenTest.testSaml1TokenSignedSenderVouches:149->makeInvocation:586 » SoapFault
  SamlTokenTest.testSaml2TokenHOK:347->makeInvocation:586 » SoapFault A security...
  SamlTokenTest.testSaml2TokenSignedSenderVouches:228->makeInvocation:586 » SoapFault
  StaxToDOMSamlTest.testSaml1TokenHOK:432 » SOAPFault A security error was encou...
  StaxToDOMSamlTest.testSaml1TokenHOKConfig:485 » SOAPFault A security error was...
  StaxToDOMSamlTest.testSaml2TokenHOK:553 » SOAPFault A security error was encou...
  StaxToDOMSamlTest.testSaml2TokenHOKConfig:614 » SOAPFault A security error was...

All caused by the saaj/dom impl changes in latest JDK9 EA kit

> CXF on java 9 build 159 fails
> -----------------------------
>
>                 Key: CXF-7270
>                 URL: https://issues.apache.org/jira/browse/CXF-7270
>             Project: CXF
>          Issue Type: Bug
>          Components: JAX-WS Runtime
>            Reporter: John Poth
>            Assignee: Freeman Fang
>
> Tested with latest Java 9 build 159. To reproduce run in systests/jaxws
> {code}
> mvn clean install -Dtest=org.apache.cxf.systest.provider.ProviderClientServerTest#testSOAPMessageModeDocLit
> {code}
> {code}
> Tests run: 1, Failures: 1, Errors: 0, Skipped: 0, Time elapsed: 1.899 sec <<<
FAILURE! - in org.apache.cxf.systest.provider.ProviderClientServerTest
> testSOAPMessageModeDocLit(org.apache.cxf.systest.provider.ProviderClientServerTest) 
Time elapsed: 0.633 sec  <<< FAILURE!
> java.lang.AssertionError
>         at org.apache.cxf.systest.provider.ProviderClientServerTest.testSOAPMessageModeDocLit(ProviderClientServerTest.java:104)
> {code}
> Do we have a CI build for java 9 that runs all the tests? Thanks!



--
This message was sent by Atlassian JIRA
(v6.3.15#6346)

Mime
View raw message