cxf-issues mailing list archives

Site index · List index
Message view « Date » · « Thread »
Top « Date » · « Thread »
From "Robert Liguori (JIRA)" <j...@apache.org>
Subject [jira] Commented: (CXF-3089) -Peverything build fails against CXF 2.3
Date Sat, 23 Oct 2010 19:20:19 GMT

    [ https://issues.apache.org/jira/browse/CXF-3089?page=com.atlassian.jira.plugin.system.issuetabpanels:comment-tabpanel&focusedCommentId=12924229#action_12924229
] 

Robert Liguori commented on CXF-3089:
-------------------------------------

Hmmm... perhaps I'm in the wrong place as the help states, "The "distribution" stuff is in
the distribution module. At top level, you can run: $ mvn install -Peverything"

But, I tried this from the distribution folder... also with errors.


> -Peverything build fails against CXF 2.3
> ----------------------------------------
>
>                 Key: CXF-3089
>                 URL: https://issues.apache.org/jira/browse/CXF-3089
>             Project: CXF
>          Issue Type: Bug
>    Affects Versions: 2.3.0
>         Environment: Windows 7 Home Premium
> JDK 1.6, update 21
> Maven 3.0
> CXF 2.3
>            Reporter: Robert Liguori
>
> Issued commands:
>   set MAVEN_OPTS=-Xmx512M -XX:MaxPermSize=128M
>   mvn -e clean install -Peverything >everything.txt
> Build failed with the following output:
> [INFO] Error stacktraces are turned on.
> [INFO] Scanning for projects...
> [ERROR] The build could not read 3 projects -> [Help 1]
> org.apache.maven.project.ProjectBuildingException: Some problems were encountered while
processing the POMs:
> [FATAL] Non-resolvable parent POM: Failure to find org.apache.cxf.samples:cxf-samples:pom:2.3.0
in http://repo1.maven.org/maven2 was cached in the local repository, resolution will not be
reattempted until the update interval of central has elapsed or updates are forced and 'parent.relativePath'
points at wrong local POM @ line 23, column 13
> [FATAL] Non-resolvable parent POM: Failure to find org.apache.cxf.samples:cxf-samples:pom:2.3.0
in http://repo1.maven.org/maven2 was cached in the local repository, resolution will not be
reattempted until the update interval of central has elapsed or updates are forced and 'parent.relativePath'
points at wrong local POM @ line 23, column 13
> [FATAL] Non-resolvable parent POM: Failure to find org.apache.cxf.samples:cxf-samples:pom:2.3.0
in http://repo1.maven.org/maven2 was cached in the local repository, resolution will not be
reattempted until the update interval of central has elapsed or updates are forced and 'parent.relativePath'
points at wrong local POM @ line 23, column 13
> 	at org.apache.maven.project.DefaultProjectBuilder.build(DefaultProjectBuilder.java:325)
> 	at org.apache.maven.DefaultMaven.collectProjects(DefaultMaven.java:607)
> 	at org.apache.maven.DefaultMaven.getProjectsForMavenReactor(DefaultMaven.java:556)
> 	at org.apache.maven.DefaultMaven.doExecute(DefaultMaven.java:228)
> 	at org.apache.maven.DefaultMaven.execute(DefaultMaven.java:151)
> 	at org.apache.maven.cli.MavenCli.execute(MavenCli.java:445)
> 	at org.apache.maven.cli.MavenCli.doMain(MavenCli.java:168)
> 	at org.apache.maven.cli.MavenCli.main(MavenCli.java:132)
> 	at sun.reflect.NativeMethodAccessorImpl.invoke0(Native Method)
> 	at sun.reflect.NativeMethodAccessorImpl.invoke(NativeMethodAccessorImpl.java:39)
> 	at sun.reflect.DelegatingMethodAccessorImpl.invoke(DelegatingMethodAccessorImpl.java:25)
> 	at java.lang.reflect.Method.invoke(Method.java:597)
> 	at org.codehaus.plexus.classworlds.launcher.Launcher.launchEnhanced(Launcher.java:290)
> 	at org.codehaus.plexus.classworlds.launcher.Launcher.launch(Launcher.java:230)
> 	at org.codehaus.plexus.classworlds.launcher.Launcher.mainWithExitCode(Launcher.java:409)
> 	at org.codehaus.plexus.classworlds.launcher.Launcher.main(Launcher.java:352)
> [ERROR]   
> [ERROR]   The project org.apache.cxf.samples.interopfest:ws-sc:2.3.0 (C:\tmp\apache-cxf-2.3.0-src\distribution\src\main\release\samples\ws_security\interopfest\wssc\pom.xml)
has 1 error
> [ERROR]     Non-resolvable parent POM: Failure to find org.apache.cxf.samples:cxf-samples:pom:2.3.0
in http://repo1.maven.org/maven2 was cached in the local repository, resolution will not be
reattempted until the update interval of central has elapsed or updates are forced and 'parent.relativePath'
points at wrong local POM @ line 23, column 13 -> [Help 2]
> org.apache.maven.model.resolution.UnresolvableModelException: Failure to find org.apache.cxf.samples:cxf-samples:pom:2.3.0
in http://repo1.maven.org/maven2 was cached in the local repository, resolution will not be
reattempted until the update interval of central has elapsed or updates are forced
> 	at org.apache.maven.project.ProjectModelResolver.resolveModel(ProjectModelResolver.java:183)
> 	at org.apache.maven.model.building.DefaultModelBuilder.readParentExternally(DefaultModelBuilder.java:819)
> 	at org.apache.maven.model.building.DefaultModelBuilder.readParent(DefaultModelBuilder.java:691)
> 	at org.apache.maven.model.building.DefaultModelBuilder.build(DefaultModelBuilder.java:308)
> 	at org.apache.maven.model.building.DefaultModelBuilder.build(DefaultModelBuilder.java:232)
> 	at org.apache.maven.project.DefaultProjectBuilder.build(DefaultProjectBuilder.java:354)
> 	at org.apache.maven.project.DefaultProjectBuilder.build(DefaultProjectBuilder.java:417)
> 	at org.apache.maven.project.DefaultProjectBuilder.build(DefaultProjectBuilder.java:417)
> 	at org.apache.maven.project.DefaultProjectBuilder.build(DefaultProjectBuilder.java:417)
> 	at org.apache.maven.project.DefaultProjectBuilder.build(DefaultProjectBuilder.java:305)
> 	at org.apache.maven.DefaultMaven.collectProjects(DefaultMaven.java:607)
> 	at org.apache.maven.DefaultMaven.getProjectsForMavenReactor(DefaultMaven.java:556)
> 	at org.apache.maven.DefaultMaven.doExecute(DefaultMaven.java:228)
> 	at org.apache.maven.DefaultMaven.execute(DefaultMaven.java:151)
> 	at org.apache.maven.cli.MavenCli.execute(MavenCli.java:445)
> 	at org.apache.maven.cli.MavenCli.doMain(MavenCli.java:168)
> 	at org.apache.maven.cli.MavenCli.main(MavenCli.java:132)
> 	at sun.reflect.NativeMethodAccessorImpl.invoke0(Native Method)
> 	at sun.reflect.NativeMethodAccessorImpl.invoke(NativeMethodAccessorImpl.java:39)
> 	at sun.reflect.DelegatingMethodAccessorImpl.invoke(DelegatingMethodAccessorImpl.java:25)
> 	at java.lang.reflect.Method.invoke(Method.java:597)
> 	at org.codehaus.plexus.classworlds.launcher.Launcher.launchEnhanced(Launcher.java:290)
> 	at org.codehaus.plexus.classworlds.launcher.Launcher.launch(Launcher.java:230)
> 	at org.codehaus.plexus.classworlds.launcher.Launcher.mainWithExitCode(Launcher.java:409)
> 	at org.codehaus.plexus.classworlds.launcher.Launcher.main(Launcher.java:352)
> Caused by: org.sonatype.aether.resolution.ArtifactResolutionException: Failure to find
org.apache.cxf.samples:cxf-samples:pom:2.3.0 in http://repo1.maven.org/maven2 was cached in
the local repository, resolution will not be reattempted until the update interval of central
has elapsed or updates are forced
> 	at org.sonatype.aether.impl.internal.DefaultArtifactResolver.resolveArtifacts(DefaultArtifactResolver.java:488)
> 	at org.sonatype.aether.impl.internal.DefaultArtifactResolver.resolveArtifact(DefaultArtifactResolver.java:190)
> 	at org.apache.maven.project.ProjectModelResolver.resolveModel(ProjectModelResolver.java:179)
> 	... 24 more
> Caused by: org.sonatype.aether.transfer.ArtifactNotFoundException: Failure to find org.apache.cxf.samples:cxf-samples:pom:2.3.0
in http://repo1.maven.org/maven2 was cached in the local repository, resolution will not be
reattempted until the update interval of central has elapsed or updates are forced
> 	at org.sonatype.aether.impl.internal.DefaultUpdateCheckManager.checkArtifact(DefaultUpdateCheckManager.java:191)
> 	at org.sonatype.aether.impl.internal.DefaultArtifactResolver.resolveArtifacts(DefaultArtifactResolver.java:384)
> 	... 26 more
> [ERROR]   
> [ERROR]   The project org.apache.cxf.samples.interopfest:ws-sec10:2.3.0 (C:\tmp\apache-cxf-2.3.0-src\distribution\src\main\release\samples\ws_security\interopfest\wssec10\pom.xml)
has 1 error
> [ERROR]     Non-resolvable parent POM: Failure to find org.apache.cxf.samples:cxf-samples:pom:2.3.0
in http://repo1.maven.org/maven2 was cached in the local repository, resolution will not be
reattempted until the update interval of central has elapsed or updates are forced and 'parent.relativePath'
points at wrong local POM @ line 23, column 13 -> [Help 2]
> org.apache.maven.model.resolution.UnresolvableModelException: Failure to find org.apache.cxf.samples:cxf-samples:pom:2.3.0
in http://repo1.maven.org/maven2 was cached in the local repository, resolution will not be
reattempted until the update interval of central has elapsed or updates are forced
> 	at org.apache.maven.project.ProjectModelResolver.resolveModel(ProjectModelResolver.java:183)
> 	at org.apache.maven.model.building.DefaultModelBuilder.readParentExternally(DefaultModelBuilder.java:819)
> 	at org.apache.maven.model.building.DefaultModelBuilder.readParent(DefaultModelBuilder.java:691)
> 	at org.apache.maven.model.building.DefaultModelBuilder.build(DefaultModelBuilder.java:308)
> 	at org.apache.maven.model.building.DefaultModelBuilder.build(DefaultModelBuilder.java:232)
> 	at org.apache.maven.project.DefaultProjectBuilder.build(DefaultProjectBuilder.java:354)
> 	at org.apache.maven.project.DefaultProjectBuilder.build(DefaultProjectBuilder.java:417)
> 	at org.apache.maven.project.DefaultProjectBuilder.build(DefaultProjectBuilder.java:417)
> 	at org.apache.maven.project.DefaultProjectBuilder.build(DefaultProjectBuilder.java:417)
> 	at org.apache.maven.project.DefaultProjectBuilder.build(DefaultProjectBuilder.java:305)
> 	at org.apache.maven.DefaultMaven.collectProjects(DefaultMaven.java:607)
> 	at org.apache.maven.DefaultMaven.getProjectsForMavenReactor(DefaultMaven.java:556)
> 	at org.apache.maven.DefaultMaven.doExecute(DefaultMaven.java:228)
> 	at org.apache.maven.DefaultMaven.execute(DefaultMaven.java:151)
> 	at org.apache.maven.cli.MavenCli.execute(MavenCli.java:445)
> 	at org.apache.maven.cli.MavenCli.doMain(MavenCli.java:168)
> 	at org.apache.maven.cli.MavenCli.main(MavenCli.java:132)
> 	at sun.reflect.NativeMethodAccessorImpl.invoke0(Native Method)
> 	at sun.reflect.NativeMethodAccessorImpl.invoke(NativeMethodAccessorImpl.java:39)
> 	at sun.reflect.DelegatingMethodAccessorImpl.invoke(DelegatingMethodAccessorImpl.java:25)
> 	at java.lang.reflect.Method.invoke(Method.java:597)
> 	at org.codehaus.plexus.classworlds.launcher.Launcher.launchEnhanced(Launcher.java:290)
> 	at org.codehaus.plexus.classworlds.launcher.Launcher.launch(Launcher.java:230)
> 	at org.codehaus.plexus.classworlds.launcher.Launcher.mainWithExitCode(Launcher.java:409)
> 	at org.codehaus.plexus.classworlds.launcher.Launcher.main(Launcher.java:352)
> Caused by: org.sonatype.aether.resolution.ArtifactResolutionException: Failure to find
org.apache.cxf.samples:cxf-samples:pom:2.3.0 in http://repo1.maven.org/maven2 was cached in
the local repository, resolution will not be reattempted until the update interval of central
has elapsed or updates are forced
> 	at org.sonatype.aether.impl.internal.DefaultArtifactResolver.resolveArtifacts(DefaultArtifactResolver.java:488)
> 	at org.sonatype.aether.impl.internal.DefaultArtifactResolver.resolveArtifact(DefaultArtifactResolver.java:190)
> 	at org.apache.maven.project.ProjectModelResolver.resolveModel(ProjectModelResolver.java:179)
> 	... 24 more
> Caused by: org.sonatype.aether.transfer.ArtifactNotFoundException: Failure to find org.apache.cxf.samples:cxf-samples:pom:2.3.0
in http://repo1.maven.org/maven2 was cached in the local repository, resolution will not be
reattempted until the update interval of central has elapsed or updates are forced
> 	at org.sonatype.aether.impl.internal.DefaultUpdateCheckManager.checkArtifact(DefaultUpdateCheckManager.java:191)
> 	at org.sonatype.aether.impl.internal.DefaultArtifactResolver.resolveArtifacts(DefaultArtifactResolver.java:384)
> 	... 26 more
> [ERROR]   
> [ERROR]   The project org.apache.cxf.samples.interopfest:ws-sec11:2.3.0 (C:\tmp\apache-cxf-2.3.0-src\distribution\src\main\release\samples\ws_security\interopfest\wssec11\pom.xml)
has 1 error
> [ERROR]     Non-resolvable parent POM: Failure to find org.apache.cxf.samples:cxf-samples:pom:2.3.0
in http://repo1.maven.org/maven2 was cached in the local repository, resolution will not be
reattempted until the update interval of central has elapsed or updates are forced and 'parent.relativePath'
points at wrong local POM @ line 23, column 13 -> [Help 2]
> org.apache.maven.model.resolution.UnresolvableModelException: Failure to find org.apache.cxf.samples:cxf-samples:pom:2.3.0
in http://repo1.maven.org/maven2 was cached in the local repository, resolution will not be
reattempted until the update interval of central has elapsed or updates are forced
> 	at org.apache.maven.project.ProjectModelResolver.resolveModel(ProjectModelResolver.java:183)
> 	at org.apache.maven.model.building.DefaultModelBuilder.readParentExternally(DefaultModelBuilder.java:819)
> 	at org.apache.maven.model.building.DefaultModelBuilder.readParent(DefaultModelBuilder.java:691)
> 	at org.apache.maven.model.building.DefaultModelBuilder.build(DefaultModelBuilder.java:308)
> 	at org.apache.maven.model.building.DefaultModelBuilder.build(DefaultModelBuilder.java:232)
> 	at org.apache.maven.project.DefaultProjectBuilder.build(DefaultProjectBuilder.java:354)
> 	at org.apache.maven.project.DefaultProjectBuilder.build(DefaultProjectBuilder.java:417)
> 	at org.apache.maven.project.DefaultProjectBuilder.build(DefaultProjectBuilder.java:417)
> 	at org.apache.maven.project.DefaultProjectBuilder.build(DefaultProjectBuilder.java:417)
> 	at org.apache.maven.project.DefaultProjectBuilder.build(DefaultProjectBuilder.java:305)
> 	at org.apache.maven.DefaultMaven.collectProjects(DefaultMaven.java:607)
> 	at org.apache.maven.DefaultMaven.getProjectsForMavenReactor(DefaultMaven.java:556)
> 	at org.apache.maven.DefaultMaven.doExecute(DefaultMaven.java:228)
> 	at org.apache.maven.DefaultMaven.execute(DefaultMaven.java:151)
> 	at org.apache.maven.cli.MavenCli.execute(MavenCli.java:445)
> 	at org.apache.maven.cli.MavenCli.doMain(MavenCli.java:168)
> 	at org.apache.maven.cli.MavenCli.main(MavenCli.java:132)
> 	at sun.reflect.NativeMethodAccessorImpl.invoke0(Native Method)
> 	at sun.reflect.NativeMethodAccessorImpl.invoke(NativeMethodAccessorImpl.java:39)
> 	at sun.reflect.DelegatingMethodAccessorImpl.invoke(DelegatingMethodAccessorImpl.java:25)
> 	at java.lang.reflect.Method.invoke(Method.java:597)
> 	at org.codehaus.plexus.classworlds.launcher.Launcher.launchEnhanced(Launcher.java:290)
> 	at org.codehaus.plexus.classworlds.launcher.Launcher.launch(Launcher.java:230)
> 	at org.codehaus.plexus.classworlds.launcher.Launcher.mainWithExitCode(Launcher.java:409)
> 	at org.codehaus.plexus.classworlds.launcher.Launcher.main(Launcher.java:352)
> Caused by: org.sonatype.aether.resolution.ArtifactResolutionException: Failure to find
org.apache.cxf.samples:cxf-samples:pom:2.3.0 in http://repo1.maven.org/maven2 was cached in
the local repository, resolution will not be reattempted until the update interval of central
has elapsed or updates are forced
> 	at org.sonatype.aether.impl.internal.DefaultArtifactResolver.resolveArtifacts(DefaultArtifactResolver.java:488)
> 	at org.sonatype.aether.impl.internal.DefaultArtifactResolver.resolveArtifact(DefaultArtifactResolver.java:190)
> 	at org.apache.maven.project.ProjectModelResolver.resolveModel(ProjectModelResolver.java:179)
> 	... 24 more
> Caused by: org.sonatype.aether.transfer.ArtifactNotFoundException: Failure to find org.apache.cxf.samples:cxf-samples:pom:2.3.0
in http://repo1.maven.org/maven2 was cached in the local repository, resolution will not be
reattempted until the update interval of central has elapsed or updates are forced
> 	at org.sonatype.aether.impl.internal.DefaultUpdateCheckManager.checkArtifact(DefaultUpdateCheckManager.java:191)
> 	at org.sonatype.aether.impl.internal.DefaultArtifactResolver.resolveArtifacts(DefaultArtifactResolver.java:384)
> 	... 26 more
> [ERROR] 
> [ERROR] Re-run Maven using the -X switch to enable full debug logging.
> [ERROR] 
> [ERROR] For more information about the errors and possible solutions, please read the
following articles:
> [ERROR] [Help 1] http://cwiki.apache.org/confluence/display/MAVEN/ProjectBuildingException
> [ERROR] [Help 2] http://cwiki.apache.org/confluence/display/MAVEN/UnresolvableModelException

-- 
This message is automatically generated by JIRA.
-
You can reply to this email to add a comment to the issue online.


Mime
View raw message