cxf-issues mailing list archives

Site index · List index
Message view « Date » · « Thread »
Top « Date » · « Thread »
From "Jeff Zhang (JIRA)" <j...@apache.org>
Subject [jira] Commented: (CXF-1284) fix failed testcase on jdk1.6
Date Thu, 10 Jan 2008 09:04:34 GMT

    [ https://issues.apache.org/jira/browse/CXF-1284?page=com.atlassian.jira.plugin.system.issuetabpanels:comment-tabpanel&focusedCommentId=12557570#action_12557570
] 

Jeff Zhang commented on CXF-1284:
---------------------------------

In systemtest

testBasicConnection2: jaxws.ClientServerTest
testGetPortOneParam: jaxws.ClientServerTest

INFO: Interceptor has thrown exception, unwinding now
org.apache.cxf.interceptor.Fault: Connection refused: connect
	at org.apache.cxf.interceptor.AbstractOutDatabindingInterceptor.writeParts(AbstractOutDatabindingInterceptor.java:77)
	at org.apache.cxf.interceptor.BareOutInterceptor.handleMessage(BareOutInterceptor.java:68)
	at org.apache.cxf.phase.PhaseInterceptorChain.doIntercept(PhaseInterceptorChain.java:207)
	at org.apache.cxf.endpoint.ClientImpl.invoke(ClientImpl.java:276)
	at org.apache.cxf.endpoint.ClientImpl.invoke(ClientImpl.java:222)
	at org.apache.cxf.frontend.ClientProxy.invokeSync(ClientProxy.java:73)
	at org.apache.cxf.jaxws.JaxWsClientProxy.invoke(JaxWsClientProxy.java:142)
	at $Proxy43.greetMe(Unknown Source)
	at org.apache.cxf.systest.jaxws.ClientServerTest.testGetPortOneParam(ClientServerTest.java:231)
	at sun.reflect.NativeMethodAccessorImpl.invoke0(Native Method)
	at sun.reflect.NativeMethodAccessorImpl.invoke(NativeMethodAccessorImpl.java:39)
	at sun.reflect.DelegatingMethodAccessorImpl.invoke(DelegatingMethodAccessorImpl.java:25)
	at java.lang.reflect.Method.invoke(Method.java:597)
	at org.junit.internal.runners.TestMethodRunner.executeMethodBody(TestMethodRunner.java:99)
	at org.junit.internal.runners.TestMethodRunner.runUnprotected(TestMethodRunner.java:81)
	at org.junit.internal.runners.BeforeAndAfterRunner.runProtected(BeforeAndAfterRunner.java:34)
	at org.junit.internal.runners.TestMethodRunner.runMethod(TestMethodRunner.java:75)
	at org.junit.internal.runners.TestMethodRunner.run(TestMethodRunner.java:45)
	at org.junit.internal.runners.TestClassMethodsRunner.invokeTestMethod(TestClassMethodsRunner.java:66)
	at org.junit.internal.runners.TestClassMethodsRunner.run(TestClassMethodsRunner.java:35)
	at org.junit.internal.runners.TestClassRunner$1.runUnprotected(TestClassRunner.java:42)
	at org.junit.internal.runners.BeforeAndAfterRunner.runProtected(BeforeAndAfterRunner.java:34)
	at org.junit.internal.runners.TestClassRunner.run(TestClassRunner.java:52)
	at org.eclipse.jdt.internal.junit4.runner.JUnit4TestReference.run(JUnit4TestReference.java:38)
	at org.eclipse.jdt.internal.junit.runner.TestExecution.run(TestExecution.java:38)
	at org.eclipse.jdt.internal.junit.runner.RemoteTestRunner.runTests(RemoteTestRunner.java:460)
	at org.eclipse.jdt.internal.junit.runner.RemoteTestRunner.runTests(RemoteTestRunner.java:673)
	at org.eclipse.jdt.internal.junit.runner.RemoteTestRunner.run(RemoteTestRunner.java:386)
	at org.eclipse.jdt.internal.junit.runner.RemoteTestRunner.main(RemoteTestRunner.java:196)
Caused by: com.ctc.wstx.exc.WstxIOException: Connection refused: connect
	at com.ctc.wstx.sw.BaseStreamWriter.flush(BaseStreamWriter.java:313)
	at org.apache.cxf.interceptor.AbstractOutDatabindingInterceptor.writeParts(AbstractOutDatabindingInterceptor.java:75)
	... 28 more
Caused by: java.net.ConnectException: Connection refused: connect
	at java.net.PlainSocketImpl.socketConnect(Native Method)
	at java.net.PlainSocketImpl.doConnect(PlainSocketImpl.java:333)
	at java.net.PlainSocketImpl.connectToAddress(PlainSocketImpl.java:195)
	at java.net.PlainSocketImpl.connect(PlainSocketImpl.java:182)
	at java.net.Socket.connect(Socket.java:519)
	at sun.net.NetworkClient.doConnect(NetworkClient.java:152)
	at sun.net.www.http.HttpClient.openServer(HttpClient.java:394)
	at sun.net.www.http.HttpClient.openServer(HttpClient.java:529)
	at sun.net.www.http.HttpClient.<init>(HttpClient.java:233)
	at sun.net.www.http.HttpClient.New(HttpClient.java:306)
	at sun.net.www.http.HttpClient.New(HttpClient.java:323)
	at sun.net.www.protocol.http.HttpURLConnection.getNewHttpClient(HttpURLConnection.java:788)
	at sun.net.www.protocol.http.HttpURLConnection.plainConnect(HttpURLConnection.java:729)
	at sun.net.www.protocol.http.HttpURLConnection.connect(HttpURLConnection.java:654)
	at sun.net.www.protocol.http.HttpURLConnection.getOutputStream(HttpURLConnection.java:832)
	at org.apache.cxf.transport.http.HTTPConduit$WrappedOutputStream.handleHeadersTrustCaching(HTTPConduit.java:1766)
	at org.apache.cxf.transport.http.HTTPConduit$WrappedOutputStream.onFirstWrite(HTTPConduit.java:1734)
	at org.apache.cxf.io.AbstractWrappedOutputStream.write(AbstractWrappedOutputStream.java:42)
	at com.ctc.wstx.io.UTF8Writer.flush(UTF8Writer.java:96)
	at com.ctc.wstx.sw.BufferingXmlWriter.flush(BufferingXmlWriter.java:214)
	at com.ctc.wstx.sw.BaseStreamWriter.flush(BaseStreamWriter.java:311)
	... 29 more

==============================

testDOMSourcePAYLOAD: ProviderXMLClientServerTest

        Dispatch<DOMSource> disp = service.createDispatch(portName,
                DOMSource.class, Service.Mode.PAYLOAD);
        DOMSource result = disp.invoke(reqMsg);
        assertNotNull(result);

This is related with stax parser.

Jan 10, 2008 4:19:30 PM org.apache.cxf.phase.PhaseInterceptorChain doIntercept
INFO: Interceptor has thrown exception, unwinding now
org.apache.cxf.interceptor.Fault: Could not parse the XML stream.
	at org.apache.cxf.jaxws.interceptors.DispatchInDatabindingInterceptor.handleMessage(DispatchInDatabindingInterceptor.java:171)
	at org.apache.cxf.phase.PhaseInterceptorChain.doIntercept(PhaseInterceptorChain.java:207)
	at org.apache.cxf.jaxws.DispatchImpl.onMessage(DispatchImpl.java:330)
	at org.apache.cxf.transport.http.HTTPConduit$WrappedOutputStream.handleResponse(HTTPConduit.java:1955)
	at org.apache.cxf.transport.http.HTTPConduit$WrappedOutputStream.close(HTTPConduit.java:1791)
	at org.apache.cxf.transport.AbstractConduit.close(AbstractConduit.java:66)
	at org.apache.cxf.transport.http.HTTPConduit.close(HTTPConduit.java:575)
	at org.apache.cxf.interceptor.MessageSenderInterceptor$MessageSenderEndingInterceptor.handleMessage(MessageSenderInterceptor.java:62)
	at org.apache.cxf.phase.PhaseInterceptorChain.doIntercept(PhaseInterceptorChain.java:207)
	at org.apache.cxf.jaxws.DispatchImpl.invoke(DispatchImpl.java:179)
	at org.apache.cxf.jaxws.DispatchImpl.invoke(DispatchImpl.java:124)
	at org.apache.cxf.systest.provider.ProviderXMLClientServerTest.testDOMSourcePAYLOAD(ProviderXMLClientServerTest.java:68)
	at sun.reflect.NativeMethodAccessorImpl.invoke0(Native Method)
	at sun.reflect.NativeMethodAccessorImpl.invoke(NativeMethodAccessorImpl.java:39)
	at sun.reflect.DelegatingMethodAccessorImpl.invoke(DelegatingMethodAccessorImpl.java:25)
	at java.lang.reflect.Method.invoke(Method.java:597)
	at org.junit.internal.runners.TestMethodRunner.executeMethodBody(TestMethodRunner.java:99)
	at org.junit.internal.runners.TestMethodRunner.runUnprotected(TestMethodRunner.java:81)
	at org.junit.internal.runners.BeforeAndAfterRunner.runProtected(BeforeAndAfterRunner.java:34)
	at org.junit.internal.runners.TestMethodRunner.runMethod(TestMethodRunner.java:75)
	at org.junit.internal.runners.TestMethodRunner.run(TestMethodRunner.java:45)
	at org.junit.internal.runners.TestClassMethodsRunner.invokeTestMethod(TestClassMethodsRunner.java:66)
	at org.junit.internal.runners.TestClassMethodsRunner.run(TestClassMethodsRunner.java:35)
	at org.junit.internal.runners.TestClassRunner$1.runUnprotected(TestClassRunner.java:42)
	at org.junit.internal.runners.BeforeAndAfterRunner.runProtected(BeforeAndAfterRunner.java:34)
	at org.junit.internal.runners.TestClassRunner.run(TestClassRunner.java:52)
	at org.eclipse.jdt.internal.junit4.runner.JUnit4TestReference.run(JUnit4TestReference.java:38)
	at org.eclipse.jdt.internal.junit.runner.TestExecution.run(TestExecution.java:38)
	at org.eclipse.jdt.internal.junit.runner.RemoteTestRunner.runTests(RemoteTestRunner.java:460)
	at org.eclipse.jdt.internal.junit.runner.RemoteTestRunner.runTests(RemoteTestRunner.java:673)
	at org.eclipse.jdt.internal.junit.runner.RemoteTestRunner.run(RemoteTestRunner.java:386)
	at org.eclipse.jdt.internal.junit.runner.RemoteTestRunner.main(RemoteTestRunner.java:196)
Caused by: org.apache.cxf.interceptor.Fault: Could not parse the XML stream.
	at org.apache.cxf.databinding.source.XMLStreamDataReader.read(XMLStreamDataReader.java:100)
	at org.apache.cxf.databinding.source.XMLStreamDataReader.read(XMLStreamDataReader.java:90)
	at org.apache.cxf.databinding.source.XMLStreamDataReader.read(XMLStreamDataReader.java:48)
	at org.apache.cxf.jaxws.interceptors.DispatchInDatabindingInterceptor.handleMessage(DispatchInDatabindingInterceptor.java:156)
	... 31 more
Caused by: com.ctc.wstx.exc.WstxEOFException: Unexpected EOF in prolog
 at [row,col {unknown-source}]: [1,0]
	at com.ctc.wstx.sr.StreamScanner.throwUnexpectedEOF(StreamScanner.java:661)
	at com.ctc.wstx.sr.BasicStreamReader.handleEOF(BasicStreamReader.java:2134)
	at com.ctc.wstx.sr.BasicStreamReader.nextFromProlog(BasicStreamReader.java:2040)
	at com.ctc.wstx.sr.BasicStreamReader.next(BasicStreamReader.java:1069)
	at org.apache.cxf.staxutils.StaxUtils.readDocElements(StaxUtils.java:671)
	at org.apache.cxf.staxutils.StaxUtils.read(StaxUtils.java:530)
	at org.apache.cxf.databinding.source.XMLStreamDataReader.read(XMLStreamDataReader.java:97)
	... 34 more

=====================
testSWA : ProviderRPCClientServerTest

        URL endpoint = new URL("http://localhost:9008/SOAPServiceProviderRPCLit/SoapPortProviderRPCLit1");
        SOAPMessage response = con.call(msg, endpoint); 
        QName sayHiResp = new QName("http://apache.org/hello_world_rpclit", "sayHiResponse");

saaj impl

com.sun.xml.internal.messaging.saaj.SOAPExceptionImpl: java.security.PrivilegedActionException:
com.sun.xml.internal.messaging.saaj.SOAPExceptionImpl: Unable to internalize message
	at com.sun.xml.internal.messaging.saaj.client.p2p.HttpSOAPConnection.call(HttpSOAPConnection.java:146)
	at org.apache.cxf.systest.provider.ProviderRPCClientServerTest.testSWA(ProviderRPCClientServerTest.java:64)
	at sun.reflect.NativeMethodAccessorImpl.invoke0(Native Method)
	at sun.reflect.NativeMethodAccessorImpl.invoke(NativeMethodAccessorImpl.java:39)
	at sun.reflect.DelegatingMethodAccessorImpl.invoke(DelegatingMethodAccessorImpl.java:25)
	at java.lang.reflect.Method.invoke(Method.java:597)
	at org.junit.internal.runners.TestMethodRunner.executeMethodBody(TestMethodRunner.java:99)
	at org.junit.internal.runners.TestMethodRunner.runUnprotected(TestMethodRunner.java:81)
	at org.junit.internal.runners.BeforeAndAfterRunner.runProtected(BeforeAndAfterRunner.java:34)
	at org.junit.internal.runners.TestMethodRunner.runMethod(TestMethodRunner.java:75)
	at org.junit.internal.runners.TestMethodRunner.run(TestMethodRunner.java:45)
	at org.junit.internal.runners.TestClassMethodsRunner.invokeTestMethod(TestClassMethodsRunner.java:66)
	at org.junit.internal.runners.TestClassMethodsRunner.run(TestClassMethodsRunner.java:35)
	at org.junit.internal.runners.TestClassRunner$1.runUnprotected(TestClassRunner.java:42)
	at org.junit.internal.runners.BeforeAndAfterRunner.runProtected(BeforeAndAfterRunner.java:34)
	at org.junit.internal.runners.TestClassRunner.run(TestClassRunner.java:52)
	at org.eclipse.jdt.internal.junit4.runner.JUnit4TestReference.run(JUnit4TestReference.java:38)
	at org.eclipse.jdt.internal.junit.runner.TestExecution.run(TestExecution.java:38)
	at org.eclipse.jdt.internal.junit.runner.RemoteTestRunner.runTests(RemoteTestRunner.java:460)
	at org.eclipse.jdt.internal.junit.runner.RemoteTestRunner.runTests(RemoteTestRunner.java:673)
	at org.eclipse.jdt.internal.junit.runner.RemoteTestRunner.run(RemoteTestRunner.java:386)
	at org.eclipse.jdt.internal.junit.runner.RemoteTestRunner.main(RemoteTestRunner.java:196)
Caused by: java.security.PrivilegedActionException: com.sun.xml.internal.messaging.saaj.SOAPExceptionImpl:
Unable to internalize message
	at java.security.AccessController.doPrivileged(Native Method)
	at com.sun.xml.internal.messaging.saaj.client.p2p.HttpSOAPConnection.call(HttpSOAPConnection.java:140)
	... 21 more
Caused by: com.sun.xml.internal.messaging.saaj.SOAPExceptionImpl: Unable to internalize message
	at com.sun.xml.internal.messaging.saaj.soap.MessageImpl.init(MessageImpl.java:475)
	at com.sun.xml.internal.messaging.saaj.soap.MessageImpl.<init>(MessageImpl.java:317)
	at com.sun.xml.internal.messaging.saaj.soap.ver1_1.Message1_1Impl.<init>(Message1_1Impl.java:73)
	at com.sun.xml.internal.messaging.saaj.soap.MessageFactoryImpl.createMessage(MessageFactoryImpl.java:92)
	at com.sun.xml.internal.messaging.saaj.client.p2p.HttpSOAPConnection.post(HttpSOAPConnection.java:393)
	at com.sun.xml.internal.messaging.saaj.client.p2p.HttpSOAPConnection$PriviledgedPost.run(HttpSOAPConnection.java:169)
	... 23 more
Caused by: java.lang.Exception: Missing Start Boundary, or boundary does not start on a new
line
	at com.sun.xml.internal.messaging.saaj.packaging.mime.internet.BMMimeMultipart.getNextPart(BMMimeMultipart.java:237)
	at com.sun.xml.internal.messaging.saaj.soap.MessageImpl.init(MessageImpl.java:429)
	... 28 more

CAUSE:

java.security.PrivilegedActionException: com.sun.xml.internal.messaging.saaj.SOAPExceptionImpl:
Unable to internalize message
	at java.security.AccessController.doPrivileged(Native Method)
	at com.sun.xml.internal.messaging.saaj.client.p2p.HttpSOAPConnection.call(HttpSOAPConnection.java:140)
	at org.apache.cxf.systest.provider.ProviderRPCClientServerTest.testSWA(ProviderRPCClientServerTest.java:64)
	at sun.reflect.NativeMethodAccessorImpl.invoke0(Native Method)
	at sun.reflect.NativeMethodAccessorImpl.invoke(NativeMethodAccessorImpl.java:39)
	at sun.reflect.DelegatingMethodAccessorImpl.invoke(DelegatingMethodAccessorImpl.java:25)
	at java.lang.reflect.Method.invoke(Method.java:597)
	at org.junit.internal.runners.TestMethodRunner.executeMethodBody(TestMethodRunner.java:99)
	at org.junit.internal.runners.TestMethodRunner.runUnprotected(TestMethodRunner.java:81)
	at org.junit.internal.runners.BeforeAndAfterRunner.runProtected(BeforeAndAfterRunner.java:34)
	at org.junit.internal.runners.TestMethodRunner.runMethod(TestMethodRunner.java:75)
	at org.junit.internal.runners.TestMethodRunner.run(TestMethodRunner.java:45)
	at org.junit.internal.runners.TestClassMethodsRunner.invokeTestMethod(TestClassMethodsRunner.java:66)
	at org.junit.internal.runners.TestClassMethodsRunner.run(TestClassMethodsRunner.java:35)
	at org.junit.internal.runners.TestClassRunner$1.runUnprotected(TestClassRunner.java:42)
	at org.junit.internal.runners.BeforeAndAfterRunner.runProtected(BeforeAndAfterRunner.java:34)
	at org.junit.internal.runners.TestClassRunner.run(TestClassRunner.java:52)
	at org.eclipse.jdt.internal.junit4.runner.JUnit4TestReference.run(JUnit4TestReference.java:38)
	at org.eclipse.jdt.internal.junit.runner.TestExecution.run(TestExecution.java:38)
	at org.eclipse.jdt.internal.junit.runner.RemoteTestRunner.runTests(RemoteTestRunner.java:460)
	at org.eclipse.jdt.internal.junit.runner.RemoteTestRunner.runTests(RemoteTestRunner.java:673)
	at org.eclipse.jdt.internal.junit.runner.RemoteTestRunner.run(RemoteTestRunner.java:386)
	at org.eclipse.jdt.internal.junit.runner.RemoteTestRunner.main(RemoteTestRunner.java:196)
Caused by: com.sun.xml.internal.messaging.saaj.SOAPExceptionImpl: Unable to internalize message
	at com.sun.xml.internal.messaging.saaj.soap.MessageImpl.init(MessageImpl.java:475)
	at com.sun.xml.internal.messaging.saaj.soap.MessageImpl.<init>(MessageImpl.java:317)
	at com.sun.xml.internal.messaging.saaj.soap.ver1_1.Message1_1Impl.<init>(Message1_1Impl.java:73)
	at com.sun.xml.internal.messaging.saaj.soap.MessageFactoryImpl.createMessage(MessageFactoryImpl.java:92)
	at com.sun.xml.internal.messaging.saaj.client.p2p.HttpSOAPConnection.post(HttpSOAPConnection.java:393)
	at com.sun.xml.internal.messaging.saaj.client.p2p.HttpSOAPConnection$PriviledgedPost.run(HttpSOAPConnection.java:169)
	... 23 more
Caused by: java.lang.Exception: Missing Start Boundary, or boundary does not start on a new
line
	at com.sun.xml.internal.messaging.saaj.packaging.mime.internet.BMMimeMultipart.getNextPart(BMMimeMultipart.java:237)
	at com.sun.xml.internal.messaging.saaj.soap.MessageImpl.init(MessageImpl.java:429)
	... 28 more

================

testGetServiceList: CXFServletTest
testGetServiceList: ExternalServiceServletTest

        assertEquals("There should get two links for the services", 2, links.length);
        assertEquals(FORCED_BASE_ADDRESS + "/greeter?wsdl", links[0].getURLString()); 
        assertEquals(FORCED_BASE_ADDRESS + "/greeter2?wsdl", links[1].getURLString()); 

links order is wrong

================== 
testGetWSDL: CXFServletTest
testGetWSDLwithXMLBinding: CXFServletTest
testGetWSDL: SpringServletTest

        WebResponse res = client.getResponse(req);        
        assertEquals(200, res.getResponseCode());
        assertEquals("text/xml", res.getContentType());
        assertTrue("the wsdl should contain the opertion greetMe",
                   res.getText().contains("<wsdl:operation name=\"greetMe\">"));


miss wsdl namespace in "wsdl:operation"

> fix failed testcase on jdk1.6
> -----------------------------
>
>                 Key: CXF-1284
>                 URL: https://issues.apache.org/jira/browse/CXF-1284
>             Project: CXF
>          Issue Type: Sub-task
>         Environment: cxf trunk, sun jdk 1.6.0_10ea, XP
>            Reporter: Jeff Zhang
>            Assignee: maomaode
>             Fix For: 2.1
>
>         Attachments: jdk6test.patch
>
>
> run test on jdk1.6.0_10ea
> some test failed:
> common/common
> ==============
> W3CDOMSteamReader:testReader
> tools
> wsdl/test
> =======
> Failed tests:
>   testNonUniqueBody(org.apache.cxf.tools.wsdlto.jaxws.CodeGenBugTest)
>   testCodeGen(org.apache.cxf.tools.wsdlto.jaxws.JAXWSContainerTest)
>   testSuppressCodeGen(org.apache.cxf.tools.wsdlto.jaxws.JAXWSContainerTest)
> Tests in error:
>   testWsdlNoService(org.apache.cxf.tools.wsdlto.jaxws.CodeGenBugTest)
>   testNoServiceImport(org.apache.cxf.tools.wsdlto.jaxws.CodeGenBugTest)
>   testNoServiceNOPortType(org.apache.cxf.tools.wsdlto.jaxws.CodeGenBugTest)
> Tests run: 106, Failures: 3, Errors: 3, Skipped: 0
> javato
> ====
> Failed tests:
>   testDocLitWrappedWithWrapperClass(org.apache.cxf.tools.java2wsdl.processor.internal.jaxws.JaxwsServiceBuilderTest)
>   testDocWrappedWithLocalName(org.apache.cxf.tools.java2wsdl.processor.internaljaxws.JaxwsServiceBuilderTest)
>   testHolder(org.apache.cxf.tools.java2wsdl.processor.internal.jaxws.JaxwsServiceBuilderTest)
>   testSoapHeader(org.apache.cxf.tools.java2wsdl.processor.internal.jaxws.JaxwsServiceBuilderTest)
>   testRpcLitNoSEI(org.apache.cxf.tools.java2wsdl.processor.internal.jaxws.JaxwsServiceBuilderTest)
>   testAegisBasic(org.apache.cxf.tools.java2ws.AegisTest) 
>  testGeneratedWithElementryClass(org.apache.cxf.tools.java2wsdl.processor.internal.jaxws.JaxwsServiceBuilderNoAnnoTest)

>  testGeneratedWithDocWrappedClass(org.apache.cxf.tools.java2wsdl.processor.internal.jaxws.JaxwsServiceBuilderNoAnnoTest)
 
> testGeneratedWithRPCClass(org.apache.cxf.tools.java2wsdl.processor.internal.jaxws.JaxwsServiceBuilderNoAnnoTest)
>  testGreeter(org.apache.cxf.tools.java2wsdl.processor.internal.jaxws.JaxwsServiceBuilderRPCTest)
> 10 failed
> rt
> frontend/jaxws
> ===========
> jaxws.ServiceImplTest:testNonSpecificGetPort
> javascript
> ========
> javascript.DocLitBareClientTest:callCompliantNoArgs
> systests
> =======
> jaxws.ClientServerTest:GetPortOneParam
> BasicConnect2
> ProviderXMLClientServerTest:testDomSourcePAYLOAD
> SpringServletTest:testGetWSDL
> servlet.ExternalServicesServletTest:testGetServiceList
> CXFServletTest
> Failed tests:
>   testGetWSDL(org.apache.cxf.systest.servlet.CXFServletTest)
>   testGetServiceList(org.apache.cxf.systest.servlet.CXFServletTest)
>   testGetWSDLWithXMLBinding(org.apache.cxf.systest.servlet.CXFServletTest)
> provider.ProviderRPCClientServerTest:testSWA

-- 
This message is automatically generated by JIRA.
-
You can reply to this email to add a comment to the issue online.


Mime
View raw message