cxf-dev mailing list archives

Site index · List index
Message view « Date » · « Thread »
Top « Date » · « Thread »
From Colm O hEigeartaigh <cohei...@apache.org>
Subject Failing MonoReactorTest on master
Date Mon, 19 Feb 2018 16:26:43 GMT
Hi all,

The following test is failing for me on master:

[INFO] Running org.apache.cxf.systest.jaxrs.reactor.MonoReactorTest
[ERROR] Tests run: 3, Failures: 1, Errors: 0, Skipped: 0, Time elapsed:
2.444 s <<< FAILURE! - in
org.apache.cxf.systest.jaxrs.reactor.MonoReactorTest
[ERROR]
testTextJsonImplicitListAsyncStream(org.apache.cxf.systest.jaxrs.reactor.MonoReactorTest)
Time elapsed: 0.525 s  <<< FAILURE!
java.lang.AssertionError
    at
org.apache.cxf.systest.jaxrs.reactor.MonoReactorTest.testTextJsonImplicitListAsyncStream(MonoReactorTest.java:80)

Colm.


-- 
Colm O hEigeartaigh

Talend Community Coder
http://coders.talend.com

Mime
  • Unnamed multipart/alternative (inline, None, 0 bytes)
View raw message