cxf-dev mailing list archives

Site index · List index
Message view « Date » · « Thread »
Top « Date » · « Thread »
From Malintha Adikari <malintha.adik...@gmail.com>
Subject Re: Build Failure in git
Date Wed, 11 Jun 2014 11:41:03 GMT
Hi Aki,




On Wed, Jun 11, 2014 at 1:44 PM, Aki Yoshida <elakito@gmail.com> wrote:

>
> http://docs.fedoraproject.org/en-US/Fedora/19/html/Security_Guide/sec-Disabling_firewalld.html
>
> if you have further problems in setting up your fedora system, you
> should probably ask at the Fedora forum.
>
>
It worked fine for me. Thank you very much.

regards, aki
>




> 2014-06-11 6:55 GMT+02:00 Malintha Adikari <malintha.adikari@gmail.com>:
> > Hi,
> >
> > Yes the problem is not enabled UDP broadcast on firewall. I have tried
> > several ways to enable it. But couldn't solve the issue. How can we
> enable
> > UDP broadcast on firewall.
> >
> > Note: My OS is Fedora 18
> >
> > Regards,
> > Malintha
> >
> >
> > On Wed, Jun 11, 2014 at 1:16 AM, Malintha Adikari <
> > malintha.adikari@gmail.com> wrote:
> >
> >> Hi
> >>
> >> Thank you very much for help.
> >>
> >> On Wed, Jun 11, 2014 at 12:58 AM, Grzegorz Grzybek <
> gr.grzybek@gmail.com>
> >> wrote:
> >>
> >>> Hi Malintha - I had this problem too - I had to enable UDP broadcast
> on my
> >>> firewall (just allow the ports of UDP) - then the tests went fine.
> >>>
> >>> I am trying to open UDP ports. But still no luck with me . Will keep
> try
> >> and update you.
> >>
> >>> regards
> >>> Grzegorz Grzybek
> >>>
> >>>
> >>> 2014-06-10 21:26 GMT+02:00 Daniel Kulp <dkulp@apache.org>:
> >>>
> >>> >
> >>> >
> >>> > All the UDP tests are passing on the Jenkins builds with Java6  as
> well
> >>> as
> >>> > using Java 6 and Java 7 on my machine locally.
> >>> >
> >>> >
> >>> >
> >>>
> https://builds.apache.org/view/A-D/view/CXF/job/CXF-Trunk-JDK16/lastBuild/testReport/
> >>> >
> >>> >
> >>> > What OS are you using?   The RedHat folks said there might be some
> >>> issues
> >>>
> >>
> >> I am using fedora 18 as my OS.
> >>
> >>
> >>>  > with the latest versions of RedHat due to broadcast UDP being turned
> >>> off.
> >>> > However, the tests should have been updated to detect that OS and
> skip.
> >>> >
> >>> >
> >>> > Dan
> >>> >
> >>> >
> >>> >
> >>> >
> >>> > On Jun 10, 2014, at 7:03 AM, Malintha Adikari <
> >>> malintha.adikari@gmail.com>
> >>> > wrote:
> >>> >
> >>> > > Hi,
> >>> > >
> >>> > > I am building Apache CXF from git clone
> >>> > > https://git-wip-us.apache.org/repos/asf/cxf.git. Following build
> >>> failure
> >>> > > appeared in the middle of the building process.
> >>> > >
> >>> > > Note: I am using java 1.6 and maven 3.0.5. Also I am using a fresh
> >>> maven
> >>> > > repository.
> >>> > >
> >>> > > [INFO] Apache CXF Runtime Object Binding ................. SUCCESS
> >>> > [4.044s]
> >>> > > [INFO] Apache CXF Runtime Colocated Binding .............. SUCCESS
> >>> > [1.690s]
> >>> > > [INFO] Apache CXF Runtime ................................ SUCCESS
> >>> > [0.064s]
> >>> > > [INFO] Apache CXF Runtime Bindings ....................... SUCCESS
> >>> > [0.022s]
> >>> > > [INFO] Apache CXF Runtime Clustering ..................... SUCCESS
> >>> > [1.130s]
> >>> > > [INFO] Apache CXF Runtime JavaScript Frontend ............ SUCCESS
> >>> > [1.745s]
> >>> > > [INFO] Apache CXF Runtime HTTP Async Transport ........... SUCCESS
> >>> > [9.276s]
> >>> > > [INFO] Apache CXF Runtime HTTP Netty Server Transport .... SUCCESS
> >>> > [8.421s]
> >>> > > [INFO] Apache CXF Runtime HTTP Netty Client Transport .... SUCCESS
> >>> > [16.604s]
> >>> > > [INFO] Apache CXF Runtime UDP Transport .................. FAILURE
> >>> > [32.762s]
> >>> > > [INFO] Apache CXF Runtime WebSocket Transport ............ SKIPPED
> >>> > > [INFO] Apache CXF Runtime Security functionality ......... SKIPPED
> >>> > > [INFO] Apache CXF Runtime WS MetadataExchange ............ SKIPPED
> >>> > > [INFO] Apache CXF Runtime WS Security .................... SKIPPED
> >>> > > [INFO] Apache CXF Runtime WS Reliable Messaging .......... SKIPPED
> >>> > > [INFO] Apache CXF Runtime WS Eventing .................... SKIPPED
> >>> > > [INFO] Apache CXF JAX-RS Client .......................... SKIPPED
> >>> > > [INFO] Apache CXF JAX-RS Extensions: Providers ........... SKIPPED
> >>> > > [INFO] Apache CXF JAX-RS Extensions: Search .............. SKIPPED
> >>> > > [INFO] Apache CXF RS XML Security ........................ SKIPPED
> >>> > > [INFO] Apache CXF RS SSO SAML ............................ SKIPPED
> >>> > > [INFO] Apache CXF Runtime RS Security OAuth Parent ....... SKIPPED
> >>> > > [INFO] Apache CXF Runtime OAuth 1.0a ..................... SKIPPED
> >>> > > [INFO] Apache CXF Runtime OAuth 2.0 ...................... SKIPPED
> >>> > > [INFO] Apache CXF Runtime OAuth 2.0 SAML ................. SKIPPED
> >>> > > [INFO] Apache CXF Runtime OAuth 2.0 JWT .................. SKIPPED
> >>> > > [INFO] Apache CXF RS Cross-Origin Resource Sharing ....... SKIPPED
> >>> > > [INFO] Apache CXF Runtime Web Management ................. SKIPPED
> >>> > > [INFO] Apache CXF Runtime JavaScript Client Generator Tests
>  SKIPPED
> >>> > > [INFO] Apache CXF JCA Connection ......................... SKIPPED
> >>> > > [INFO] Apache CXF CDI Integration ........................ SKIPPED
> >>> > > [INFO] Apache CXF Integration ............................ SKIPPED
> >>> > > [INFO] Apache CXF Java2WS Maven2 Plugin .................. SKIPPED
> >>> > > [INFO] Apache CXF Java2WADL Maven2 Plugin ................ SKIPPED
> >>> > > [INFO] Apache CXF WADL2Java Code Generation Maven2 Plugin  SKIPPED
> >>> > > [INFO] Apache CXF CORBA Tools Maven2 Plugins ............. SKIPPED
> >>> > > [INFO] Apache CXF Archetype - Simple JAX-WS Java First ... SKIPPED
> >>> > > [INFO] Apache CXF Archetype - Simple JAX-RS webapp ....... SKIPPED
> >>> > > [INFO] Apache CXF Maven Archetypes ....................... SKIPPED
> >>> > > [INFO] Apache CXF STS Core ............................... SKIPPED
> >>> > > [INFO] Apache CXF STS war deployment ..................... SKIPPED
> >>> > > [INFO] Apache CXF STS basic systests ..................... SKIPPED
> >>> > > [INFO] Apache CXF STS advanced systests .................. SKIPPED
> >>> > > [INFO] Apache CXF Services ............................... SKIPPED
> >>> > > [INFO] Apache CXF STS service ............................ SKIPPED
> >>> > > [INFO] Apache CXF STS systests ........................... SKIPPED
> >>> > > [INFO] Apache CXF WSN API ................................ SKIPPED
> >>> > > [INFO] Apache CXF WSN Core ............................... SKIPPED
> >>> > > [INFO] Apache CXF WSN OSGi ............................... SKIPPED
> >>> > > [INFO] Apache CXF WSN service ............................ SKIPPED
> >>> > > [INFO] Apache CXF WS-Discovery API ....................... SKIPPED
> >>> > > [INFO] Apache CXF WS-Discovery Service ................... SKIPPED
> >>> > > [INFO] Apache CXF WS-Discovery ........................... SKIPPED
> >>> > > [INFO] Apache CXF XKMS Common ............................ SKIPPED
> >>> > > [INFO] Apache CXF XKMS X509 Handlers ..................... SKIPPED
> >>> > > [INFO] Apache CXF XKMS Service ........................... SKIPPED
> >>> > > [INFO] Apache CXF XKMS Client ............................ SKIPPED
> >>> > > [INFO] Apache CXF XKMS Karaf Features .................... SKIPPED
> >>> > > [INFO] Apache CXF XKMS OSGi deployment ................... SKIPPED
> >>> > > [INFO] Apache CXF XKMS LDAP repository ................... SKIPPED
> >>> > > [INFO] Apache CXF XKMS Service war deployment ............ SKIPPED
> >>> > > [INFO] Apache CXF Karaf Parent ........................... SKIPPED
> >>> > > [INFO] Apache CXF Karaf Features ......................... SKIPPED
> >>> > > [INFO] Apache CXF Karaf Commands ......................... SKIPPED
> >>> > > [INFO] Apache CXF XKMS Integration Tests ................. SKIPPED
> >>> > > [INFO] Apache CXF XKMS ................................... SKIPPED
> >>> > > [INFO] Apache CXF Bundle Parent .......................... SKIPPED
> >>> > > [INFO] Apache CXF Compatibility Bundle Jar ............... SKIPPED
> >>> > > [INFO] Apache CXF :: OSGi :: Integration Tests ........... SKIPPED
> >>> > > [INFO] Apache CXF :: OSGi :: Integration Tests pure felix  SKIPPED
> >>> > > [INFO] Apache CXF OSGi parent ............................ SKIPPED
> >>> > > [INFO] Apache CXF Container Integration System Tests ..... SKIPPED
> >>> > > [INFO] Apache CXF Container Integration Test Webapp ...... SKIPPED
> >>> > > [INFO] Apache CXF Uncategorized System Tests ............. SKIPPED
> >>> > > [INFO] Apache CXF Transport System Tests ................. SKIPPED
> >>> > > [INFO] Apache CXF Transport System Tests JMS ............. SKIPPED
> >>> > > [INFO] Apache CXF JAX-WS System Tests .................... SKIPPED
> >>> > > [INFO] Apache CXF Databinding System Tests ............... SKIPPED
> >>> > > [INFO] Apache CXF JAX-RS System Tests .................... SKIPPED
> >>> > > [INFO] Apache CXF WS-* Specifications System Tests ....... SKIPPED
> >>> > > [INFO] Apache CXF WS-RM Specifications System Tests ...... SKIPPED
> >>> > > [INFO] Apache CXF WS-Security System Tests ............... SKIPPED
> >>> > > [INFO] Apache CXF WS-Security Interop System Tests ....... SKIPPED
> >>> > > [INFO] Apache CXF JAX-RS System Advanced Security Tests .. SKIPPED
> >>> > > [INFO] Test for writing wsdl to repo ..................... SKIPPED
> >>> > > [INFO] Test for generating code from wsdl in repo ........ SKIPPED
> >>> > > [INFO] Apache CXF System Tests ........................... SKIPPED
> >>> > > [INFO] Apache CXF System Tests for Maven Plugins ......... SKIPPED
> >>> > > [INFO] Apache CXF CDI Integration System Tests ........... SKIPPED
> >>> > > [INFO]
> >>> > >
> >>>
> ------------------------------------------------------------------------
> >>> > > [INFO] BUILD FAILURE
> >>> > > [INFO]
> >>> > >
> >>>
> ------------------------------------------------------------------------
> >>> > > [INFO] Total time: 6:41.654s
> >>> > > [INFO] Finished at: Tue Jun 10 16:32:02 IST 2014
> >>> > > [INFO] Final Memory: 197M/1607M
> >>> > > [INFO]
> >>> > >
> >>>
> ------------------------------------------------------------------------
> >>> > > [ERROR] Failed to execute goal
> >>> > > org.apache.maven.plugins:maven-surefire-plugin:2.17:test
> >>> (default-test)
> >>> > on
> >>> > > project cxf-rt-transports-udp: There are test failures.
> >>> > > [ERROR]
> >>> > > [ERROR] Please refer to
> >>> > >
> >>>
> /home/malintha/projects/CXF/cxf/rt/transports/udp/target/surefire-reports
> >>> > > for the individual test results.
> >>> > > [ERROR] -> [Help 1]
> >>> > > [ERROR]
> >>> > > [ERROR] To see the full stack trace of the errors, re-run Maven
> with
> >>> the
> >>> > -e
> >>> > > switch.
> >>> > > [ERROR] Re-run Maven using the -X switch to enable full debug
> logging.
> >>> > > [ERROR]
> >>> > > [ERROR] For more information about the errors and possible
> solutions,
> >>> > > please read the following articles:
> >>> > > [ERROR] [Help 1]
> >>> > >
> http://cwiki.apache.org/confluence/display/MAVEN/MojoFailureException
> >>> > > [ERROR]
> >>> > > [ERROR] After correcting the problems, you can resume the build
> with
> >>> the
> >>> > > command
> >>> > > [ERROR]   mvn <goals> -rf :cxf-rt-transports-udp
> >>> > >
> >>> > > Could you please look in to this.
> >>> > >
> >>> > > Regards,
> >>> > > Malintha Adikari
> >>> >
> >>> > --
> >>> > Daniel Kulp
> >>> > dkulp@apache.org - http://dankulp.com/blog
> >>> > Talend Community Coder - http://coders.talend.com
> >>> >
> >>> >
> >>>
> >>
> >>
>

Mime
  • Unnamed multipart/alternative (inline, None, 0 bytes)
View raw message