cxf-dev mailing list archives

Site index · List index
Message view « Date » · « Thread »
Top « Date » · « Thread »
From Aki Yoshida <elak...@googlemail.com>
Subject Re: Build failed in Jenkins: CXF-Trunk-JDK15 #2262
Date Thu, 28 Jul 2011 16:47:26 GMT
i'll be submitting the fix shortly.
sorry.
regards, aki

2011/7/28 Apache Jenkins Server <jenkins@builds.apache.org>:
> See <https://builds.apache.org/job/CXF-Trunk-JDK15/2262/changes>
>
> Changes:
>
> [coheigea] [CXF-3693] - SecurityTokenServiceProvider does not handle exceptions properly
>
> [ay] [CXF-3692] enhacing inTransformReader's element features
>
> ------------------------------------------
> [...truncated 2837 lines...]
> [INFO] Building Apache CXF Command Line Tools JavaTo WS
> [INFO]    task-segment: [clean, install]
> [INFO] ------------------------------------------------------------------------
> [INFO] [clean:clean {execution: default-clean}]
> [INFO] Deleting <https://builds.apache.org/job/CXF-Trunk-JDK15/ws/trunk/tools/javato/ws/target>
> [INFO] [cxf-xml2fastinfoset:xml2fastinfoset {execution: xml2fastinfoset}]
> [INFO] [remote-resources:process {execution: default}]
> [INFO] [resources:resources {execution: default-resources}]
> [INFO] Using 'UTF-8' encoding to copy filtered resources.
> [INFO] Copying 20 resources
> [INFO] skip non existing resourceDirectory <https://builds.apache.org/job/CXF-Trunk-JDK15/ws/trunk/tools/javato/ws/src/main/resources>
> [INFO] skip non existing resourceDirectory <https://builds.apache.org/job/CXF-Trunk-JDK15/ws/trunk/tools/javato/ws/src/main/resources-filtered>
> [INFO] skip non existing resourceDirectory <https://builds.apache.org/job/CXF-Trunk-JDK15/ws/trunk/tools/javato/ws/target/generated/src/main/resources>
> [INFO] Copying 3 resources
> [INFO] [compiler:compile {execution: default-compile}]
> [INFO] Compiling 38 source files to <https://builds.apache.org/job/CXF-Trunk-JDK15/ws/trunk/tools/javato/ws/target/classes>
> [INFO] [cxf-codegen:wsdl2java {execution: generate-test-sources}]
> [INFO] Running wsdl2java in fork mode...
> [INFO] Building jar: /tmp/cxf-tmp-313828/cxf-codegen3171763120254625883.jar
> [INFO] [build-helper:add-test-source {execution: add-source}]
> [INFO] Test Source directory: <https://builds.apache.org/job/CXF-Trunk-JDK15/ws/trunk/tools/javato/ws/src/test/generated>
added.
> [INFO] [resources:testResources {execution: default-testResources}]
> [INFO] Using 'UTF-8' encoding to copy filtered resources.
> [INFO] Copying 1 resource
> [INFO] Copying 44 resources
> [INFO] skip non existing resourceDirectory <https://builds.apache.org/job/CXF-Trunk-JDK15/ws/trunk/tools/javato/ws/target/generated/src/test/resources>
> [INFO] Copying 3 resources
> [INFO] [compiler:testCompile {execution: default-testCompile}]
> [INFO] Compiling 189 source files to <https://builds.apache.org/job/CXF-Trunk-JDK15/ws/trunk/tools/javato/ws/target/test-classes>
> [INFO] [surefire:test {execution: default-test}]
> [INFO] Surefire report directory: <https://builds.apache.org/job/CXF-Trunk-JDK15/ws/trunk/tools/javato/ws/target/surefire-reports>
>
> -------------------------------------------------------
>  T E S T S
> -------------------------------------------------------
> Running org.apache.cxf.tools.java2js.processor.JavaToJSProcessorTest
> Tests run: 2, Failures: 0, Errors: 0, Skipped: 0, Time elapsed: 3.738 sec
> Running org.apache.cxf.tools.java2ws.AegisTest
> Tests run: 2, Failures: 0, Errors: 0, Skipped: 1, Time elapsed: 0.27 sec
> Running org.apache.cxf.tools.java2ws.JavaToWSTest
> Tests run: 19, Failures: 0, Errors: 0, Skipped: 0, Time elapsed: 4.247 sec
> Running org.apache.cxf.tools.java2wsdl.JavaToWSFlagTest
> Tests run: 7, Failures: 0, Errors: 0, Skipped: 0, Time elapsed: 0.337 sec
> Running org.apache.cxf.tools.java2wsdl.generator.WSDLGeneratorFactoryTest
> Tests run: 1, Failures: 0, Errors: 0, Skipped: 0, Time elapsed: 0.001 sec
> Running org.apache.cxf.tools.java2wsdl.generator.wsdl11.DateTypeCustomGeneratorTest
> Tests run: 4, Failures: 0, Errors: 0, Skipped: 0, Time elapsed: 0.127 sec
> Running org.apache.cxf.tools.java2wsdl.generator.wsdl11.FaultBeanGeneratorTest
> Tests run: 3, Failures: 0, Errors: 0, Skipped: 0, Time elapsed: 1.203 sec
> Running org.apache.cxf.tools.java2wsdl.generator.wsdl11.WrapperBeanGeneratorTest
> Tests run: 4, Failures: 0, Errors: 0, Skipped: 0, Time elapsed: 2.651 sec
> Running org.apache.cxf.tools.java2wsdl.generator.wsdl11.annotator.WrapperBeanAnnotatorTest
> Tests run: 1, Failures: 0, Errors: 0, Skipped: 0, Time elapsed: 0.001 sec
> Running org.apache.cxf.tools.java2wsdl.generator.wsdl11.annotator.WrapperBeanFieldAnnotatorTest
> Tests run: 1, Failures: 0, Errors: 0, Skipped: 0, Time elapsed: 0 sec
> Running org.apache.cxf.tools.java2wsdl.processor.FrontendFactoryTest
> Tests run: 3, Failures: 0, Errors: 0, Skipped: 0, Time elapsed: 0.043 sec
> Running org.apache.cxf.tools.java2wsdl.processor.JavaToProcessorTest
> Tests run: 32, Failures: 0, Errors: 0, Skipped: 0, Time elapsed: 9.032 sec
> Running org.apache.cxf.tools.java2wsdl.processor.internal.ServiceBuilderFactoryTest
> Tests run: 2, Failures: 0, Errors: 0, Skipped: 0, Time elapsed: 0.035 sec
> Running org.apache.cxf.tools.java2wsdl.processor.internal.jaxws.FaultBeanTest
> Tests run: 1, Failures: 0, Errors: 0, Skipped: 0, Time elapsed: 0 sec
> Running org.apache.cxf.tools.java2wsdl.processor.internal.jaxws.JaxwsServiceBuilderNoAnnoTest
> Tests run: 3, Failures: 0, Errors: 0, Skipped: 0, Time elapsed: 0.028 sec
> Running org.apache.cxf.tools.java2wsdl.processor.internal.jaxws.JaxwsServiceBuilderRPCTest
> Tests run: 1, Failures: 0, Errors: 0, Skipped: 0, Time elapsed: 0.014 sec
> Running org.apache.cxf.tools.java2wsdl.processor.internal.jaxws.JaxwsServiceBuilderTest
> Tests run: 15, Failures: 0, Errors: 0, Skipped: 1, Time elapsed: 0.278 sec
> Running org.apache.cxf.tools.java2wsdl.processor.internal.jaxws.RequestWrapperTest
> Tests run: 5, Failures: 0, Errors: 0, Skipped: 0, Time elapsed: 0.067 sec
> Running org.apache.cxf.tools.java2wsdl.processor.internal.jaxws.ResponseWrapperTest
> Tests run: 2, Failures: 0, Errors: 0, Skipped: 0, Time elapsed: 0.007 sec
> Running org.apache.cxf.tools.java2wsdl.processor.internal.jaxws.WrapperTest
> Tests run: 3, Failures: 0, Errors: 0, Skipped: 0, Time elapsed: 0.006 sec
> Running org.apache.cxf.tools.java2wsdl.processor.internal.jaxws.WrapperUtilTest
> Tests run: 2, Failures: 0, Errors: 0, Skipped: 0, Time elapsed: 0.016 sec
>
> Results :
>
> Tests run: 113, Failures: 0, Errors: 0, Skipped: 2
>
> [JENKINS] Recording test results
> [INFO] [jar:jar {execution: default-jar}]
> [INFO] Building jar: <https://builds.apache.org/job/CXF-Trunk-JDK15/ws/trunk/tools/javato/ws/target/cxf-tools-java2ws-2.5.0-SNAPSHOT.jar>
> [INFO] [install:install {execution: default-install}]
> [INFO] Installing <https://builds.apache.org/job/CXF-Trunk-JDK15/ws/trunk/tools/javato/ws/target/cxf-tools-java2ws-2.5.0-SNAPSHOT.jar>
to <https://builds.apache.org/job/CXF-Trunk-JDK15/ws/.repository/org/apache/cxf/cxf-tools-java2ws/2.5.0-SNAPSHOT/cxf-tools-java2ws-2.5.0-SNAPSHOT.jar>
> [JENKINS] Archiving <https://builds.apache.org/job/CXF-Trunk-JDK15/ws/trunk/tools/javato/ws/pom.xml>
to /home/hudson/hudson/jobs/CXF-Trunk-JDK15/modules/org.apache.cxf$cxf-tools-java2ws/builds/2011-07-28_16-24-43/archive/org.apache.cxf/cxf-tools-java2ws/2.5.0-SNAPSHOT/cxf-tools-java2ws-2.5.0-SNAPSHOT.pom
> [JENKINS] Archiving <https://builds.apache.org/job/CXF-Trunk-JDK15/ws/trunk/tools/javato/ws/target/cxf-tools-java2ws-2.5.0-SNAPSHOT.jar>
to /home/hudson/hudson/jobs/CXF-Trunk-JDK15/modules/org.apache.cxf$cxf-tools-java2ws/builds/2011-07-28_16-24-43/archive/org.apache.cxf/cxf-tools-java2ws/2.5.0-SNAPSHOT/cxf-tools-java2ws-2.5.0-SNAPSHOT.jar
> [INFO] ------------------------------------------------------------------------
> [INFO] Building Apache CXF Command Line Tools JavaTo
> [INFO]    task-segment: [clean, install]
> [INFO] ------------------------------------------------------------------------
> [INFO] [clean:clean {execution: default-clean}]
> [INFO] [site:attach-descriptor {execution: default-attach-descriptor}]
> [INFO] [install:install {execution: default-install}]
> [INFO] Installing <https://builds.apache.org/job/CXF-Trunk-JDK15/ws/trunk/tools/javato/pom.xml>
to <https://builds.apache.org/job/CXF-Trunk-JDK15/ws/.repository/org/apache/cxf/cxf-tools-javato/2.5.0-SNAPSHOT/cxf-tools-javato-2.5.0-SNAPSHOT.pom>
> [JENKINS] Archiving <https://builds.apache.org/job/CXF-Trunk-JDK15/ws/trunk/tools/javato/pom.xml>
to /home/hudson/hudson/jobs/CXF-Trunk-JDK15/modules/org.apache.cxf$cxf-tools-javato/builds/2011-07-28_16-24-43/archive/org.apache.cxf/cxf-tools-javato/2.5.0-SNAPSHOT/cxf-tools-javato-2.5.0-SNAPSHOT.pom
> [INFO] ------------------------------------------------------------------------
> [INFO] Building Apache CXF Runtime SDO DataBinding
> [INFO]    task-segment: [clean, install]
> [INFO] ------------------------------------------------------------------------
> [INFO] [clean:clean {execution: default-clean}]
> [INFO] Deleting <https://builds.apache.org/job/CXF-Trunk-JDK15/ws/trunk/rt/databinding/sdo/target>
> [INFO] [cxf-xml2fastinfoset:xml2fastinfoset {execution: xml2fastinfoset}]
> [INFO] [remote-resources:process {execution: default}]
> [INFO] [resources:resources {execution: default-resources}]
> [INFO] Using 'UTF-8' encoding to copy filtered resources.
> [INFO] Copying 0 resource
> [INFO] Copying 2 resources
> [INFO] skip non existing resourceDirectory <https://builds.apache.org/job/CXF-Trunk-JDK15/ws/trunk/rt/databinding/sdo/src/main/resources-filtered>
> [INFO] skip non existing resourceDirectory <https://builds.apache.org/job/CXF-Trunk-JDK15/ws/trunk/rt/databinding/sdo/target/generated/src/main/resources>
> [INFO] Copying 3 resources
> [INFO] [compiler:compile {execution: default-compile}]
> [INFO] Compiling 6 source files to <https://builds.apache.org/job/CXF-Trunk-JDK15/ws/trunk/rt/databinding/sdo/target/classes>
> [INFO] [cxf-codegen:wsdl2java {execution: generate-test-sources-static}]
> [INFO] Running wsdl2java in fork mode...
> [INFO] Building jar: /tmp/cxf-tmp-313828/cxf-codegen390227505275134961.jar
> [INFO] [resources:testResources {execution: default-testResources}]
> [INFO] Using 'UTF-8' encoding to copy filtered resources.
> [INFO] Copying 2 resources
> [INFO] Copying 3 resources
> [INFO] skip non existing resourceDirectory <https://builds.apache.org/job/CXF-Trunk-JDK15/ws/trunk/rt/databinding/sdo/target/generated/src/test/resources>
> [INFO] Copying 3 resources
> [INFO] [compiler:testCompile {execution: default-testCompile}]
> [INFO] Compiling 49 source files to <https://builds.apache.org/job/CXF-Trunk-JDK15/ws/trunk/rt/databinding/sdo/target/test-classes>
> [INFO] [surefire:test {execution: default-test}]
> [INFO] Surefire report directory: <https://builds.apache.org/job/CXF-Trunk-JDK15/ws/trunk/rt/databinding/sdo/target/surefire-reports>
>
> -------------------------------------------------------
>  T E S T S
> -------------------------------------------------------
> Running org.apache.cxf.sdo.HelloWorldDynamicTest
> Tests run: 3, Failures: 0, Errors: 0, Skipped: 0, Time elapsed: 2.007 sec
> Running org.apache.cxf.sdo.HelloWorldStaticTest
> Tests run: 3, Failures: 0, Errors: 0, Skipped: 0, Time elapsed: 0.221 sec
>
> Results :
>
> Tests run: 6, Failures: 0, Errors: 0, Skipped: 0
>
> [JENKINS] Recording test results
> [INFO] [jar:jar {execution: default-jar}]
> [INFO] Building jar: <https://builds.apache.org/job/CXF-Trunk-JDK15/ws/trunk/rt/databinding/sdo/target/cxf-rt-databinding-sdo-2.5.0-SNAPSHOT.jar>
> [INFO] [install:install {execution: default-install}]
> [INFO] Installing <https://builds.apache.org/job/CXF-Trunk-JDK15/ws/trunk/rt/databinding/sdo/target/cxf-rt-databinding-sdo-2.5.0-SNAPSHOT.jar>
to <https://builds.apache.org/job/CXF-Trunk-JDK15/ws/.repository/org/apache/cxf/cxf-rt-databinding-sdo/2.5.0-SNAPSHOT/cxf-rt-databinding-sdo-2.5.0-SNAPSHOT.jar>
> [JENKINS] Archiving <https://builds.apache.org/job/CXF-Trunk-JDK15/ws/trunk/rt/databinding/sdo/pom.xml>
to /home/hudson/hudson/jobs/CXF-Trunk-JDK15/modules/org.apache.cxf$cxf-rt-databinding-sdo/builds/2011-07-28_16-24-43/archive/org.apache.cxf/cxf-rt-databinding-sdo/2.5.0-SNAPSHOT/cxf-rt-databinding-sdo-2.5.0-SNAPSHOT.pom
> [JENKINS] Archiving <https://builds.apache.org/job/CXF-Trunk-JDK15/ws/trunk/rt/databinding/sdo/target/cxf-rt-databinding-sdo-2.5.0-SNAPSHOT.jar>
to /home/hudson/hudson/jobs/CXF-Trunk-JDK15/modules/org.apache.cxf$cxf-rt-databinding-sdo/builds/2011-07-28_16-24-43/archive/org.apache.cxf/cxf-rt-databinding-sdo/2.5.0-SNAPSHOT/cxf-rt-databinding-sdo-2.5.0-SNAPSHOT.jar
> [INFO] ------------------------------------------------------------------------
> [INFO] Building Apache CXF Runtime JAX-RS Frontend
> [INFO]    task-segment: [clean, install]
> [INFO] ------------------------------------------------------------------------
> [INFO] [clean:clean {execution: default-clean}]
> [INFO] Deleting <https://builds.apache.org/job/CXF-Trunk-JDK15/ws/trunk/rt/frontend/jaxrs/target>
> [INFO] [cxf-xml2fastinfoset:xml2fastinfoset {execution: xml2fastinfoset}]
> [INFO] [remote-resources:process {execution: default}]
> [INFO] [resources:resources {execution: default-resources}]
> [INFO] Using 'UTF-8' encoding to copy filtered resources.
> [INFO] Copying 7 resources
> [INFO] Copying 6 resources
> [INFO] skip non existing resourceDirectory <https://builds.apache.org/job/CXF-Trunk-JDK15/ws/trunk/rt/frontend/jaxrs/src/main/resources-filtered>
> [INFO] skip non existing resourceDirectory <https://builds.apache.org/job/CXF-Trunk-JDK15/ws/trunk/rt/frontend/jaxrs/target/generated/src/main/resources>
> [INFO] Copying 3 resources
> [INFO] [compiler:compile {execution: default-compile}]
> [INFO] Compiling 189 source files to <https://builds.apache.org/job/CXF-Trunk-JDK15/ws/trunk/rt/frontend/jaxrs/target/classes>
> [INFO] [xmlbeans:xmlbeans-test {execution: default}]
> [INFO] [resources:testResources {execution: default-testResources}]
> [INFO] Using 'UTF-8' encoding to copy filtered resources.
> [INFO] Copying 14 resources
> [INFO] Copying 6 resources
> [INFO] Copying 10 resources
> [INFO] Copying 3 resources
> [INFO] Copying 10 resources
> [INFO] [compiler:testCompile {execution: default-testCompile}]
> [INFO] Compiling 131 source files to <https://builds.apache.org/job/CXF-Trunk-JDK15/ws/trunk/rt/frontend/jaxrs/target/test-classes>
> [INFO] -------------------------------------------------------------
> [ERROR] COMPILATION ERROR :
> [INFO] -------------------------------------------------------------
> [ERROR] <https://builds.apache.org/job/CXF-Trunk-JDK15/ws/trunk/rt/frontend/jaxrs/src/test/java/org/apache/cxf/jaxrs/provider/SourceProviderTest.java>:[90,17]
cannot find symbol
> symbol  : constructor InTransformReader(javax.xml.stream.XMLStreamReader,java.util.Map<java.lang.String,java.lang.String>,<nulltype>,boolean)
> location: class org.apache.cxf.staxutils.transform.InTransformReader
> [INFO] 1 error
> [INFO] -------------------------------------------------------------
> [JENKINS] Archiving <https://builds.apache.org/job/CXF-Trunk-JDK15/ws/trunk/rt/frontend/jaxrs/pom.xml>
to /home/hudson/hudson/jobs/CXF-Trunk-JDK15/modules/org.apache.cxf$cxf-rt-frontend-jaxrs/builds/2011-07-28_16-24-43/archive/org.apache.cxf/cxf-rt-frontend-jaxrs/2.5.0-SNAPSHOT/cxf-rt-frontend-jaxrs-2.5.0-SNAPSHOT.pom
> [INFO] ------------------------------------------------------------------------
> [ERROR] BUILD FAILURE
> [INFO] ------------------------------------------------------------------------
> [INFO] Compilation failure
> <https://builds.apache.org/job/CXF-Trunk-JDK15/ws/trunk/rt/frontend/jaxrs/src/test/java/org/apache/cxf/jaxrs/provider/SourceProviderTest.java>:[90,17]
cannot find symbol
> symbol  : constructor InTransformReader(javax.xml.stream.XMLStreamReader,java.util.Map<java.lang.String,java.lang.String>,<nulltype>,boolean)
> location: class org.apache.cxf.staxutils.transform.InTransformReader
>
> [INFO] ------------------------------------------------------------------------
> [INFO] Trace
> org.apache.maven.BuildFailureException: Compilation failure
> <https://builds.apache.org/job/CXF-Trunk-JDK15/ws/trunk/rt/frontend/jaxrs/src/test/java/org/apache/cxf/jaxrs/provider/SourceProviderTest.java>:[90,17]
cannot find symbol
> symbol  : constructor InTransformReader(javax.xml.stream.XMLStreamReader,java.util.Map<java.lang.String,java.lang.String>,<nulltype>,boolean)
> location: class org.apache.cxf.staxutils.transform.InTransformReader
>
>        at org.apache.maven.lifecycle.DefaultLifecycleExecutor.executeGoals(DefaultLifecycleExecutor.java:715)
>        at org.apache.maven.lifecycle.DefaultLifecycleExecutor.executeGoalWithLifecycle(DefaultLifecycleExecutor.java:556)
>        at org.apache.maven.lifecycle.DefaultLifecycleExecutor.executeGoal(DefaultLifecycleExecutor.java:535)
>        at org.apache.maven.lifecycle.DefaultLifecycleExecutor.executeGoalAndHandleFailures(DefaultLifecycleExecutor.java:387)
>        at org.apache.maven.lifecycle.DefaultLifecycleExecutor.executeTaskSegments(DefaultLifecycleExecutor.java:348)
>        at org.apache.maven.lifecycle.DefaultLifecycleExecutor.execute(DefaultLifecycleExecutor.java:180)
>        at org.apache.maven.lifecycle.LifecycleExecutorInterceptor.execute(LifecycleExecutorInterceptor.java:65)
>        at org.apache.maven.DefaultMaven.doExecute(DefaultMaven.java:328)
>        at org.apache.maven.DefaultMaven.execute(DefaultMaven.java:138)
>        at org.apache.maven.cli.MavenCli.main(MavenCli.java:362)
>        at sun.reflect.NativeMethodAccessorImpl.invoke0(Native Method)
>        at sun.reflect.NativeMethodAccessorImpl.invoke(NativeMethodAccessorImpl.java:39)
>        at sun.reflect.DelegatingMethodAccessorImpl.invoke(DelegatingMethodAccessorImpl.java:25)
>        at java.lang.reflect.Method.invoke(Method.java:592)
>        at org.codehaus.classworlds.Launcher.launchEnhanced(Launcher.java:315)
>        at org.codehaus.classworlds.Launcher.launch(Launcher.java:255)
>        at hudson.maven.agent.Main.launch(Main.java:185)
>        at hudson.maven.MavenBuilder.call(MavenBuilder.java:164)
>        at hudson.maven.MavenModuleSetBuild$Builder.call(MavenModuleSetBuild.java:987)
>        at hudson.maven.MavenModuleSetBuild$Builder.call(MavenModuleSetBuild.java:918)
>        at hudson.remoting.UserRequest.perform(UserRequest.java:118)
>        at hudson.remoting.UserRequest.perform(UserRequest.java:48)
>        at hudson.remoting.Request$2.run(Request.java:270)
>        at java.util.concurrent.Executors$RunnableAdapter.call(Executors.java:417)
>        at java.util.concurrent.FutureTask$Sync.innerRun(FutureTask.java:269)
>        at java.util.concurrent.FutureTask.run(FutureTask.java:123)
>        at java.util.concurrent.ThreadPoolExecutor$Worker.runTask(ThreadPoolExecutor.java:651)
>        at java.util.concurrent.ThreadPoolExecutor$Worker.run(ThreadPoolExecutor.java:676)
>        at java.lang.Thread.run(Thread.java:595)
> Caused by: org.apache.maven.plugin.CompilationFailureException: Compilation failure
> <https://builds.apache.org/job/CXF-Trunk-JDK15/ws/trunk/rt/frontend/jaxrs/src/test/java/org/apache/cxf/jaxrs/provider/SourceProviderTest.java>:[90,17]
cannot find symbol
> symbol  : constructor InTransformReader(javax.xml.stream.XMLStreamReader,java.util.Map<java.lang.String,java.lang.String>,<nulltype>,boolean)
> location: class org.apache.cxf.staxutils.transform.InTransformReader
>
>        at org.apache.maven.plugin.AbstractCompilerMojo.execute(AbstractCompilerMojo.java:656)
>        at org.apache.maven.plugin.TestCompilerMojo.execute(TestCompilerMojo.java:161)
>        at org.apache.maven.plugin.DefaultPluginManager.executeMojo(DefaultPluginManager.java:490)
>        at hudson.maven.agent.PluginManagerInterceptor.executeMojo(PluginManagerInterceptor.java:182)
>        at org.apache.maven.lifecycle.DefaultLifecycleExecutor.executeGoals(DefaultLifecycleExecutor.java:694)
>        ... 28 more
> [INFO] ------------------------------------------------------------------------
> [INFO] Total time: 9 minutes 6 seconds
> [INFO] Finished at: Thu Jul 28 16:34:18 UTC 2011
> [INFO] Final Memory: 164M/214M
> [INFO] ------------------------------------------------------------------------
> Waiting for Jenkins to finish collecting data
> Sending e-mails to: notifications@cxf.apache.org
> channel stopped
> [locks-and-latches] Releasing all the locks
> [locks-and-latches] All the locks released
>
>

Mime
View raw message