cxf-dev mailing list archives

Site index · List index
Message view « Date » · « Thread »
Top « Date » · « Thread »
From Dennis Sosnoski <...@sosnoski.com>
Subject Build failures in Corba
Date Sun, 23 Jan 2011 07:37:45 GMT
I'm trying to run a full build to test some code changes, but I'm
getting massive failures in the rt/bindings/corba (110 errors). I'm
running on OpenSuse Linux 11.3, and I've tried both Sun's jdk1.5.0_15
and jdk1.6.0_10 and Maven 2.0.11 and 2.2.1. It looks like this code is
trying to use "linux" as my host name (see bottom). Here's the first of
the reports:

<?xml version="1.0" encoding="UTF-8" ?>
<testsuite failures="0" time="16.509" errors="13" skipped="0" tests="13"
name="org.apache.cxf.binding.corba.CorbaConduitTest">
  <properties>
    <property name="java.runtime.name" value="Java(TM) SE Runtime
Environment"/>
    <property name="sun.boot.library.path"
value="/usr/java/jdk1.6.0_10/jre/lib/i386"/>
    <property name="java.vm.version" value="11.0-b15"/>
    <property name="java.vm.vendor" value="Sun Microsystems Inc."/>
    <property name="java.vendor.url" value="http://java.sun.com/"/>
    <property name="path.separator" value=":"/>
    <property name="java.vm.name" value="Java HotSpot(TM) Server VM"/>
    <property name="file.encoding.pkg" value="sun.io"/>
    <property name="java.util.logging.config.file"
value="/secure/dennis/projects/cxf/rt/bindings/corba/target/test-classes/logging.properties"/>
    <property name="user.country" value="US"/>
    <property name="sun.java.launcher" value="SUN_STANDARD"/>
    <property name="sun.os.patch.level" value="unknown"/>
    <property name="java.vm.specification.name" value="Java Virtual
Machine Specification"/>
    <property name="user.dir"
value="/secure/dennis/projects/cxf/rt/bindings/corba"/>
    <property name="java.runtime.version" value="1.6.0_10-b33"/>
    <property name="derby.system.home"
value="/secure/dennis/projects/cxf/rt/bindings/corba/target/derby"/>
    <property name="java.awt.graphicsenv"
value="sun.awt.X11GraphicsEnvironment"/>
    <property name="basedir"
value="/secure/dennis/projects/cxf/rt/bindings/corba"/>
    <property name="java.endorsed.dirs"
value="/usr/java/jdk1.6.0_10/jre/lib/endorsed"/>
    <property name="os.arch" value="i386"/>
    <property name="surefire.real.class.path"
value="/secure/dennis/projects/cxf/rt/bindings/corba/target/surefire/surefirebooter38173.jar"/>
    <property
name="org.apache.ws.commons.schema.protectReadOnlyCollections"
value="false"/>
    <property name="java.io.tmpdir" value="/tmp"/>
    <property name="line.separator" value="
"/>
    <property name="java.vm.specification.vendor" value="Sun
Microsystems Inc."/>
    <property name="os.name" value="Linux"/>
    <property name="sun.jnu.encoding" value="UTF-8"/>
    <property name="java.library.path"
value="/usr/java/jdk1.6.0_10/jre/lib/i386/server:/usr/java/jdk1.6.0_10/jre/lib/i386:/usr/java/jdk1.6.0_10/jre/../lib/i386:/usr/java/packages/lib/i386:/lib:/usr/lib"/>
    <property name="surefire.test.class.path"
value="/secure/dennis/projects/cxf/rt/bindings/corba/target/test-classes:/secure/dennis/projects/cxf/rt/bindings/corba/target/classes:/home/dennis/.m2/repository/junit/junit/4.8.1/junit-4.8.1.jar:/secure/dennis/projects/cxf/common/common/target/cxf-common-utilities-2.4.0-SNAPSHOT.jar:/home/dennis/.m2/repository/org/apache/ws/xmlschema/xmlschema-core/2.0-SNAPSHOT/xmlschema-core-2.0-SNAPSHOT.jar:/home/dennis/.m2/repository/org/codehaus/woodstox/woodstox-core-asl/4.0.8/woodstox-core-asl-4.0.8.jar:/home/dennis/.m2/repository/org/codehaus/woodstox/stax2-api/3.0.2/stax2-api-3.0.2.jar:/secure/dennis/projects/cxf/rt/frontend/jaxws/target/cxf-rt-frontend-jaxws-2.4.0-SNAPSHOT.jar:/home/dennis/.m2/repository/xml-resolver/xml-resolver/1.2/xml-resolver-1.2.jar:/home/dennis/.m2/repository/asm/asm/3.3/asm-3.3.jar:/secure/dennis/projects/cxf/api/target/cxf-api-2.4.0-SNAPSHOT.jar:/home/dennis/.m2/repository/org/apache/neethi/neethi/2.0.4/neethi-2.0.4.jar:/home/dennis/.m2/repository/wsdl4j/wsdl4j/1.6.2/wsdl4j-1.6.2.jar:/home/dennis/.m2/repository/commons-logging/commons-logging/1.1.1/commons-logging-1.1.1.jar:/secure/dennis/projects/cxf/common/schemas/target/cxf-common-schemas-2.4.0-SNAPSHOT.jar:/secure/dennis/projects/cxf/rt/core/target/cxf-rt-core-2.4.0-SNAPSHOT.jar:/home/dennis/.m2/repository/com/sun/xml/bind/jaxb-impl/2.1.13/jaxb-impl-2.1.13.jar:/home/dennis/.m2/repository/org/apache/geronimo/specs/geronimo-javamail_1.4_spec/1.7.1/geronimo-javamail_1.4_spec-1.7.1.jar:/secure/dennis/projects/cxf/rt/bindings/soap/target/cxf-rt-bindings-soap-2.4.0-SNAPSHOT.jar:/secure/dennis/projects/cxf/tools/common/target/cxf-tools-common-2.4.0-SNAPSHOT.jar:/secure/dennis/projects/cxf/rt/databinding/jaxb/target/cxf-rt-databinding-jaxb-2.4.0-SNAPSHOT.jar:/secure/dennis/projects/cxf/rt/bindings/xml/target/cxf-rt-bindings-xml-2.4.0-SNAPSHOT.jar:/secure/dennis/projects/cxf/rt/frontend/simple/target/cxf-rt-frontend-simple-2.4.0-SNAPSHOT.jar:/secure/dennis/projects/cxf/rt/transports/http/target/cxf-rt-transports-http-2.4.0-SNAPSHOT.jar:/secure/dennis/projects/cxf/rt/transports/common/target/cxf-rt-transports-common-2.4.0-SNAPSHOT.jar:/home/dennis/.m2/repository/org/springframework/spring-web/3.0.5.RELEASE/spring-web-3.0.5.RELEASE.jar:/home/dennis/.m2/repository/aopalliance/aopalliance/1.0/aopalliance-1.0.jar:/home/dennis/.m2/repository/org/springframework/spring-beans/3.0.5.RELEASE/spring-beans-3.0.5.RELEASE.jar:/home/dennis/.m2/repository/org/springframework/spring-core/3.0.5.RELEASE/spring-core-3.0.5.RELEASE.jar:/home/dennis/.m2/repository/org/springframework/spring-asm/3.0.5.RELEASE/spring-asm-3.0.5.RELEASE.jar:/home/dennis/.m2/repository/org/springframework/spring-context/3.0.5.RELEASE/spring-context-3.0.5.RELEASE.jar:/home/dennis/.m2/repository/org/springframework/spring-aop/3.0.5.RELEASE/spring-aop-3.0.5.RELEASE.jar:/home/dennis/.m2/repository/org/springframework/spring-expression/3.0.5.RELEASE/spring-expression-3.0.5.RELEASE.jar:/secure/dennis/projects/cxf/rt/ws/addr/target/cxf-rt-ws-addr-2.4.0-SNAPSHOT.jar:/home/dennis/.m2/repository/com/sun/xml/bind/jaxb-xjc/2.1.13/jaxb-xjc-2.1.13.jar:/home/dennis/.m2/repository/org/easymock/easymockclassextension/2.4/easymockclassextension-2.4.jar:/home/dennis/.m2/repository/org/easymock/easymock/2.4/easymock-2.4.jar:/home/dennis/.m2/repository/cglib/cglib-nodep/2.1_3/cglib-nodep-2.1_3.jar:"/>
    <property name="org.apache.cxf.transports.http_jetty.DontClosePort"
value="false"/>
    <property name="java.specification.name" value="Java Platform API
Specification"/>
    <property name="java.class.version" value="50.0"/>
    <property name="sun.management.compiler" value="HotSpot Tiered
Compilers"/>
    <property name="os.version" value="2.6.34-12-desktop"/>
    <property name="user.home" value="/home/dennis"/>
    <property name="user.timezone" value="Pacific/Auckland"/>
    <property name="java.awt.printerjob" value="sun.print.PSPrinterJob"/>
    <property name="java.specification.version" value="1.6"/>
    <property name="file.encoding" value="UTF-8"/>
    <property name="server.launcher.vmargs" value="-ea"/>
    <property name="user.name" value="dennis"/>
    <property name="java.class.path"
value="/secure/dennis/projects/cxf/rt/bindings/corba/target/test-classes:/secure/dennis/projects/cxf/rt/bindings/corba/target/classes:/home/dennis/.m2/repository/junit/junit/4.8.1/junit-4.8.1.jar:/secure/dennis/projects/cxf/common/common/target/cxf-common-utilities-2.4.0-SNAPSHOT.jar:/home/dennis/.m2/repository/org/apache/ws/xmlschema/xmlschema-core/2.0-SNAPSHOT/xmlschema-core-2.0-SNAPSHOT.jar:/home/dennis/.m2/repository/org/codehaus/woodstox/woodstox-core-asl/4.0.8/woodstox-core-asl-4.0.8.jar:/home/dennis/.m2/repository/org/codehaus/woodstox/stax2-api/3.0.2/stax2-api-3.0.2.jar:/secure/dennis/projects/cxf/rt/frontend/jaxws/target/cxf-rt-frontend-jaxws-2.4.0-SNAPSHOT.jar:/home/dennis/.m2/repository/xml-resolver/xml-resolver/1.2/xml-resolver-1.2.jar:/home/dennis/.m2/repository/asm/asm/3.3/asm-3.3.jar:/secure/dennis/projects/cxf/api/target/cxf-api-2.4.0-SNAPSHOT.jar:/home/dennis/.m2/repository/org/apache/neethi/neethi/2.0.4/neethi-2.0.4.jar:/home/dennis/.m2/repository/wsdl4j/wsdl4j/1.6.2/wsdl4j-1.6.2.jar:/home/dennis/.m2/repository/commons-logging/commons-logging/1.1.1/commons-logging-1.1.1.jar:/secure/dennis/projects/cxf/common/schemas/target/cxf-common-schemas-2.4.0-SNAPSHOT.jar:/secure/dennis/projects/cxf/rt/core/target/cxf-rt-core-2.4.0-SNAPSHOT.jar:/home/dennis/.m2/repository/com/sun/xml/bind/jaxb-impl/2.1.13/jaxb-impl-2.1.13.jar:/home/dennis/.m2/repository/org/apache/geronimo/specs/geronimo-javamail_1.4_spec/1.7.1/geronimo-javamail_1.4_spec-1.7.1.jar:/secure/dennis/projects/cxf/rt/bindings/soap/target/cxf-rt-bindings-soap-2.4.0-SNAPSHOT.jar:/secure/dennis/projects/cxf/tools/common/target/cxf-tools-common-2.4.0-SNAPSHOT.jar:/secure/dennis/projects/cxf/rt/databinding/jaxb/target/cxf-rt-databinding-jaxb-2.4.0-SNAPSHOT.jar:/secure/dennis/projects/cxf/rt/bindings/xml/target/cxf-rt-bindings-xml-2.4.0-SNAPSHOT.jar:/secure/dennis/projects/cxf/rt/frontend/simple/target/cxf-rt-frontend-simple-2.4.0-SNAPSHOT.jar:/secure/dennis/projects/cxf/rt/transports/http/target/cxf-rt-transports-http-2.4.0-SNAPSHOT.jar:/secure/dennis/projects/cxf/rt/transports/common/target/cxf-rt-transports-common-2.4.0-SNAPSHOT.jar:/home/dennis/.m2/repository/org/springframework/spring-web/3.0.5.RELEASE/spring-web-3.0.5.RELEASE.jar:/home/dennis/.m2/repository/aopalliance/aopalliance/1.0/aopalliance-1.0.jar:/home/dennis/.m2/repository/org/springframework/spring-beans/3.0.5.RELEASE/spring-beans-3.0.5.RELEASE.jar:/home/dennis/.m2/repository/org/springframework/spring-core/3.0.5.RELEASE/spring-core-3.0.5.RELEASE.jar:/home/dennis/.m2/repository/org/springframework/spring-asm/3.0.5.RELEASE/spring-asm-3.0.5.RELEASE.jar:/home/dennis/.m2/repository/org/springframework/spring-context/3.0.5.RELEASE/spring-context-3.0.5.RELEASE.jar:/home/dennis/.m2/repository/org/springframework/spring-aop/3.0.5.RELEASE/spring-aop-3.0.5.RELEASE.jar:/home/dennis/.m2/repository/org/springframework/spring-expression/3.0.5.RELEASE/spring-expression-3.0.5.RELEASE.jar:/secure/dennis/projects/cxf/rt/ws/addr/target/cxf-rt-ws-addr-2.4.0-SNAPSHOT.jar:/home/dennis/.m2/repository/com/sun/xml/bind/jaxb-xjc/2.1.13/jaxb-xjc-2.1.13.jar:/home/dennis/.m2/repository/org/easymock/easymockclassextension/2.4/easymockclassextension-2.4.jar:/home/dennis/.m2/repository/org/easymock/easymock/2.4/easymock-2.4.jar:/home/dennis/.m2/repository/cglib/cglib-nodep/2.1_3/cglib-nodep-2.1_3.jar:"/>
    <property name="java.vm.specification.version" value="1.0"/>
    <property name="sun.arch.data.model" value="32"/>
    <property name="java.home" value="/usr/java/jdk1.6.0_10/jre"/>
    <property name="java.specification.vendor" value="Sun Microsystems
Inc."/>
    <property name="user.language" value="en"/>
    <property name="java.vm.info" value="mixed mode"/>
    <property name="java.version" value="1.6.0_10"/>
    <property name="java.ext.dirs"
value="/usr/java/jdk1.6.0_10/jre/lib/ext:/usr/java/packages/lib/ext"/>
    <property name="sun.boot.class.path"
value="/usr/java/jdk1.6.0_10/jre/lib/resources.jar:/usr/java/jdk1.6.0_10/jre/lib/rt.jar:/usr/java/jdk1.6.0_10/jre/lib/sunrsasign.jar:/usr/java/jdk1.6.0_10/jre/lib/jsse.jar:/usr/java/jdk1.6.0_10/jre/lib/jce.jar:/usr/java/jdk1.6.0_10/jre/lib/charsets.jar:/usr/java/jdk1.6.0_10/jre/classes"/>
    <property name="java.vendor" value="Sun Microsystems Inc."/>
    <property name="localRepository" value="/home/dennis/.m2/repository"/>
    <property name="file.separator" value="/"/>
    <property name="java.vendor.url.bug"
value="http://java.sun.com/cgi-bin/bugreport.cgi"/>
    <property name="spring.validation.mode" value="VALIDATION_AUTO"/>
    <property name="sun.cpu.endian" value="little"/>
    <property name="sun.io.unicode.encoding" value="UnicodeLittle"/>
    <property name="useRandomPorts" value="true"/>
    <property name="org.apache.activemq.default.directory.prefix"
value="/secure/dennis/projects/cxf/rt/bindings/corba/target/ActiveMQ/"/>
    <property name="yoko.orb.id" value="CXF-CORBA-Server-Binding"/>
    <property name="sun.cpu.isalist" value=""/>
  </properties>
  <testcase time="0.68"
classname="org.apache.cxf.binding.corba.CorbaConduitTest"
name="testCorbaConduit">
    <error message=""
type="org.omg.CORBA.INTERNAL">org.omg.CORBA.INTERNAL:   vmcid: SUN 
minor code: 208  completed: No
    at
com.sun.corba.se.impl.logging.ORBUtilSystemException.getLocalHostFailed(ORBUtilSystemException.java:3843)
    at
com.sun.corba.se.impl.logging.ORBUtilSystemException.getLocalHostFailed(ORBUtilSystemException.java:3861)
    at com.sun.corba.se.impl.orb.ORBImpl.getLocalHostName(ORBImpl.java:1585)
    at com.sun.corba.se.impl.orb.ORBImpl.set_parameters(ORBImpl.java:536)
    at org.omg.CORBA.ORB.init(ORB.java:337)
    at
org.apache.cxf.binding.corba.CorbaConduitTest.setUp(CorbaConduitTest.java:88)
    at sun.reflect.NativeMethodAccessorImpl.invoke0(Native Method)
    at
sun.reflect.NativeMethodAccessorImpl.invoke(NativeMethodAccessorImpl.java:39)
    at
sun.reflect.DelegatingMethodAccessorImpl.invoke(DelegatingMethodAccessorImpl.java:25)
    at java.lang.reflect.Method.invoke(Method.java:597)
    at
org.junit.runners.model.FrameworkMethod$1.runReflectiveCall(FrameworkMethod.java:44)
    at
org.junit.internal.runners.model.ReflectiveCallable.run(ReflectiveCallable.java:15)
    at
org.junit.runners.model.FrameworkMethod.invokeExplosively(FrameworkMethod.java:41)
    at
org.junit.internal.runners.statements.RunBefores.evaluate(RunBefores.java:27)
    at
org.junit.internal.runners.statements.RunAfters.evaluate(RunAfters.java:31)
    at
org.junit.runners.BlockJUnit4ClassRunner.runChild(BlockJUnit4ClassRunner.java:76)
    at
org.junit.runners.BlockJUnit4ClassRunner.runChild(BlockJUnit4ClassRunner.java:50)
    at org.junit.runners.ParentRunner$3.run(ParentRunner.java:193)
    at org.junit.runners.ParentRunner$1.schedule(ParentRunner.java:52)
    at org.junit.runners.ParentRunner.runChildren(ParentRunner.java:191)
    at org.junit.runners.ParentRunner.access$000(ParentRunner.java:42)
    at org.junit.runners.ParentRunner$2.evaluate(ParentRunner.java:184)
    at org.junit.runners.ParentRunner.run(ParentRunner.java:236)
    at
org.apache.maven.surefire.junit4.JUnit4TestSet.execute(JUnit4TestSet.java:35)
    at
org.apache.maven.surefire.junit4.JUnit4Provider.executeTestSet(JUnit4Provider.java:146)
    at
org.apache.maven.surefire.junit4.JUnit4Provider.invoke(JUnit4Provider.java:97)
    at sun.reflect.NativeMethodAccessorImpl.invoke0(Native Method)
    at
sun.reflect.NativeMethodAccessorImpl.invoke(NativeMethodAccessorImpl.java:39)
    at
sun.reflect.DelegatingMethodAccessorImpl.invoke(DelegatingMethodAccessorImpl.java:25)
    at java.lang.reflect.Method.invoke(Method.java:597)
    at
org.apache.maven.surefire.booter.ProviderFactory$ClassLoaderProxy.invoke(ProviderFactory.java:103)
    at $Proxy0.invoke(Unknown Source)
    at
org.apache.maven.surefire.booter.SurefireStarter.invokeProvider(SurefireStarter.java:145)
    at
org.apache.maven.surefire.booter.SurefireStarter.runSuitesInProcess(SurefireStarter.java:87)
    at
org.apache.maven.surefire.booter.ForkedBooter.main(ForkedBooter.java:69)
Caused by: java.net.UnknownHostException: linux: linux
    at java.net.InetAddress.getLocalHost(InetAddress.java:1353)
    at com.sun.corba.se.impl.orb.ORBImpl.getLocalHostName(ORBImpl.java:1583)
    ... 32 more
</error>
    <system-out>
-------------------------------------------------------
 T E S T S
-------------------------------------------------------
Running org.apache.cxf.binding.corba.CorbaConduitTest
</system-out>
  </testcase>
  <testcase time="0.054"
classname="org.apache.cxf.binding.corba.CorbaConduitTest"
name="testPrepare">
    <error message=""
type="org.omg.CORBA.INTERNAL">org.omg.CORBA.INTERNAL:   vmcid: SUN 
minor code: 208  completed: No
    at
com.sun.corba.se.impl.logging.ORBUtilSystemException.getLocalHostFailed(ORBUtilSystemException.java:3843)
    at
com.sun.corba.se.impl.logging.ORBUtilSystemException.getLocalHostFailed(ORBUtilSystemException.java:3861)
    at com.sun.corba.se.impl.orb.ORBImpl.getLocalHostName(ORBImpl.java:1585)
    at com.sun.corba.se.impl.orb.ORBImpl.set_parameters(ORBImpl.java:536)
    at org.omg.CORBA.ORB.init(ORB.java:337)
    at
org.apache.cxf.binding.corba.CorbaConduitTest.setUp(CorbaConduitTest.java:88)
    at sun.reflect.NativeMethodAccessorImpl.invoke0(Native Method)
    at
sun.reflect.NativeMethodAccessorImpl.invoke(NativeMethodAccessorImpl.java:39)
    at
sun.reflect.DelegatingMethodAccessorImpl.invoke(DelegatingMethodAccessorImpl.java:25)
    at java.lang.reflect.Method.invoke(Method.java:597)
    at
org.junit.runners.model.FrameworkMethod$1.runReflectiveCall(FrameworkMethod.java:44)
    at
org.junit.internal.runners.model.ReflectiveCallable.run(ReflectiveCallable.java:15)
    at
org.junit.runners.model.FrameworkMethod.invokeExplosively(FrameworkMethod.java:41)
    at
org.junit.internal.runners.statements.RunBefores.evaluate(RunBefores.java:27)
    at
org.junit.internal.runners.statements.RunAfters.evaluate(RunAfters.java:31)
    at
org.junit.runners.BlockJUnit4ClassRunner.runChild(BlockJUnit4ClassRunner.java:76)
    at
org.junit.runners.BlockJUnit4ClassRunner.runChild(BlockJUnit4ClassRunner.java:50)
    at org.junit.runners.ParentRunner$3.run(ParentRunner.java:193)
    at org.junit.runners.ParentRunner$1.schedule(ParentRunner.java:52)
    at org.junit.runners.ParentRunner.runChildren(ParentRunner.java:191)
    at org.junit.runners.ParentRunner.access$000(ParentRunner.java:42)
    at org.junit.runners.ParentRunner$2.evaluate(ParentRunner.java:184)
    at org.junit.runners.ParentRunner.run(ParentRunner.java:236)
    at
org.apache.maven.surefire.junit4.JUnit4TestSet.execute(JUnit4TestSet.java:35)
    at
org.apache.maven.surefire.junit4.JUnit4Provider.executeTestSet(JUnit4Provider.java:146)
    at
org.apache.maven.surefire.junit4.JUnit4Provider.invoke(JUnit4Provider.java:97)
    at sun.reflect.NativeMethodAccessorImpl.invoke0(Native Method)
    at
sun.reflect.NativeMethodAccessorImpl.invoke(NativeMethodAccessorImpl.java:39)
    at
sun.reflect.DelegatingMethodAccessorImpl.invoke(DelegatingMethodAccessorImpl.java:25)
    at java.lang.reflect.Method.invoke(Method.java:597)
    at
org.apache.maven.surefire.booter.ProviderFactory$ClassLoaderProxy.invoke(ProviderFactory.java:103)
    at $Proxy0.invoke(Unknown Source)
    at
org.apache.maven.surefire.booter.SurefireStarter.invokeProvider(SurefireStarter.java:145)
    at
org.apache.maven.surefire.booter.SurefireStarter.runSuitesInProcess(SurefireStarter.java:87)
    at
org.apache.maven.surefire.booter.ForkedBooter.main(ForkedBooter.java:69)
Caused by: java.net.UnknownHostException: linux: linux
    at java.net.InetAddress.getLocalHost(InetAddress.java:1353)
    at com.sun.corba.se.impl.orb.ORBImpl.getLocalHostName(ORBImpl.java:1583)
    ... 32 more
</error>
  </testcase>
  <testcase time="10.117"
classname="org.apache.cxf.binding.corba.CorbaConduitTest"
name="testGetTargetReference">
    <error message=""
type="org.omg.CORBA.INTERNAL">org.omg.CORBA.INTERNAL:   vmcid: SUN 
minor code: 208  completed: No
    at
com.sun.corba.se.impl.logging.ORBUtilSystemException.getLocalHostFailed(ORBUtilSystemException.java:3843)
    at
com.sun.corba.se.impl.logging.ORBUtilSystemException.getLocalHostFailed(ORBUtilSystemException.java:3861)
    at com.sun.corba.se.impl.orb.ORBImpl.getLocalHostName(ORBImpl.java:1585)
    at com.sun.corba.se.impl.orb.ORBImpl.set_parameters(ORBImpl.java:536)
    at org.omg.CORBA.ORB.init(ORB.java:337)
    at
org.apache.cxf.binding.corba.CorbaConduitTest.setUp(CorbaConduitTest.java:88)
    at sun.reflect.NativeMethodAccessorImpl.invoke0(Native Method)
    at
sun.reflect.NativeMethodAccessorImpl.invoke(NativeMethodAccessorImpl.java:39)
    at
sun.reflect.DelegatingMethodAccessorImpl.invoke(DelegatingMethodAccessorImpl.java:25)
    at java.lang.reflect.Method.invoke(Method.java:597)
    at
org.junit.runners.model.FrameworkMethod$1.runReflectiveCall(FrameworkMethod.java:44)
    at
org.junit.internal.runners.model.ReflectiveCallable.run(ReflectiveCallable.java:15)
    at
org.junit.runners.model.FrameworkMethod.invokeExplosively(FrameworkMethod.java:41)
    at
org.junit.internal.runners.statements.RunBefores.evaluate(RunBefores.java:27)
    at
org.junit.internal.runners.statements.RunAfters.evaluate(RunAfters.java:31)
    at
org.junit.runners.BlockJUnit4ClassRunner.runChild(BlockJUnit4ClassRunner.java:76)
    at
org.junit.runners.BlockJUnit4ClassRunner.runChild(BlockJUnit4ClassRunner.java:50)
    at org.junit.runners.ParentRunner$3.run(ParentRunner.java:193)
    at org.junit.runners.ParentRunner$1.schedule(ParentRunner.java:52)
    at org.junit.runners.ParentRunner.runChildren(ParentRunner.java:191)
    at org.junit.runners.ParentRunner.access$000(ParentRunner.java:42)
    at org.junit.runners.ParentRunner$2.evaluate(ParentRunner.java:184)
    at org.junit.runners.ParentRunner.run(ParentRunner.java:236)
    at
org.apache.maven.surefire.junit4.JUnit4TestSet.execute(JUnit4TestSet.java:35)
    at
org.apache.maven.surefire.junit4.JUnit4Provider.executeTestSet(JUnit4Provider.java:146)
    at
org.apache.maven.surefire.junit4.JUnit4Provider.invoke(JUnit4Provider.java:97)
    at sun.reflect.NativeMethodAccessorImpl.invoke0(Native Method)
    at
sun.reflect.NativeMethodAccessorImpl.invoke(NativeMethodAccessorImpl.java:39)
    at
sun.reflect.DelegatingMethodAccessorImpl.invoke(DelegatingMethodAccessorImpl.java:25)
    at java.lang.reflect.Method.invoke(Method.java:597)
    at
org.apache.maven.surefire.booter.ProviderFactory$ClassLoaderProxy.invoke(ProviderFactory.java:103)
    at $Proxy0.invoke(Unknown Source)
    at
org.apache.maven.surefire.booter.SurefireStarter.invokeProvider(SurefireStarter.java:145)
    at
org.apache.maven.surefire.booter.SurefireStarter.runSuitesInProcess(SurefireStarter.java:87)
    at
org.apache.maven.surefire.booter.ForkedBooter.main(ForkedBooter.java:69)
Caused by: java.net.UnknownHostException: linux: linux
    at java.net.InetAddress.getLocalHost(InetAddress.java:1353)
    at com.sun.corba.se.impl.orb.ORBImpl.getLocalHostName(ORBImpl.java:1583)
    ... 32 more
</error>
  </testcase>
  <testcase time="0.057"
classname="org.apache.cxf.binding.corba.CorbaConduitTest"
name="testGetAddress">
    <error message=""
type="org.omg.CORBA.INTERNAL">org.omg.CORBA.INTERNAL:   vmcid: SUN 
minor code: 208  completed: No
    at
com.sun.corba.se.impl.logging.ORBUtilSystemException.getLocalHostFailed(ORBUtilSystemException.java:3843)
    at
com.sun.corba.se.impl.logging.ORBUtilSystemException.getLocalHostFailed(ORBUtilSystemException.java:3861)
    at com.sun.corba.se.impl.orb.ORBImpl.getLocalHostName(ORBImpl.java:1585)
    at com.sun.corba.se.impl.orb.ORBImpl.set_parameters(ORBImpl.java:536)
    at org.omg.CORBA.ORB.init(ORB.java:337)
    at
org.apache.cxf.binding.corba.CorbaConduitTest.setUp(CorbaConduitTest.java:88)
    at sun.reflect.NativeMethodAccessorImpl.invoke0(Native Method)
    at
sun.reflect.NativeMethodAccessorImpl.invoke(NativeMethodAccessorImpl.java:39)
    at
sun.reflect.DelegatingMethodAccessorImpl.invoke(DelegatingMethodAccessorImpl.java:25)
    at java.lang.reflect.Method.invoke(Method.java:597)
    at
org.junit.runners.model.FrameworkMethod$1.runReflectiveCall(FrameworkMethod.java:44)
    at
org.junit.internal.runners.model.ReflectiveCallable.run(ReflectiveCallable.java:15)
    at
org.junit.runners.model.FrameworkMethod.invokeExplosively(FrameworkMethod.java:41)
    at
org.junit.internal.runners.statements.RunBefores.evaluate(RunBefores.java:27)
    at
org.junit.internal.runners.statements.RunAfters.evaluate(RunAfters.java:31)
    at
org.junit.runners.BlockJUnit4ClassRunner.runChild(BlockJUnit4ClassRunner.java:76)
    at
org.junit.runners.BlockJUnit4ClassRunner.runChild(BlockJUnit4ClassRunner.java:50)
    at org.junit.runners.ParentRunner$3.run(ParentRunner.java:193)
    at org.junit.runners.ParentRunner$1.schedule(ParentRunner.java:52)
    at org.junit.runners.ParentRunner.runChildren(ParentRunner.java:191)
    at org.junit.runners.ParentRunner.access$000(ParentRunner.java:42)
    at org.junit.runners.ParentRunner$2.evaluate(ParentRunner.java:184)
    at org.junit.runners.ParentRunner.run(ParentRunner.java:236)
    at
org.apache.maven.surefire.junit4.JUnit4TestSet.execute(JUnit4TestSet.java:35)
    at
org.apache.maven.surefire.junit4.JUnit4Provider.executeTestSet(JUnit4Provider.java:146)
    at
org.apache.maven.surefire.junit4.JUnit4Provider.invoke(JUnit4Provider.java:97)
    at sun.reflect.NativeMethodAccessorImpl.invoke0(Native Method)
    at
sun.reflect.NativeMethodAccessorImpl.invoke(NativeMethodAccessorImpl.java:39)
    at
sun.reflect.DelegatingMethodAccessorImpl.invoke(DelegatingMethodAccessorImpl.java:25)
    at java.lang.reflect.Method.invoke(Method.java:597)
    at
org.apache.maven.surefire.booter.ProviderFactory$ClassLoaderProxy.invoke(ProviderFactory.java:103)
    at $Proxy0.invoke(Unknown Source)
    at
org.apache.maven.surefire.booter.SurefireStarter.invokeProvider(SurefireStarter.java:145)
    at
org.apache.maven.surefire.booter.SurefireStarter.runSuitesInProcess(SurefireStarter.java:87)
    at
org.apache.maven.surefire.booter.ForkedBooter.main(ForkedBooter.java:69)
Caused by: java.net.UnknownHostException: linux: linux
    at java.net.InetAddress.getLocalHost(InetAddress.java:1353)
    at com.sun.corba.se.impl.orb.ORBImpl.getLocalHostName(ORBImpl.java:1583)
    ... 32 more
</error>
  </testcase>
  <testcase time="0.054"
classname="org.apache.cxf.binding.corba.CorbaConduitTest" name="testClose">
    <error message=""
type="org.omg.CORBA.INTERNAL">org.omg.CORBA.INTERNAL:   vmcid: SUN 
minor code: 208  completed: No
    at
com.sun.corba.se.impl.logging.ORBUtilSystemException.getLocalHostFailed(ORBUtilSystemException.java:3843)
    at
com.sun.corba.se.impl.logging.ORBUtilSystemException.getLocalHostFailed(ORBUtilSystemException.java:3861)
    at com.sun.corba.se.impl.orb.ORBImpl.getLocalHostName(ORBImpl.java:1585)
    at com.sun.corba.se.impl.orb.ORBImpl.set_parameters(ORBImpl.java:536)
    at org.omg.CORBA.ORB.init(ORB.java:337)
    at
org.apache.cxf.binding.corba.CorbaConduitTest.setUp(CorbaConduitTest.java:88)
    at sun.reflect.NativeMethodAccessorImpl.invoke0(Native Method)
    at
sun.reflect.NativeMethodAccessorImpl.invoke(NativeMethodAccessorImpl.java:39)
    at
sun.reflect.DelegatingMethodAccessorImpl.invoke(DelegatingMethodAccessorImpl.java:25)
    at java.lang.reflect.Method.invoke(Method.java:597)
    at
org.junit.runners.model.FrameworkMethod$1.runReflectiveCall(FrameworkMethod.java:44)
    at
org.junit.internal.runners.model.ReflectiveCallable.run(ReflectiveCallable.java:15)
    at
org.junit.runners.model.FrameworkMethod.invokeExplosively(FrameworkMethod.java:41)
    at
org.junit.internal.runners.statements.RunBefores.evaluate(RunBefores.java:27)
    at
org.junit.internal.runners.statements.RunAfters.evaluate(RunAfters.java:31)
    at
org.junit.runners.BlockJUnit4ClassRunner.runChild(BlockJUnit4ClassRunner.java:76)
    at
org.junit.runners.BlockJUnit4ClassRunner.runChild(BlockJUnit4ClassRunner.java:50)
    at org.junit.runners.ParentRunner$3.run(ParentRunner.java:193)
    at org.junit.runners.ParentRunner$1.schedule(ParentRunner.java:52)
    at org.junit.runners.ParentRunner.runChildren(ParentRunner.java:191)
    at org.junit.runners.ParentRunner.access$000(ParentRunner.java:42)
    at org.junit.runners.ParentRunner$2.evaluate(ParentRunner.java:184)
    at org.junit.runners.ParentRunner.run(ParentRunner.java:236)
    at
org.apache.maven.surefire.junit4.JUnit4TestSet.execute(JUnit4TestSet.java:35)
    at
org.apache.maven.surefire.junit4.JUnit4Provider.executeTestSet(JUnit4Provider.java:146)
    at
org.apache.maven.surefire.junit4.JUnit4Provider.invoke(JUnit4Provider.java:97)
    at sun.reflect.NativeMethodAccessorImpl.invoke0(Native Method)
    at
sun.reflect.NativeMethodAccessorImpl.invoke(NativeMethodAccessorImpl.java:39)
    at
sun.reflect.DelegatingMethodAccessorImpl.invoke(DelegatingMethodAccessorImpl.java:25)
    at java.lang.reflect.Method.invoke(Method.java:597)
    at
org.apache.maven.surefire.booter.ProviderFactory$ClassLoaderProxy.invoke(ProviderFactory.java:103)
    at $Proxy0.invoke(Unknown Source)
    at
org.apache.maven.surefire.booter.SurefireStarter.invokeProvider(SurefireStarter.java:145)
    at
org.apache.maven.surefire.booter.SurefireStarter.runSuitesInProcess(SurefireStarter.java:87)
    at
org.apache.maven.surefire.booter.ForkedBooter.main(ForkedBooter.java:69)
Caused by: java.net.UnknownHostException: linux: linux
    at java.net.InetAddress.getLocalHost(InetAddress.java:1353)
    at com.sun.corba.se.impl.orb.ORBImpl.getLocalHostName(ORBImpl.java:1583)
    ... 32 more
</error>
  </testcase>
  <testcase time="5.103"
classname="org.apache.cxf.binding.corba.CorbaConduitTest"
name="testGetTarget">
    <error message=""
type="org.omg.CORBA.INTERNAL">org.omg.CORBA.INTERNAL:   vmcid: SUN 
minor code: 208  completed: No
    at
com.sun.corba.se.impl.logging.ORBUtilSystemException.getLocalHostFailed(ORBUtilSystemException.java:3843)
    at
com.sun.corba.se.impl.logging.ORBUtilSystemException.getLocalHostFailed(ORBUtilSystemException.java:3861)
    at com.sun.corba.se.impl.orb.ORBImpl.getLocalHostName(ORBImpl.java:1585)
    at com.sun.corba.se.impl.orb.ORBImpl.set_parameters(ORBImpl.java:536)
    at org.omg.CORBA.ORB.init(ORB.java:337)
    at
org.apache.cxf.binding.corba.CorbaConduitTest.setUp(CorbaConduitTest.java:88)
    at sun.reflect.NativeMethodAccessorImpl.invoke0(Native Method)
    at
sun.reflect.NativeMethodAccessorImpl.invoke(NativeMethodAccessorImpl.java:39)
    at
sun.reflect.DelegatingMethodAccessorImpl.invoke(DelegatingMethodAccessorImpl.java:25)
    at java.lang.reflect.Method.invoke(Method.java:597)
    at
org.junit.runners.model.FrameworkMethod$1.runReflectiveCall(FrameworkMethod.java:44)
    at
org.junit.internal.runners.model.ReflectiveCallable.run(ReflectiveCallable.java:15)
    at
org.junit.runners.model.FrameworkMethod.invokeExplosively(FrameworkMethod.java:41)
    at
org.junit.internal.runners.statements.RunBefores.evaluate(RunBefores.java:27)
    at
org.junit.internal.runners.statements.RunAfters.evaluate(RunAfters.java:31)
    at
org.junit.runners.BlockJUnit4ClassRunner.runChild(BlockJUnit4ClassRunner.java:76)
    at
org.junit.runners.BlockJUnit4ClassRunner.runChild(BlockJUnit4ClassRunner.java:50)
    at org.junit.runners.ParentRunner$3.run(ParentRunner.java:193)
    at org.junit.runners.ParentRunner$1.schedule(ParentRunner.java:52)
    at org.junit.runners.ParentRunner.runChildren(ParentRunner.java:191)
    at org.junit.runners.ParentRunner.access$000(ParentRunner.java:42)
    at org.junit.runners.ParentRunner$2.evaluate(ParentRunner.java:184)
    at org.junit.runners.ParentRunner.run(ParentRunner.java:236)
    at
org.apache.maven.surefire.junit4.JUnit4TestSet.execute(JUnit4TestSet.java:35)
    at
org.apache.maven.surefire.junit4.JUnit4Provider.executeTestSet(JUnit4Provider.java:146)
    at
org.apache.maven.surefire.junit4.JUnit4Provider.invoke(JUnit4Provider.java:97)
    at sun.reflect.NativeMethodAccessorImpl.invoke0(Native Method)
    at
sun.reflect.NativeMethodAccessorImpl.invoke(NativeMethodAccessorImpl.java:39)
    at
sun.reflect.DelegatingMethodAccessorImpl.invoke(DelegatingMethodAccessorImpl.java:25)
    at java.lang.reflect.Method.invoke(Method.java:597)
    at
org.apache.maven.surefire.booter.ProviderFactory$ClassLoaderProxy.invoke(ProviderFactory.java:103)
    at $Proxy0.invoke(Unknown Source)
    at
org.apache.maven.surefire.booter.SurefireStarter.invokeProvider(SurefireStarter.java:145)
    at
org.apache.maven.surefire.booter.SurefireStarter.runSuitesInProcess(SurefireStarter.java:87)
    at
org.apache.maven.surefire.booter.ForkedBooter.main(ForkedBooter.java:69)
Caused by: java.net.UnknownHostException: linux: linux
    at java.net.InetAddress.getLocalHost(InetAddress.java:1353)
    at com.sun.corba.se.impl.orb.ORBImpl.getLocalHostName(ORBImpl.java:1583)
    ... 32 more
</error>
  </testcase>
  <testcase time="0.053"
classname="org.apache.cxf.binding.corba.CorbaConduitTest"
name="testGetOperationExceptions">
    <error message=""
type="org.omg.CORBA.INTERNAL">org.omg.CORBA.INTERNAL:   vmcid: SUN 
minor code: 208  completed: No
    at
com.sun.corba.se.impl.logging.ORBUtilSystemException.getLocalHostFailed(ORBUtilSystemException.java:3843)
    at
com.sun.corba.se.impl.logging.ORBUtilSystemException.getLocalHostFailed(ORBUtilSystemException.java:3861)
    at com.sun.corba.se.impl.orb.ORBImpl.getLocalHostName(ORBImpl.java:1585)
    at com.sun.corba.se.impl.orb.ORBImpl.set_parameters(ORBImpl.java:536)
    at org.omg.CORBA.ORB.init(ORB.java:337)
    at
org.apache.cxf.binding.corba.CorbaConduitTest.setUp(CorbaConduitTest.java:88)
    at sun.reflect.NativeMethodAccessorImpl.invoke0(Native Method)
    at
sun.reflect.NativeMethodAccessorImpl.invoke(NativeMethodAccessorImpl.java:39)
    at
sun.reflect.DelegatingMethodAccessorImpl.invoke(DelegatingMethodAccessorImpl.java:25)
    at java.lang.reflect.Method.invoke(Method.java:597)
    at
org.junit.runners.model.FrameworkMethod$1.runReflectiveCall(FrameworkMethod.java:44)
    at
org.junit.internal.runners.model.ReflectiveCallable.run(ReflectiveCallable.java:15)
    at
org.junit.runners.model.FrameworkMethod.invokeExplosively(FrameworkMethod.java:41)
    at
org.junit.internal.runners.statements.RunBefores.evaluate(RunBefores.java:27)
    at
org.junit.internal.runners.statements.RunAfters.evaluate(RunAfters.java:31)
    at
org.junit.runners.BlockJUnit4ClassRunner.runChild(BlockJUnit4ClassRunner.java:76)
    at
org.junit.runners.BlockJUnit4ClassRunner.runChild(BlockJUnit4ClassRunner.java:50)
    at org.junit.runners.ParentRunner$3.run(ParentRunner.java:193)
    at org.junit.runners.ParentRunner$1.schedule(ParentRunner.java:52)
    at org.junit.runners.ParentRunner.runChildren(ParentRunner.java:191)
    at org.junit.runners.ParentRunner.access$000(ParentRunner.java:42)
    at org.junit.runners.ParentRunner$2.evaluate(ParentRunner.java:184)
    at org.junit.runners.ParentRunner.run(ParentRunner.java:236)
    at
org.apache.maven.surefire.junit4.JUnit4TestSet.execute(JUnit4TestSet.java:35)
    at
org.apache.maven.surefire.junit4.JUnit4Provider.executeTestSet(JUnit4Provider.java:146)
    at
org.apache.maven.surefire.junit4.JUnit4Provider.invoke(JUnit4Provider.java:97)
    at sun.reflect.NativeMethodAccessorImpl.invoke0(Native Method)
    at
sun.reflect.NativeMethodAccessorImpl.invoke(NativeMethodAccessorImpl.java:39)
    at
sun.reflect.DelegatingMethodAccessorImpl.invoke(DelegatingMethodAccessorImpl.java:25)
    at java.lang.reflect.Method.invoke(Method.java:597)
    at
org.apache.maven.surefire.booter.ProviderFactory$ClassLoaderProxy.invoke(ProviderFactory.java:103)
    at $Proxy0.invoke(Unknown Source)
    at
org.apache.maven.surefire.booter.SurefireStarter.invokeProvider(SurefireStarter.java:145)
    at
org.apache.maven.surefire.booter.SurefireStarter.runSuitesInProcess(SurefireStarter.java:87)
    at
org.apache.maven.surefire.booter.ForkedBooter.main(ForkedBooter.java:69)
Caused by: java.net.UnknownHostException: linux: linux
    at java.net.InetAddress.getLocalHost(InetAddress.java:1353)
    at com.sun.corba.se.impl.orb.ORBImpl.getLocalHostName(ORBImpl.java:1583)
    ... 32 more
</error>
  </testcase>
  <testcase time="0.052"
classname="org.apache.cxf.binding.corba.CorbaConduitTest"
name="testBuildRequest">
    <error message=""
type="org.omg.CORBA.INTERNAL">org.omg.CORBA.INTERNAL:   vmcid: SUN 
minor code: 208  completed: No
    at
com.sun.corba.se.impl.logging.ORBUtilSystemException.getLocalHostFailed(ORBUtilSystemException.java:3843)
    at
com.sun.corba.se.impl.logging.ORBUtilSystemException.getLocalHostFailed(ORBUtilSystemException.java:3861)
    at com.sun.corba.se.impl.orb.ORBImpl.getLocalHostName(ORBImpl.java:1585)
    at com.sun.corba.se.impl.orb.ORBImpl.set_parameters(ORBImpl.java:536)
    at org.omg.CORBA.ORB.init(ORB.java:337)
    at
org.apache.cxf.binding.corba.CorbaConduitTest.setUp(CorbaConduitTest.java:88)
    at sun.reflect.NativeMethodAccessorImpl.invoke0(Native Method)
    at
sun.reflect.NativeMethodAccessorImpl.invoke(NativeMethodAccessorImpl.java:39)
    at
sun.reflect.DelegatingMethodAccessorImpl.invoke(DelegatingMethodAccessorImpl.java:25)
    at java.lang.reflect.Method.invoke(Method.java:597)
    at
org.junit.runners.model.FrameworkMethod$1.runReflectiveCall(FrameworkMethod.java:44)
    at
org.junit.internal.runners.model.ReflectiveCallable.run(ReflectiveCallable.java:15)
    at
org.junit.runners.model.FrameworkMethod.invokeExplosively(FrameworkMethod.java:41)
    at
org.junit.internal.runners.statements.RunBefores.evaluate(RunBefores.java:27)
    at
org.junit.internal.runners.statements.RunAfters.evaluate(RunAfters.java:31)
    at
org.junit.runners.BlockJUnit4ClassRunner.runChild(BlockJUnit4ClassRunner.java:76)
    at
org.junit.runners.BlockJUnit4ClassRunner.runChild(BlockJUnit4ClassRunner.java:50)
    at org.junit.runners.ParentRunner$3.run(ParentRunner.java:193)
    at org.junit.runners.ParentRunner$1.schedule(ParentRunner.java:52)
    at org.junit.runners.ParentRunner.runChildren(ParentRunner.java:191)
    at org.junit.runners.ParentRunner.access$000(ParentRunner.java:42)
    at org.junit.runners.ParentRunner$2.evaluate(ParentRunner.java:184)
    at org.junit.runners.ParentRunner.run(ParentRunner.java:236)
    at
org.apache.maven.surefire.junit4.JUnit4TestSet.execute(JUnit4TestSet.java:35)
    at
org.apache.maven.surefire.junit4.JUnit4Provider.executeTestSet(JUnit4Provider.java:146)
    at
org.apache.maven.surefire.junit4.JUnit4Provider.invoke(JUnit4Provider.java:97)
    at sun.reflect.NativeMethodAccessorImpl.invoke0(Native Method)
    at
sun.reflect.NativeMethodAccessorImpl.invoke(NativeMethodAccessorImpl.java:39)
    at
sun.reflect.DelegatingMethodAccessorImpl.invoke(DelegatingMethodAccessorImpl.java:25)
    at java.lang.reflect.Method.invoke(Method.java:597)
    at
org.apache.maven.surefire.booter.ProviderFactory$ClassLoaderProxy.invoke(ProviderFactory.java:103)
    at $Proxy0.invoke(Unknown Source)
    at
org.apache.maven.surefire.booter.SurefireStarter.invokeProvider(SurefireStarter.java:145)
    at
org.apache.maven.surefire.booter.SurefireStarter.runSuitesInProcess(SurefireStarter.java:87)
    at
org.apache.maven.surefire.booter.ForkedBooter.main(ForkedBooter.java:69)
Caused by: java.net.UnknownHostException: linux: linux
    at java.net.InetAddress.getLocalHost(InetAddress.java:1353)
    at com.sun.corba.se.impl.orb.ORBImpl.getLocalHostName(ORBImpl.java:1583)
    ... 32 more
</error>
  </testcase>
  <testcase time="0.056"
classname="org.apache.cxf.binding.corba.CorbaConduitTest"
name="testBuildArguments">
    <error message=""
type="org.omg.CORBA.INTERNAL">org.omg.CORBA.INTERNAL:   vmcid: SUN 
minor code: 208  completed: No
    at
com.sun.corba.se.impl.logging.ORBUtilSystemException.getLocalHostFailed(ORBUtilSystemException.java:3843)
    at
com.sun.corba.se.impl.logging.ORBUtilSystemException.getLocalHostFailed(ORBUtilSystemException.java:3861)
    at com.sun.corba.se.impl.orb.ORBImpl.getLocalHostName(ORBImpl.java:1585)
    at com.sun.corba.se.impl.orb.ORBImpl.set_parameters(ORBImpl.java:536)
    at org.omg.CORBA.ORB.init(ORB.java:337)
    at
org.apache.cxf.binding.corba.CorbaConduitTest.setUp(CorbaConduitTest.java:88)
    at sun.reflect.NativeMethodAccessorImpl.invoke0(Native Method)
    at
sun.reflect.NativeMethodAccessorImpl.invoke(NativeMethodAccessorImpl.java:39)
    at
sun.reflect.DelegatingMethodAccessorImpl.invoke(DelegatingMethodAccessorImpl.java:25)
    at java.lang.reflect.Method.invoke(Method.java:597)
    at
org.junit.runners.model.FrameworkMethod$1.runReflectiveCall(FrameworkMethod.java:44)
    at
org.junit.internal.runners.model.ReflectiveCallable.run(ReflectiveCallable.java:15)
    at
org.junit.runners.model.FrameworkMethod.invokeExplosively(FrameworkMethod.java:41)
    at
org.junit.internal.runners.statements.RunBefores.evaluate(RunBefores.java:27)
    at
org.junit.internal.runners.statements.RunAfters.evaluate(RunAfters.java:31)
    at
org.junit.runners.BlockJUnit4ClassRunner.runChild(BlockJUnit4ClassRunner.java:76)
    at
org.junit.runners.BlockJUnit4ClassRunner.runChild(BlockJUnit4ClassRunner.java:50)
    at org.junit.runners.ParentRunner$3.run(ParentRunner.java:193)
    at org.junit.runners.ParentRunner$1.schedule(ParentRunner.java:52)
    at org.junit.runners.ParentRunner.runChildren(ParentRunner.java:191)
    at org.junit.runners.ParentRunner.access$000(ParentRunner.java:42)
    at org.junit.runners.ParentRunner$2.evaluate(ParentRunner.java:184)
    at org.junit.runners.ParentRunner.run(ParentRunner.java:236)
    at
org.apache.maven.surefire.junit4.JUnit4TestSet.execute(JUnit4TestSet.java:35)
    at
org.apache.maven.surefire.junit4.JUnit4Provider.executeTestSet(JUnit4Provider.java:146)
    at
org.apache.maven.surefire.junit4.JUnit4Provider.invoke(JUnit4Provider.java:97)
    at sun.reflect.NativeMethodAccessorImpl.invoke0(Native Method)
    at
sun.reflect.NativeMethodAccessorImpl.invoke(NativeMethodAccessorImpl.java:39)
    at
sun.reflect.DelegatingMethodAccessorImpl.invoke(DelegatingMethodAccessorImpl.java:25)
    at java.lang.reflect.Method.invoke(Method.java:597)
    at
org.apache.maven.surefire.booter.ProviderFactory$ClassLoaderProxy.invoke(ProviderFactory.java:103)
    at $Proxy0.invoke(Unknown Source)
    at
org.apache.maven.surefire.booter.SurefireStarter.invokeProvider(SurefireStarter.java:145)
    at
org.apache.maven.surefire.booter.SurefireStarter.runSuitesInProcess(SurefireStarter.java:87)
    at
org.apache.maven.surefire.booter.ForkedBooter.main(ForkedBooter.java:69)
Caused by: java.net.UnknownHostException: linux: linux
    at java.net.InetAddress.getLocalHost(InetAddress.java:1353)
    at com.sun.corba.se.impl.orb.ORBImpl.getLocalHostName(ORBImpl.java:1583)
    ... 32 more
</error>
  </testcase>
  <testcase time="0.053"
classname="org.apache.cxf.binding.corba.CorbaConduitTest"
name="testBuildReturn">
    <error message=""
type="org.omg.CORBA.INTERNAL">org.omg.CORBA.INTERNAL:   vmcid: SUN 
minor code: 208  completed: No
    at
com.sun.corba.se.impl.logging.ORBUtilSystemException.getLocalHostFailed(ORBUtilSystemException.java:3843)
    at
com.sun.corba.se.impl.logging.ORBUtilSystemException.getLocalHostFailed(ORBUtilSystemException.java:3861)
    at com.sun.corba.se.impl.orb.ORBImpl.getLocalHostName(ORBImpl.java:1585)
    at com.sun.corba.se.impl.orb.ORBImpl.set_parameters(ORBImpl.java:536)
    at org.omg.CORBA.ORB.init(ORB.java:337)
    at
org.apache.cxf.binding.corba.CorbaConduitTest.setUp(CorbaConduitTest.java:88)
    at sun.reflect.NativeMethodAccessorImpl.invoke0(Native Method)
    at
sun.reflect.NativeMethodAccessorImpl.invoke(NativeMethodAccessorImpl.java:39)
    at
sun.reflect.DelegatingMethodAccessorImpl.invoke(DelegatingMethodAccessorImpl.java:25)
    at java.lang.reflect.Method.invoke(Method.java:597)
    at
org.junit.runners.model.FrameworkMethod$1.runReflectiveCall(FrameworkMethod.java:44)
    at
org.junit.internal.runners.model.ReflectiveCallable.run(ReflectiveCallable.java:15)
    at
org.junit.runners.model.FrameworkMethod.invokeExplosively(FrameworkMethod.java:41)
    at
org.junit.internal.runners.statements.RunBefores.evaluate(RunBefores.java:27)
    at
org.junit.internal.runners.statements.RunAfters.evaluate(RunAfters.java:31)
    at
org.junit.runners.BlockJUnit4ClassRunner.runChild(BlockJUnit4ClassRunner.java:76)
    at
org.junit.runners.BlockJUnit4ClassRunner.runChild(BlockJUnit4ClassRunner.java:50)
    at org.junit.runners.ParentRunner$3.run(ParentRunner.java:193)
    at org.junit.runners.ParentRunner$1.schedule(ParentRunner.java:52)
    at org.junit.runners.ParentRunner.runChildren(ParentRunner.java:191)
    at org.junit.runners.ParentRunner.access$000(ParentRunner.java:42)
    at org.junit.runners.ParentRunner$2.evaluate(ParentRunner.java:184)
    at org.junit.runners.ParentRunner.run(ParentRunner.java:236)
    at
org.apache.maven.surefire.junit4.JUnit4TestSet.execute(JUnit4TestSet.java:35)
    at
org.apache.maven.surefire.junit4.JUnit4Provider.executeTestSet(JUnit4Provider.java:146)
    at
org.apache.maven.surefire.junit4.JUnit4Provider.invoke(JUnit4Provider.java:97)
    at sun.reflect.NativeMethodAccessorImpl.invoke0(Native Method)
    at
sun.reflect.NativeMethodAccessorImpl.invoke(NativeMethodAccessorImpl.java:39)
    at
sun.reflect.DelegatingMethodAccessorImpl.invoke(DelegatingMethodAccessorImpl.java:25)
    at java.lang.reflect.Method.invoke(Method.java:597)
    at
org.apache.maven.surefire.booter.ProviderFactory$ClassLoaderProxy.invoke(ProviderFactory.java:103)
    at $Proxy0.invoke(Unknown Source)
    at
org.apache.maven.surefire.booter.SurefireStarter.invokeProvider(SurefireStarter.java:145)
    at
org.apache.maven.surefire.booter.SurefireStarter.runSuitesInProcess(SurefireStarter.java:87)
    at
org.apache.maven.surefire.booter.ForkedBooter.main(ForkedBooter.java:69)
Caused by: java.net.UnknownHostException: linux: linux
    at java.net.InetAddress.getLocalHost(InetAddress.java:1353)
    at com.sun.corba.se.impl.orb.ORBImpl.getLocalHostName(ORBImpl.java:1583)
    ... 32 more
</error>
  </testcase>
  <testcase time="0.055"
classname="org.apache.cxf.binding.corba.CorbaConduitTest"
name="testBuildExceptionListEmpty">
    <error message=""
type="org.omg.CORBA.INTERNAL">org.omg.CORBA.INTERNAL:   vmcid: SUN 
minor code: 208  completed: No
    at
com.sun.corba.se.impl.logging.ORBUtilSystemException.getLocalHostFailed(ORBUtilSystemException.java:3843)
    at
com.sun.corba.se.impl.logging.ORBUtilSystemException.getLocalHostFailed(ORBUtilSystemException.java:3861)
    at com.sun.corba.se.impl.orb.ORBImpl.getLocalHostName(ORBImpl.java:1585)
    at com.sun.corba.se.impl.orb.ORBImpl.set_parameters(ORBImpl.java:536)
    at org.omg.CORBA.ORB.init(ORB.java:337)
    at
org.apache.cxf.binding.corba.CorbaConduitTest.setUp(CorbaConduitTest.java:88)
    at sun.reflect.NativeMethodAccessorImpl.invoke0(Native Method)
    at
sun.reflect.NativeMethodAccessorImpl.invoke(NativeMethodAccessorImpl.java:39)
    at
sun.reflect.DelegatingMethodAccessorImpl.invoke(DelegatingMethodAccessorImpl.java:25)
    at java.lang.reflect.Method.invoke(Method.java:597)
    at
org.junit.runners.model.FrameworkMethod$1.runReflectiveCall(FrameworkMethod.java:44)
    at
org.junit.internal.runners.model.ReflectiveCallable.run(ReflectiveCallable.java:15)
    at
org.junit.runners.model.FrameworkMethod.invokeExplosively(FrameworkMethod.java:41)
    at
org.junit.internal.runners.statements.RunBefores.evaluate(RunBefores.java:27)
    at
org.junit.internal.runners.statements.RunAfters.evaluate(RunAfters.java:31)
    at
org.junit.runners.BlockJUnit4ClassRunner.runChild(BlockJUnit4ClassRunner.java:76)
    at
org.junit.runners.BlockJUnit4ClassRunner.runChild(BlockJUnit4ClassRunner.java:50)
    at org.junit.runners.ParentRunner$3.run(ParentRunner.java:193)
    at org.junit.runners.ParentRunner$1.schedule(ParentRunner.java:52)
    at org.junit.runners.ParentRunner.runChildren(ParentRunner.java:191)
    at org.junit.runners.ParentRunner.access$000(ParentRunner.java:42)
    at org.junit.runners.ParentRunner$2.evaluate(ParentRunner.java:184)
    at org.junit.runners.ParentRunner.run(ParentRunner.java:236)
    at
org.apache.maven.surefire.junit4.JUnit4TestSet.execute(JUnit4TestSet.java:35)
    at
org.apache.maven.surefire.junit4.JUnit4Provider.executeTestSet(JUnit4Provider.java:146)
    at
org.apache.maven.surefire.junit4.JUnit4Provider.invoke(JUnit4Provider.java:97)
    at sun.reflect.NativeMethodAccessorImpl.invoke0(Native Method)
    at
sun.reflect.NativeMethodAccessorImpl.invoke(NativeMethodAccessorImpl.java:39)
    at
sun.reflect.DelegatingMethodAccessorImpl.invoke(DelegatingMethodAccessorImpl.java:25)
    at java.lang.reflect.Method.invoke(Method.java:597)
    at
org.apache.maven.surefire.booter.ProviderFactory$ClassLoaderProxy.invoke(ProviderFactory.java:103)
    at $Proxy0.invoke(Unknown Source)
    at
org.apache.maven.surefire.booter.SurefireStarter.invokeProvider(SurefireStarter.java:145)
    at
org.apache.maven.surefire.booter.SurefireStarter.runSuitesInProcess(SurefireStarter.java:87)
    at
org.apache.maven.surefire.booter.ForkedBooter.main(ForkedBooter.java:69)
Caused by: java.net.UnknownHostException: linux: linux
    at java.net.InetAddress.getLocalHost(InetAddress.java:1353)
    at com.sun.corba.se.impl.orb.ORBImpl.getLocalHostName(ORBImpl.java:1583)
    ... 32 more
</error>
  </testcase>
  <testcase time="0.055"
classname="org.apache.cxf.binding.corba.CorbaConduitTest"
name="testBuildExceptionListWithExceptions">
    <error message=""
type="org.omg.CORBA.INTERNAL">org.omg.CORBA.INTERNAL:   vmcid: SUN 
minor code: 208  completed: No
    at
com.sun.corba.se.impl.logging.ORBUtilSystemException.getLocalHostFailed(ORBUtilSystemException.java:3843)
    at
com.sun.corba.se.impl.logging.ORBUtilSystemException.getLocalHostFailed(ORBUtilSystemException.java:3861)
    at com.sun.corba.se.impl.orb.ORBImpl.getLocalHostName(ORBImpl.java:1585)
    at com.sun.corba.se.impl.orb.ORBImpl.set_parameters(ORBImpl.java:536)
    at org.omg.CORBA.ORB.init(ORB.java:337)
    at
org.apache.cxf.binding.corba.CorbaConduitTest.setUp(CorbaConduitTest.java:88)
    at sun.reflect.NativeMethodAccessorImpl.invoke0(Native Method)
    at
sun.reflect.NativeMethodAccessorImpl.invoke(NativeMethodAccessorImpl.java:39)
    at
sun.reflect.DelegatingMethodAccessorImpl.invoke(DelegatingMethodAccessorImpl.java:25)
    at java.lang.reflect.Method.invoke(Method.java:597)
    at
org.junit.runners.model.FrameworkMethod$1.runReflectiveCall(FrameworkMethod.java:44)
    at
org.junit.internal.runners.model.ReflectiveCallable.run(ReflectiveCallable.java:15)
    at
org.junit.runners.model.FrameworkMethod.invokeExplosively(FrameworkMethod.java:41)
    at
org.junit.internal.runners.statements.RunBefores.evaluate(RunBefores.java:27)
    at
org.junit.internal.runners.statements.RunAfters.evaluate(RunAfters.java:31)
    at
org.junit.runners.BlockJUnit4ClassRunner.runChild(BlockJUnit4ClassRunner.java:76)
    at
org.junit.runners.BlockJUnit4ClassRunner.runChild(BlockJUnit4ClassRunner.java:50)
    at org.junit.runners.ParentRunner$3.run(ParentRunner.java:193)
    at org.junit.runners.ParentRunner$1.schedule(ParentRunner.java:52)
    at org.junit.runners.ParentRunner.runChildren(ParentRunner.java:191)
    at org.junit.runners.ParentRunner.access$000(ParentRunner.java:42)
    at org.junit.runners.ParentRunner$2.evaluate(ParentRunner.java:184)
    at org.junit.runners.ParentRunner.run(ParentRunner.java:236)
    at
org.apache.maven.surefire.junit4.JUnit4TestSet.execute(JUnit4TestSet.java:35)
    at
org.apache.maven.surefire.junit4.JUnit4Provider.executeTestSet(JUnit4Provider.java:146)
    at
org.apache.maven.surefire.junit4.JUnit4Provider.invoke(JUnit4Provider.java:97)
    at sun.reflect.NativeMethodAccessorImpl.invoke0(Native Method)
    at
sun.reflect.NativeMethodAccessorImpl.invoke(NativeMethodAccessorImpl.java:39)
    at
sun.reflect.DelegatingMethodAccessorImpl.invoke(DelegatingMethodAccessorImpl.java:25)
    at java.lang.reflect.Method.invoke(Method.java:597)
    at
org.apache.maven.surefire.booter.ProviderFactory$ClassLoaderProxy.invoke(ProviderFactory.java:103)
    at $Proxy0.invoke(Unknown Source)
    at
org.apache.maven.surefire.booter.SurefireStarter.invokeProvider(SurefireStarter.java:145)
    at
org.apache.maven.surefire.booter.SurefireStarter.runSuitesInProcess(SurefireStarter.java:87)
    at
org.apache.maven.surefire.booter.ForkedBooter.main(ForkedBooter.java:69)
Caused by: java.net.UnknownHostException: linux: linux
    at java.net.InetAddress.getLocalHost(InetAddress.java:1353)
    at com.sun.corba.se.impl.orb.ORBImpl.getLocalHostName(ORBImpl.java:1583)
    ... 32 more
</error>
  </testcase>
  <testcase time="0.055"
classname="org.apache.cxf.binding.corba.CorbaConduitTest" name="testInvoke">
    <error message=""
type="org.omg.CORBA.INTERNAL">org.omg.CORBA.INTERNAL:   vmcid: SUN 
minor code: 208  completed: No
    at
com.sun.corba.se.impl.logging.ORBUtilSystemException.getLocalHostFailed(ORBUtilSystemException.java:3843)
    at
com.sun.corba.se.impl.logging.ORBUtilSystemException.getLocalHostFailed(ORBUtilSystemException.java:3861)
    at com.sun.corba.se.impl.orb.ORBImpl.getLocalHostName(ORBImpl.java:1585)
    at com.sun.corba.se.impl.orb.ORBImpl.set_parameters(ORBImpl.java:536)
    at org.omg.CORBA.ORB.init(ORB.java:337)
    at
org.apache.cxf.binding.corba.CorbaConduitTest.setUp(CorbaConduitTest.java:88)
    at sun.reflect.NativeMethodAccessorImpl.invoke0(Native Method)
    at
sun.reflect.NativeMethodAccessorImpl.invoke(NativeMethodAccessorImpl.java:39)
    at
sun.reflect.DelegatingMethodAccessorImpl.invoke(DelegatingMethodAccessorImpl.java:25)
    at java.lang.reflect.Method.invoke(Method.java:597)
    at
org.junit.runners.model.FrameworkMethod$1.runReflectiveCall(FrameworkMethod.java:44)
    at
org.junit.internal.runners.model.ReflectiveCallable.run(ReflectiveCallable.java:15)
    at
org.junit.runners.model.FrameworkMethod.invokeExplosively(FrameworkMethod.java:41)
    at
org.junit.internal.runners.statements.RunBefores.evaluate(RunBefores.java:27)
    at
org.junit.internal.runners.statements.RunAfters.evaluate(RunAfters.java:31)
    at
org.junit.runners.BlockJUnit4ClassRunner.runChild(BlockJUnit4ClassRunner.java:76)
    at
org.junit.runners.BlockJUnit4ClassRunner.runChild(BlockJUnit4ClassRunner.java:50)
    at org.junit.runners.ParentRunner$3.run(ParentRunner.java:193)
    at org.junit.runners.ParentRunner$1.schedule(ParentRunner.java:52)
    at org.junit.runners.ParentRunner.runChildren(ParentRunner.java:191)
    at org.junit.runners.ParentRunner.access$000(ParentRunner.java:42)
    at org.junit.runners.ParentRunner$2.evaluate(ParentRunner.java:184)
    at org.junit.runners.ParentRunner.run(ParentRunner.java:236)
    at
org.apache.maven.surefire.junit4.JUnit4TestSet.execute(JUnit4TestSet.java:35)
    at
org.apache.maven.surefire.junit4.JUnit4Provider.executeTestSet(JUnit4Provider.java:146)
    at
org.apache.maven.surefire.junit4.JUnit4Provider.invoke(JUnit4Provider.java:97)
    at sun.reflect.NativeMethodAccessorImpl.invoke0(Native Method)
    at
sun.reflect.NativeMethodAccessorImpl.invoke(NativeMethodAccessorImpl.java:39)
    at
sun.reflect.DelegatingMethodAccessorImpl.invoke(DelegatingMethodAccessorImpl.java:25)
    at java.lang.reflect.Method.invoke(Method.java:597)
    at
org.apache.maven.surefire.booter.ProviderFactory$ClassLoaderProxy.invoke(ProviderFactory.java:103)
    at $Proxy0.invoke(Unknown Source)
    at
org.apache.maven.surefire.booter.SurefireStarter.invokeProvider(SurefireStarter.java:145)
    at
org.apache.maven.surefire.booter.SurefireStarter.runSuitesInProcess(SurefireStarter.java:87)
    at
org.apache.maven.surefire.booter.ForkedBooter.main(ForkedBooter.java:69)
Caused by: java.net.UnknownHostException: linux: linux
    at java.net.InetAddress.getLocalHost(InetAddress.java:1353)
    at com.sun.corba.se.impl.orb.ORBImpl.getLocalHostName(ORBImpl.java:1583)
    ... 32 more
</error>
  </testcase>
</testsuite>

Any ideas?

  - Dennis



Mime
View raw message