cxf-dev mailing list archives

Site index · List index
Message view « Date » · « Thread »
Top « Date » · « Thread »
From Benson Margulies <bimargul...@gmail.com>
Subject Re: Test Failures
Date Wed, 19 Aug 2009 12:36:36 GMT
All is well on my Mac with Java 1.5. What's your environment.

On Wed, Aug 19, 2009 at 3:55 AM, Christian
Schneider<chris@die-schneider.net> wrote:
> Hi all,
>
> I am getting some unit test errors and failures in systest. Is this expected
> at the moment or am I doing something wrong? Seems like it has to do with
> code generation from wsdls.
>
> Greetings
>
> Christian
>
> testDynamicClient
> java.lang.IllegalStateException: Unable to create JAXBContext for generated
> packages: "org.apache.cxf.systest.aegis" doesnt contain ObjectFactory.class
> or jaxb.index
> org.apache.cxf.systest.aegis.AegisClientServerTest:161
> testBase64
> java.lang.IllegalStateException: Unable to create JAXBContext for generated
> packages: "com.inforsense.webservicestudio.data.rpc" doesnt contain
> ObjectFactory.class or jaxb.index
> org.apache.cxf.systest.jaxws.ClientServerTest:116
> testJaxWsDynamicClient
> java.lang.IllegalStateException: Unable to create JAXBContext for generated
> packages: "com.inforsense.webservicestudio.data.rpc" doesnt contain
> ObjectFactory.class or jaxb.index
> org.apache.cxf.systest.jaxws.ClientServerTest:130
> testInvocation
> java.lang.IllegalStateException: Unable to create JAXBContext for generated
> packages: "org.apache.cxf.no_body_parts.wsdl" doesnt contain
> ObjectFactory.class or jaxb.index
> org.apache.cxf.systest.jaxws.JaxWsDynamicClientTest:68
>

Mime
View raw message