cxf-dev mailing list archives

Site index · List index
Message view « Date » · « Thread »
Top « Date » · « Thread »
From Benson Margulies <bimargul...@gmail.com>
Subject test failure on current tree
Date Thu, 13 Dec 2007 23:06:06 GMT
I don't think I have any outstanding changes at all.


Running org.apache.cxf.jaxrs.JAXRSServiceFactoryBeanTest
Tests run: 2, Failures: 0, Errors: 0, Skipped: 0, Time elapsed: 0.152
sec
Running org.apache.cxf.jaxrs.provider.ProviderFactoryImplTest
Tests run: 4, Failures: 0, Errors: 0, Skipped: 0, Time elapsed: 0.068
sec
Running org.apache.cxf.jaxrs.JAXRSUtilsTest
Tests run: 2, Failures: 1, Errors: 0, Skipped: 0, Time elapsed: 0.025
sec <<< FAILURE!
testFindTargetResourceClassWithSubResource(org.apache.cxf.jaxrs.JAXRSUtilsTest)  Time elapsed:
0.011 sec  <<< FAILURE!
org.junit.ComparisonFailure: expected:<[delete]Book> but was:<[get]Book>
        at org.junit.Assert.assertEquals(Assert.java:96)
        at org.junit.Assert.assertEquals(Assert.java:116)
        at
org.apache.cxf.jaxrs.JAXRSUtilsTest.testFindTargetResourceClassWithSubResource(JAXRSUtilsTest.java:95)
        at sun.reflect.NativeMethodAccessorImpl.invoke0(Native Method)
        at
sun.reflect.NativeMethodAccessorImpl.invoke(NativeMethodAccessorImpl.java:39)
        at
sun.reflect.DelegatingMethodAccessorImpl.invoke(DelegatingMethodAccessorImpl.java:25)
        at java.lang.reflect.Method.invoke(Method.java:585)
        at
org.junit.internal.runners.TestMethodRunner.executeMethodBody(TestMethodRunner.java:99)
        at
org.junit.internal.runners.TestMethodRunner.runUnprotected(TestMethodRunner.java:81)
        at
org.junit.internal.runners.BeforeAndAfterRunner.runProtected(BeforeAndAfterRunner.java:34)
        at
org.junit.internal.runners.TestMethodRunner.runMethod(TestMethodRunner.java:75)
        at
org.junit.internal.runners.TestMethodRunner.run(TestMethodRunner.java:45)
        at
org.junit.internal.runners.TestClassMethodsRunner.invokeTestMethod(TestClassMethodsRunner.java:66)
        at
org.junit.internal.runners.TestClassMethodsRunner.run(TestClassMethodsRunner.java:35)
        at org.junit.internal.runners.TestClassRunner
$1.runUnprotected(TestClassRunner.java:42)
        at
org.junit.internal.runners.BeforeAndAfterRunner.runProtected(BeforeAndAfterRunner.java:34)
        at
org.junit.internal.runners.TestClassRunner.run(TestClassRunner.java:52)
        at
org.apache.maven.surefire.junit4.JUnit4TestSet.execute(JUnit4TestSet.java:62)
        at
org.apache.maven.surefire.suite.AbstractDirectoryTestSuite.executeTestSet(AbstractDirectoryTestSuite.java:138)
        at
org.apache.maven.surefire.suite.AbstractDirectoryTestSuite.execute(AbstractDirectoryTestSuite.java:125)
        at org.apache.maven.surefire.Surefire.run(Surefire.java:132)
        at sun.reflect.NativeMethodAccessorImpl.invoke0(Native Method)
        at
sun.reflect.NativeMethodAccessorImpl.invoke(NativeMethodAccessorImpl.java:39)
        at
sun.reflect.DelegatingMethodAccessorImpl.invoke(DelegatingMethodAccessorImpl.java:25)
        at java.lang.reflect.Method.invoke(Method.java:585)
        at
org.apache.maven.surefire.booter.SurefireBooter.runSuitesInProcess(SurefireBooter.java:290)
        at
org.apache.maven.surefire.booter.SurefireBooter.main(SurefireBooter.java:818)

Running org.apache.cxf.jaxrs.model.URITemplateTest
Tests run: 5, Failures: 0, Errors: 0, Skipped: 0, Time elapsed: 0.028
sec

Results :

Failed tests: 

testFindTargetResourceClassWithSubResource(org.apache.cxf.jaxrs.JAXRSUtilsTest)

Tests run: 13, Failures: 1, Errors: 0, Skipped: 0

[INFO]
------------------------------------------------------------------------
[ERROR] BUILD FAILURE
[INFO]
------------------------------------------------------------------------
[INFO] There are test failures.
[INFO]
------------------------------------------------------------------------
[INFO] For more information, run Maven with the -e switch
[INFO]
------------------------------------------------------------------------
[INFO] Total time: 13 minutes 19 seconds
[INFO] Finished at: Thu Dec 13 17:45:39 GMT-05:00 2007
[INFO] Final Memory: 58M/131M
[INFO]
------------------------------------------------------------------------
bim-1330% svn up
At revision 604057.
bim-1330% 



Mime
View raw message