cxf-dev mailing list archives

Site index · List index
Message view « Date » · « Thread »
Top « Date » · « Thread »
From Daniel Kulp <daniel.k...@iona.com>
Subject Re: Problems building (on Windows?)
Date Thu, 15 Mar 2007 20:50:47 GMT

Fix committed for the wsdlto/test stuff.   I'll run a complete build to 
make sure there aren't others.

Dan


On Thursday 15 March 2007 16:41, Daniel Kulp wrote:
> This is occuring if you have a space in the path to your working dir.
> I'll see if its something obvious to fix.
>
> Dan
>
> On Thursday 15 March 2007 16:30, Dan Diephouse wrote:
> > I'm having issues getting the wsdlto-tests module to compile. It is
> > complaining that a bunch of classes can't be found. I've done some
> > poking around, but I'm not really familiar enough to say whats going
> > on. Anyone have ideas?  Thanks,
> > - Dan
> >
> > Build log (at least part of it):
> >
> > [INFO]
> > --------------------------------------------------------------------
> >-- ------ [INFO] Building Apache CXF Command Line Tools2 WSDLTo Test
> > [INFO]    task-segment: [install]
> > [INFO]
> > --------------------------------------------------------------------
> >-- ------ [INFO] [checkstyle:checkstyle {execution: validate}]
> > [INFO] Starting audit...
> > Audit done.
> >
> > [INFO] Preparing pmd:check
> > [INFO] [pmd:pmd]
> > [INFO] [pmd:check {execution: validate}]
> > [INFO] [remote-resources:process {execution: default}]
> > [INFO] [resources:resources]
> > [INFO] Using default encoding to copy filtered resources.
> > [INFO] [compiler:compile]
> > [INFO] No sources to compile
> > [INFO] [resources:testResources]
> > [INFO] Using default encoding to copy filtered resources.
> > [INFO] [compiler:testCompile]
> > [INFO] Nothing to compile - all classes are up to date
> > [INFO] [surefire:test]
> > [INFO] Surefire report directory: C:\cygwin\home\Dan
> > Diephouse\cxf\trunk\tools2\wsdlto\test\target\surefire-reports
> >
> > -------------------------------------------------------
> >  T E S T S
> > -------------------------------------------------------
> > Running org.apache.cxf.tools.wsdlto.WSDLToJavaTest
> > Tests run: 3, Failures: 0, Errors: 0, Skipped: 0, Time elapsed:
> > 0.618 sec Running
> > org.apache.cxf.tools.wsdlto.jaxws.CodeGenOptionTest Tests run: 3,
> > Failures: 0, Errors: 3, Skipped: 0, Time elapsed: 7.205 sec <<<
> > FAILURE!
> > testFlagForGenStandAlone(org.apache.cxf.tools.wsdlto.jaxws.CodeGenOp
> >ti onTest) Time elapsed: 3.962 sec  <<< ERROR!
> > java.lang.ClassNotFoundException:
> > org.apache.hello_world_soap_http.GreeterServer
> >         at java.net.URLClassLoader$1.run(URLClassLoader.java:200)
> >         at java.security.AccessController.doPrivileged(Native
> > Method) at
> > java.net.URLClassLoader.findClass(URLClassLoader.java:188) at
> > java.lang.ClassLoader.loadClass(ClassLoader.java:306) at
> > java.lang.ClassLoader.loadClass(ClassLoader.java:251) at
> > org.apache.cxf.tools.wsdlto.jaxws.CodeGenOptionTest.testFlagForGenSt
> >an dAlone (CodeGenOptionTest.java:66)
> >         at sun.reflect.NativeMethodAccessorImpl.invoke0(Native
> > Method) at sun.reflect.NativeMethodAccessorImpl.invoke(
> > NativeMethodAccessorImpl.java:39)
> >         at sun.reflect.DelegatingMethodAccessorImpl.invoke(
> > DelegatingMethodAccessorImpl.java:25)
> >         at java.lang.reflect.Method.invoke(Method.java:585)
> >         at junit.framework.TestCase.runTest(TestCase.java:168)
> >         at junit.framework.TestCase.runBare(TestCase.java:134)
> >         at junit.framework.TestResult$1.protect(TestResult.java:110)
> >         at
> > junit.framework.TestResult.runProtected(TestResult.java:128) at
> > junit.framework.TestResult.run(TestResult.java:113) at
> > junit.framework.TestCase.run(TestCase.java:124)
> >         at junit.framework.TestSuite.runTest(TestSuite.java:232)
> >         at junit.framework.TestSuite.run(TestSuite.java:227)
> >         at org.junit.internal.runners.OldTestClassRunner.run(
> > OldTestClassRunner.java:35)
> >         at org.apache.maven.surefire.junit4.JUnit4TestSet.execute(
> > JUnit4TestSet.java:62)
> >         at
> > org.apache.maven.surefire.suite.AbstractDirectoryTestSuite.executeTe
> >st Set( AbstractDirectoryTestSuite.java:138
> > )
> >         at
> > org.apache.maven.surefire.suite.AbstractDirectoryTestSuite.execute(
> > AbstractDirectoryTestSuite.java:125)
> >         at org.apache.maven.surefire.Surefire.run(Surefire.java:132)
> >         at sun.reflect.NativeMethodAccessorImpl.invoke0(Native
> > Method) at sun.reflect.NativeMethodAccessorImpl.invoke(
> > NativeMethodAccessorImpl.java:39)
> >         at sun.reflect.DelegatingMethodAccessorImpl.invoke(
> > DelegatingMethodAccessorImpl.java:25)
> >         at java.lang.reflect.Method.invoke(Method.java:585)
> >         at
> > org.apache.maven.surefire.booter.SurefireBooter.runSuitesInProcess(
> > SurefireBooter.java:290)
> >         at org.apache.maven.surefire.booter.SurefireBooter.main(
> > SurefireBooter.java:818)
> >
> > testFlagForGenAdditional(org.apache.cxf.tools.wsdlto.jaxws.CodeGenOp
> >ti onTest) Time elapsed: 1.577 sec  <<< ERROR!
> > java.lang.ClassNotFoundException:
> > org.apache.hello_world_soap_http.GreeterServer
> >         at java.net.URLClassLoader$1.run(URLClassLoader.java:200)
> >         at java.security.AccessController.doPrivileged(Native
> > Method) at
> > java.net.URLClassLoader.findClass(URLClassLoader.java:188) at
> > java.lang.ClassLoader.loadClass(ClassLoader.java:306) at
> > java.lang.ClassLoader.loadClass(ClassLoader.java:251) at
> > org.apache.cxf.tools.wsdlto.jaxws.CodeGenOptionTest.testFlagForGenAd
> >di tional (CodeGenOptionTest.java:79)
> >         at sun.reflect.NativeMethodAccessorImpl.invoke0(Native
> > Method) at sun.reflect.NativeMethodAccessorImpl.invoke(
> > NativeMethodAccessorImpl.java:39)
> >         at sun.reflect.DelegatingMethodAccessorImpl.invoke(
> > DelegatingMethodAccessorImpl.java:25)
> >         at java.lang.reflect.Method.invoke(Method.java:585)
> >         at junit.framework.TestCase.runTest(TestCase.java:168)
> >         at junit.framework.TestCase.runBare(TestCase.java:134)
> >         at junit.framework.TestResult$1.protect(TestResult.java:110)
> >         at
> > junit.framework.TestResult.runProtected(TestResult.java:128) at
> > junit.framework.TestResult.run(TestResult.java:113) at
> > junit.framework.TestCase.run(TestCase.java:124)
> >         at junit.framework.TestSuite.runTest(TestSuite.java:232)
> >         at junit.framework.TestSuite.run(TestSuite.java:227)
> >         at org.junit.internal.runners.OldTestClassRunner.run(
> > OldTestClassRunner.java:35)
> >         at org.apache.maven.surefire.junit4.JUnit4TestSet.execute(
> > JUnit4TestSet.java:62)
> >         at
> > org.apache.maven.surefire.suite.AbstractDirectoryTestSuite.executeTe
> >st Set( AbstractDirectoryTestSuite.java:138
> > )
> >         at
> > org.apache.maven.surefire.suite.AbstractDirectoryTestSuite.execute(
> > AbstractDirectoryTestSuite.java:125)
> >         at org.apache.maven.surefire.Surefire.run(Surefire.java:132)
> >         at sun.reflect.NativeMethodAccessorImpl.invoke0(Native
> > Method) at sun.reflect.NativeMethodAccessorImpl.invoke(
> > NativeMethodAccessorImpl.java:39)
> >         at sun.reflect.DelegatingMethodAccessorImpl.invoke(
> > DelegatingMethodAccessorImpl.java:25)
> >         at java.lang.reflect.Method.invoke(Method.java:585)
> >         at
> > org.apache.maven.surefire.booter.SurefireBooter.runSuitesInProcess(
> > SurefireBooter.java:290)
> >         at org.apache.maven.surefire.booter.SurefireBooter.main(
> > SurefireBooter.java:818)
> >
> > testHelloWorldExternalBindingFile(
> > org.apache.cxf.tools.wsdlto.jaxws.CodeGenOptionTest)  Time elapsed:
> > 1.658sec  <<< ERR
> > OR!
> > java.lang.ClassNotFoundException:
> > org.apache.hello_world_async_soap_http.GreeterAsync
> >         at java.net.URLClassLoader$1.run(URLClassLoader.java:200)
> >         at java.security.AccessController.doPrivileged(Native
> > Method) at
> > java.net.URLClassLoader.findClass(URLClassLoader.java:188) at
> > java.lang.ClassLoader.loadClass(ClassLoader.java:306) at
> > java.lang.ClassLoader.loadClass(ClassLoader.java:251) at
> > org.apache.cxf.tools.wsdlto.jaxws.CodeGenOptionTest.testHelloWorldEx
> >te rnalBindingFile (CodeGenOptionTest.java:
> > 97)
> >         at sun.reflect.NativeMethodAccessorImpl.invoke0(Native
> > Method) at sun.reflect.NativeMethodAccessorImpl.invoke(
> > NativeMethodAccessorImpl.java:39)
> >         at sun.reflect.DelegatingMethodAccessorImpl.invoke(
> > DelegatingMethodAccessorImpl.java:25)
> >         at java.lang.reflect.Method.invoke(Method.java:585)
> >         at junit.framework.TestCase.runTest(TestCase.java:168)
> >         at junit.framework.TestCase.runBare(TestCase.java:134)
> >         at junit.framework.TestResult$1.protect(TestResult.java:110)
> >         at
> > junit.framework.TestResult.runProtected(TestResult.java:128) at
> > junit.framework.TestResult.run(TestResult.java:113) at
> > junit.framework.TestCase.run(TestCase.java:124)
> >         at junit.framework.TestSuite.runTest(TestSuite.java:232)
> >         at junit.framework.TestSuite.run(TestSuite.java:227)
> >         at org.junit.internal.runners.OldTestClassRunner.run(
> > OldTestClassRunner.java:35)
> >         at org.apache.maven.surefire.junit4.JUnit4TestSet.execute(
> > JUnit4TestSet.java:62)
> >         at
> > org.apache.maven.surefire.suite.AbstractDirectoryTestSuite.executeTe
> >st Set( AbstractDirectoryTestSuite.java:138
> > )
> >         at
> > org.apache.maven.surefire.suite.AbstractDirectoryTestSuite.execute(
> > AbstractDirectoryTestSuite.java:125)
> >         at org.apache.maven.surefire.Surefire.run(Surefire.java:132)
> >         at sun.reflect.NativeMethodAccessorImpl.invoke0(Native
> > Method) at sun.reflect.NativeMethodAccessorImpl.invoke(
> > NativeMethodAccessorImpl.java:39)
> >         at sun.reflect.DelegatingMethodAccessorImpl.invoke(
> > DelegatingMethodAccessorImpl.java:25)
> >         at java.lang.reflect.Method.invoke(Method.java:585)
> >         at
> > org.apache.maven.surefire.booter.SurefireBooter.runSuitesInProcess(
> > SurefireBooter.java:290)
> >         at org.apache.maven.surefire.booter.SurefireBooter.main(
> > SurefireBooter.java:818)
> >
> > Running org.apache.cxf.tools.wsdlto.validator.ValidatorTest
> > Tests run: 1, Failures: 0, Errors: 0, Skipped: 0, Time elapsed:
> > 0.151 sec Running org.apache.cxf.tools.wsdlto.core.PluginLoaderTest
> > Tests run: 1, Failures: 0, Errors: 0, Skipped: 0, Time elapsed:
> > 0.008 sec Running org.apache.cxf.tools.wsdlto.jaxws.CodeGenBugTest
> >
> >
> > java.lang.ClassNotFoundException:
> > org.apache.hello_world_soap_http.types.CreateProcess$MyProcess
> >         at java.net.URLClassLoader$1.run(URLClassLoader.java:200)
> >         at java.security.AccessController.doPrivileged(Native
> > Method) at
> > java.net.URLClassLoader.findClass(URLClassLoader.java:188) at
> > java.lang.ClassLoader.loadClass(ClassLoader.java:306) at
> > java.lang.ClassLoader.loadClass(ClassLoader.java:251) at
> > org.apache.cxf.tools.wsdlto.jaxws.CodeGenBugTest.testBug305924ForNes
> >te dBinding (CodeGenBugTest.java:352)
> >         at sun.reflect.NativeMethodAccessorImpl.invoke0(Native
> > Method) at sun.reflect.NativeMethodAccessorImpl.invoke(
> > NativeMethodAccessorImpl.java:39)
> >         at sun.reflect.DelegatingMethodAccessorImpl.invoke(
> > DelegatingMethodAccessorImpl.java:25)
> >         at java.lang.reflect.Method.invoke(Method.java:585)
> >         at junit.framework.TestCase.runTest(TestCase.java:168)
> >         at junit.framework.TestCase.runBare(TestCase.java:134)
> >         at junit.framework.TestResult$1.protect(TestResult.java:110)
> >         at
> > junit.framework.TestResult.runProtected(TestResult.java:128) at
> > junit.framework.TestResult.run(TestResult.java:113) at
> > junit.framework.TestCase.run(TestCase.java:124)
> >         at junit.framework.TestSuite.runTest(TestSuite.java:232)
> >         at junit.framework.TestSuite.run(TestSuite.java:227)
> >         at org.junit.internal.runners.OldTestClassRunner.run(
> > OldTestClassRunner.java:35)
> >         at org.apache.maven.surefire.junit4.JUnit4TestSet.execute(
> > JUnit4TestSet.java:62)
> >         at
> > org.apache.maven.surefire.suite.AbstractDirectoryTestSuite.executeTe
> >st Set( AbstractDirectoryTestSuite.java:138
> > )
> >         at
> > org.apache.maven.surefire.suite.AbstractDirectoryTestSuite.execute(
> > AbstractDirectoryTestSuite.java:125)
> >         at org.apache.maven.surefire.Surefire.run(Surefire.java:132)
> >         at sun.reflect.NativeMethodAccessorImpl.invoke0(Native
> > Method) at sun.reflect.NativeMethodAccessorImpl.invoke(
> > NativeMethodAccessorImpl.java:39)
> >         at sun.reflect.DelegatingMethodAccessorImpl.invoke(
> > DelegatingMethodAccessorImpl.java:25)
> >         at java.lang.reflect.Method.invoke(Method.java:585)
> >         at
> > org.apache.maven.surefire.booter.SurefireBooter.runSuitesInProcess(
> > SurefireBooter.java:290)
> >         at org.apache.maven.surefire.booter.SurefireBooter.main(
> > SurefireBooter.java:818)
> > java.lang.ClassNotFoundException:
> > org.apache.hello_world_soap_http.types.CreateProcess$MyProcess
> >         at java.net.URLClassLoader$1.run(URLClassLoader.java:200)
> >         at java.security.AccessController.doPrivileged(Native
> > Method) at
> > java.net.URLClassLoader.findClass(URLClassLoader.java:188) at
> > java.lang.ClassLoader.loadClass(ClassLoader.java:306) at
> > java.lang.ClassLoader.loadClass(ClassLoader.java:251) at
> > org.apache.cxf.tools.wsdlto.jaxws.CodeGenBugTest.testBug305924ForExt
> >er nalBinding (CodeGenBugTest.java:372)
> >         at sun.reflect.NativeMethodAccessorImpl.invoke0(Native
> > Method) at sun.reflect.NativeMethodAccessorImpl.invoke(
> > NativeMethodAccessorImpl.java:39)
> >         at sun.reflect.DelegatingMethodAccessorImpl.invoke(
> > DelegatingMethodAccessorImpl.java:25)
> >         at java.lang.reflect.Method.invoke(Method.java:585)
> >         at junit.framework.TestCase.runTest(TestCase.java:168)
> >         at junit.framework.TestCase.runBare(TestCase.java:134)
> >         at junit.framework.TestResult$1.protect(TestResult.java:110)
> >         at
> > junit.framework.TestResult.runProtected(TestResult.java:128) at
> > junit.framework.TestResult.run(TestResult.java:113) at
> > junit.framework.TestCase.run(TestCase.java:124)
> >         at junit.framework.TestSuite.runTest(TestSuite.java:232)
> >         at junit.framework.TestSuite.run(TestSuite.java:227)
> >         at org.junit.internal.runners.OldTestClassRunner.run(
> > OldTestClassRunner.java:35)
> >         at org.apache.maven.surefire.junit4.JUnit4TestSet.execute(
> > JUnit4TestSet.java:62)
> >         at
> > org.apache.maven.surefire.suite.AbstractDirectoryTestSuite.executeTe
> >st Set( AbstractDirectoryTestSuite.java:138
> > )
> >         at
> > org.apache.maven.surefire.suite.AbstractDirectoryTestSuite.execute(
> > AbstractDirectoryTestSuite.java:125)
> >         at org.apache.maven.surefire.Surefire.run(Surefire.java:132)
> >         at sun.reflect.NativeMethodAccessorImpl.invoke0(Native
> > Method) at sun.reflect.NativeMethodAccessorImpl.invoke(
> > NativeMethodAccessorImpl.java:39)
> >         at sun.reflect.DelegatingMethodAccessorImpl.invoke(
> > DelegatingMethodAccessorImpl.java:25)
> >         at java.lang.reflect.Method.invoke(Method.java:585)
> > Tests run: 16, Failures: 0, Errors: 5, Skipped: 0, Time elapsed:
> > 16.438 sec <<< FAILURE!
> >         at
> > org.apache.maven.surefire.booter.SurefireBooter.runSuitesInProcess(
> > SurefireBooter.java:290)
> > testBug305773(org.apache.cxf.tools.wsdlto.jaxws.CodeGenBugTest) 
> > Time elapsed: 1.458 sec  <<< ERROR!
> >         at org.apache.maven.surefire.booter.SurefireBooter.main(
> > SurefireBooter.java:818)
> > java.lang.ClassNotFoundException:
> > org.apache.hello_world_soap_http.GreeterImpl
> >         at java.net.URLClassLoader$1.run(URLClassLoader.java:200)
> >         at java.security.AccessController.doPrivileged(Native
> > Method) at
> > java.net.URLClassLoader.findClass(URLClassLoader.java:188) at
> > java.lang.ClassLoader.loadClass(ClassLoader.java:306) at
> > java.lang.ClassLoader.loadClass(ClassLoader.java:251) at
> > org.apache.cxf.tools.wsdlto.jaxws.CodeGenBugTest.testBug305773(
> > CodeGenBugTest.java:78)
> >         at sun.reflect.NativeMethodAccessorImpl.invoke0(Native
> > Method) at sun.reflect.NativeMethodAccessorImpl.invoke(
> > NativeMethodAccessorImpl.java:39)
> >         at sun.reflect.DelegatingMethodAccessorImpl.invoke(
> > DelegatingMethodAccessorImpl.java:25)
> >         at java.lang.reflect.Method.invoke(Method.java:585)
> >         at junit.framework.TestCase.runTest(TestCase.java:168)
> >         at junit.framework.TestCase.runBare(TestCase.java:134)
> >         at junit.framework.TestResult$1.protect(TestResult.java:110)
> >         at
> > junit.framework.TestResult.runProtected(TestResult.java:128) at
> > junit.framework.TestResult.run(TestResult.java:113) at
> > junit.framework.TestCase.run(TestCase.java:124)
> >         at junit.framework.TestSuite.runTest(TestSuite.java:232)
> >         at junit.framework.TestSuite.run(TestSuite.java:227)
> >         at org.junit.internal.runners.OldTestClassRunner.run(
> > OldTestClassRunner.java:35)
> >         at org.apache.maven.surefire.junit4.JUnit4TestSet.execute(
> > JUnit4TestSet.java:62)
> >         at
> > org.apache.maven.surefire.suite.AbstractDirectoryTestSuite.executeTe
> >st Set( AbstractDirectoryTestSuite.java:138
> > )
> >         at
> > org.apache.maven.surefire.suite.AbstractDirectoryTestSuite.execute(
> > AbstractDirectoryTestSuite.java:125)
> >         at org.apache.maven.surefire.Surefire.run(Surefire.java:132)
> >         at sun.reflect.NativeMethodAccessorImpl.invoke0(Native
> > Method) at sun.reflect.NativeMethodAccessorImpl.invoke(
> > NativeMethodAccessorImpl.java:39)
> >         at sun.reflect.DelegatingMethodAccessorImpl.invoke(
> > DelegatingMethodAccessorImpl.java:25)
> >         at java.lang.reflect.Method.invoke(Method.java:585)
> >         at
> > org.apache.maven.surefire.booter.SurefireBooter.runSuitesInProcess(
> > SurefireBooter.java:290)
> >         at org.apache.maven.surefire.booter.SurefireBooter.main(
> > SurefireBooter.java:818)
> >
> > testNamespacePackageMapping1(
> > org.apache.cxf.tools.wsdlto.jaxws.CodeGenBugTest)  Time elapsed:
> > 1.755 sec <<< ERROR!
> > java.lang.ClassNotFoundException: org.cxf.Greeter
> >         at java.net.URLClassLoader$1.run(URLClassLoader.java:200)
> >         at java.security.AccessController.doPrivileged(Native
> > Method) at
> > java.net.URLClassLoader.findClass(URLClassLoader.java:188) at
> > java.lang.ClassLoader.loadClass(ClassLoader.java:306) at
> > java.lang.ClassLoader.loadClass(ClassLoader.java:251) at
> > org.apache.cxf.tools.wsdlto.jaxws.CodeGenBugTest.testNamespacePackag
> >eM apping1 (CodeGenBugTest.java:124)
> >         at sun.reflect.NativeMethodAccessorImpl.invoke0(Native
> > Method) at sun.reflect.NativeMethodAccessorImpl.invoke(
> > NativeMethodAccessorImpl.java:39)
> >         at sun.reflect.DelegatingMethodAccessorImpl.invoke(
> > DelegatingMethodAccessorImpl.java:25)
> >         at java.lang.reflect.Method.invoke(Method.java:585)
> >         at junit.framework.TestCase.runTest(TestCase.java:168)
> >         at junit.framework.TestCase.runBare(TestCase.java:134)
> >         at junit.framework.TestResult$1.protect(TestResult.java:110)
> >         at
> > junit.framework.TestResult.runProtected(TestResult.java:128) at
> > junit.framework.TestResult.run(TestResult.java:113) at
> > junit.framework.TestCase.run(TestCase.java:124)
> >         at junit.framework.TestSuite.runTest(TestSuite.java:232)
> >         at junit.framework.TestSuite.run(TestSuite.java:227)
> >         at org.junit.internal.runners.OldTestClassRunner.run(
> > OldTestClassRunner.java:35)
> >         at org.apache.maven.surefire.junit4.JUnit4TestSet.execute(
> > JUnit4TestSet.java:62)
> >         at
> > org.apache.maven.surefire.suite.AbstractDirectoryTestSuite.executeTe
> >st Set( AbstractDirectoryTestSuite.java:138
> > )
> >         at
> > org.apache.maven.surefire.suite.AbstractDirectoryTestSuite.execute(
> > AbstractDirectoryTestSuite.java:125)
> >         at org.apache.maven.surefire.Surefire.run(Surefire.java:132)
> >         at sun.reflect.NativeMethodAccessorImpl.invoke0(Native
> > Method) at sun.reflect.NativeMethodAccessorImpl.invoke(
> > NativeMethodAccessorImpl.java:39)
> >         at sun.reflect.DelegatingMethodAccessorImpl.invoke(
> > DelegatingMethodAccessorImpl.java:25)
> >         at java.lang.reflect.Method.invoke(Method.java:585)
> >         at
> > org.apache.maven.surefire.booter.SurefireBooter.runSuitesInProcess(
> > SurefireBooter.java:290)
> >         at org.apache.maven.surefire.booter.SurefireBooter.main(
> > SurefireBooter.java:818)
> >
> > testNamespacePackageMapping2(
> > org.apache.cxf.tools.wsdlto.jaxws.CodeGenBugTest)  Time elapsed:
> > 1.487 sec <<< ERROR!
> > java.lang.ClassNotFoundException: org.apache.types.GreetMe
> >         at java.net.URLClassLoader$1.run(URLClassLoader.java:200)
> >         at java.security.AccessController.doPrivileged(Native
> > Method) at
> > java.net.URLClassLoader.findClass(URLClassLoader.java:188) at
> > java.lang.ClassLoader.loadClass(ClassLoader.java:306) at
> > java.lang.ClassLoader.loadClass(ClassLoader.java:251) at
> > org.apache.cxf.tools.wsdlto.jaxws.CodeGenBugTest.testNamespacePackag
> >eM apping2 (CodeGenBugTest.java:143)
> >         at sun.reflect.NativeMethodAccessorImpl.invoke0(Native
> > Method) at sun.reflect.NativeMethodAccessorImpl.invoke(
> > NativeMethodAccessorImpl.java:39)
> >         at sun.reflect.DelegatingMethodAccessorImpl.invoke(
> > DelegatingMethodAccessorImpl.java:25)
> >         at java.lang.reflect.Method.invoke(Method.java:585)
> >         at junit.framework.TestCase.runTest(TestCase.java:168)
> >         at junit.framework.TestCase.runBare(TestCase.java:134)
> >         at junit.framework.TestResult$1.protect(TestResult.java:110)
> >         at
> > junit.framework.TestResult.runProtected(TestResult.java:128) at
> > junit.framework.TestResult.run(TestResult.java:113) at
> > junit.framework.TestCase.run(TestCase.java:124)
> >         at junit.framework.TestSuite.runTest(TestSuite.java:232)
> >         at junit.framework.TestSuite.run(TestSuite.java:227)
> >         at org.junit.internal.runners.OldTestClassRunner.run(
> > OldTestClassRunner.java:35)
> >         at org.apache.maven.surefire.junit4.JUnit4TestSet.execute(
> > JUnit4TestSet.java:62)
> >         at
> > org.apache.maven.surefire.suite.AbstractDirectoryTestSuite.executeTe
> >st Set( AbstractDirectoryTestSuite.java:138
> > )
> >         at
> > org.apache.maven.surefire.suite.AbstractDirectoryTestSuite.execute(
> > AbstractDirectoryTestSuite.java:125)
> >         at org.apache.maven.surefire.Surefire.run(Surefire.java:132)
> >         at sun.reflect.NativeMethodAccessorImpl.invoke0(Native
> > Method) at sun.reflect.NativeMethodAccessorImpl.invoke(
> > NativeMethodAccessorImpl.java:39)
> >         at sun.reflect.DelegatingMethodAccessorImpl.invoke(
> > DelegatingMethodAccessorImpl.java:25)
> >         at java.lang.reflect.Method.invoke(Method.java:585)
> >         at
> > org.apache.maven.surefire.booter.SurefireBooter.runSuitesInProcess(
> > SurefireBooter.java:290)
> >         at org.apache.maven.surefire.booter.SurefireBooter.main(
> > SurefireBooter.java:818)
> >
> > testNamespacePackageMapping3(
> > org.apache.cxf.tools.wsdlto.jaxws.CodeGenBugTest)  Time elapsed:
> > 1.523 sec <<< ERROR!
> > java.lang.ClassNotFoundException: org.cxf.Greeter
> >         at java.net.URLClassLoader$1.run(URLClassLoader.java:200)
> >         at java.security.AccessController.doPrivileged(Native
> > Method) at
> > java.net.URLClassLoader.findClass(URLClassLoader.java:188) at
> > java.lang.ClassLoader.loadClass(ClassLoader.java:306) at
> > java.lang.ClassLoader.loadClass(ClassLoader.java:251) at
> > org.apache.cxf.tools.wsdlto.jaxws.CodeGenBugTest.testNamespacePackag
> >eM apping3 (CodeGenBugTest.java:161)
> >         at sun.reflect.NativeMethodAccessorImpl.invoke0(Native
> > Method) at sun.reflect.NativeMethodAccessorImpl.invoke(
> > NativeMethodAccessorImpl.java:39)
> >         at sun.reflect.DelegatingMethodAccessorImpl.invoke(
> > DelegatingMethodAccessorImpl.java:25)
> >         at java.lang.reflect.Method.invoke(Method.java:585)
> >         at junit.framework.TestCase.runTest(TestCase.java:168)
> >         at junit.framework.TestCase.runBare(TestCase.java:134)
> >         at junit.framework.TestResult$1.protect(TestResult.java:110)
> >         at
> > junit.framework.TestResult.runProtected(TestResult.java:128) at
> > junit.framework.TestResult.run(TestResult.java:113) at
> > junit.framework.TestCase.run(TestCase.java:124)
> >         at junit.framework.TestSuite.runTest(TestSuite.java:232)
> >         at junit.framework.TestSuite.run(TestSuite.java:227)
> >         at org.junit.internal.runners.OldTestClassRunner.run(
> > OldTestClassRunner.java:35)
> >         at org.apache.maven.surefire.junit4.JUnit4TestSet.execute(
> > JUnit4TestSet.java:62)
> >         at
> > org.apache.maven.surefire.suite.AbstractDirectoryTestSuite.executeTe
> >st Set( AbstractDirectoryTestSuite.java:138
> > )
> >         at
> > org.apache.maven.surefire.suite.AbstractDirectoryTestSuite.execute(
> > AbstractDirectoryTestSuite.java:125)
> >         at org.apache.maven.surefire.Surefire.run(Surefire.java:132)
> >         at sun.reflect.NativeMethodAccessorImpl.invoke0(Native
> > Method) at sun.reflect.NativeMethodAccessorImpl.invoke(
> > NativeMethodAccessorImpl.java:39)
> >         at sun.reflect.DelegatingMethodAccessorImpl.invoke(
> > DelegatingMethodAccessorImpl.java:25)
> >         at java.lang.reflect.Method.invoke(Method.java:585)
> >         at
> > org.apache.maven.surefire.booter.SurefireBooter.runSuitesInProcess(
> > SurefireBooter.java:290)
> >         at org.apache.maven.surefire.booter.SurefireBooter.main(
> > SurefireBooter.java:818)
> >
> > testCommandLine(org.apache.cxf.tools.wsdlto.jaxws.CodeGenBugTest)
> > Time elapsed: 1.491 sec  <<< ERROR!
> > java.lang.ClassNotFoundException: org.cxf.Greeter
> >         at java.net.URLClassLoader$1.run(URLClassLoader.java:200)
> >         at java.security.AccessController.doPrivileged(Native
> > Method) at
> > java.net.URLClassLoader.findClass(URLClassLoader.java:188) at
> > java.lang.ClassLoader.loadClass(ClassLoader.java:306) at
> > java.lang.ClassLoader.loadClass(ClassLoader.java:251) at
> > org.apache.cxf.tools.wsdlto.jaxws.CodeGenBugTest.testCommandLine(
> > CodeGenBugTest.java:290)
> >         at sun.reflect.NativeMethodAccessorImpl.invoke0(Native
> > Method) at sun.reflect.NativeMethodAccessorImpl.invoke(
> > NativeMethodAccessorImpl.java:39)
> >         at sun.reflect.DelegatingMethodAccessorImpl.invoke(
> > DelegatingMethodAccessorImpl.java:25)
> >         at java.lang.reflect.Method.invoke(Method.java:585)
> >         at junit.framework.TestCase.runTest(TestCase.java:168)
> >         at junit.framework.TestCase.runBare(TestCase.java:134)
> >         at junit.framework.TestResult$1.protect(TestResult.java:110)
> >         at
> > junit.framework.TestResult.runProtected(TestResult.java:128) at
> > junit.framework.TestResult.run(TestResult.java:113) at
> > junit.framework.TestCase.run(TestCase.java:124)
> >         at junit.framework.TestSuite.runTest(TestSuite.java:232)
> >         at junit.framework.TestSuite.run(TestSuite.java:227)
> >         at org.junit.internal.runners.OldTestClassRunner.run(
> > OldTestClassRunner.java:35)
> >         at org.apache.maven.surefire.junit4.JUnit4TestSet.execute(
> > JUnit4TestSet.java:62)
> >         at
> > org.apache.maven.surefire.suite.AbstractDirectoryTestSuite.executeTe
> >st Set( AbstractDirectoryTestSuite.java:138
> > )
> >         at
> > org.apache.maven.surefire.suite.AbstractDirectoryTestSuite.execute(
> > AbstractDirectoryTestSuite.java:125)
> >         at org.apache.maven.surefire.Surefire.run(Surefire.java:132)
> >         at sun.reflect.NativeMethodAccessorImpl.invoke0(Native
> > Method) at sun.reflect.NativeMethodAccessorImpl.invoke(
> > NativeMethodAccessorImpl.java:39)
> >         at sun.reflect.DelegatingMethodAccessorImpl.invoke(
> > DelegatingMethodAccessorImpl.java:25)
> >         at java.lang.reflect.Method.invoke(Method.java:585)
> >         at
> > org.apache.maven.surefire.booter.SurefireBooter.runSuitesInProcess(
> > SurefireBooter.java:290)
> >         at org.apache.maven.surefire.booter.SurefireBooter.main(
> > SurefireBooter.java:818)
> >
> > Running org.apache.cxf.tools.wsdlto.jaxws.CodeGenTest
> > Tests run: 26, Failures: 0, Errors: 24, Skipped: 0, Time elapsed:
> > 33.151 sec <<< FAILURE!
> > testRPCLit(org.apache.cxf.tools.wsdlto.jaxws.CodeGenTest)  Time
> > elapsed: 1.342 sec  <<< ERROR!
> > java.lang.ClassNotFoundException:
> > org.apache.hello_world_rpclit.GreeterRPCLit
> >         at java.net.URLClassLoader$1.run(URLClassLoader.java:200)
> >         at java.security.AccessController.doPrivileged(Native
> > Method) at
> > java.net.URLClassLoader.findClass(URLClassLoader.java:188) at
> > java.lang.ClassLoader.loadClass(ClassLoader.java:306) at
> > java.lang.ClassLoader.loadClass(ClassLoader.java:251) at
> > org.apache.cxf.tools.wsdlto.jaxws.CodeGenTest.testRPCLit(
> > CodeGenTest.java:93)
> >         at sun.reflect.NativeMethodAccessorImpl.invoke0(Native
> > Method) at sun.reflect.NativeMethodAccessorImpl.invoke(
> > NativeMethodAccessorImpl.java:39)
> >         at sun.reflect.DelegatingMethodAccessorImpl.invoke(
> > DelegatingMethodAccessorImpl.java:25)
> >         at java.lang.reflect.Method.invoke(Method.java:585)
> >         at junit.framework.TestCase.runTest(TestCase.java:168)
> >         at junit.framework.TestCase.runBare(TestCase.java:134)
> >         at junit.framework.TestResult$1.protect(TestResult.java:110)
> >         at
> > junit.framework.TestResult.runProtected(TestResult.java:128) at
> > junit.framework.TestResult.run(TestResult.java:113) at
> > junit.framework.TestCase.run(TestCase.java:124)
> >         at junit.framework.TestSuite.runTest(TestSuite.java:232)
> >         at junit.framework.TestSuite.run(TestSuite.java:227)
> >         at org.junit.internal.runners.OldTestClassRunner.run(
> > OldTestClassRunner.java:35)
> >         at org.apache.maven.surefire.junit4.JUnit4TestSet.execute(
> > JUnit4TestSet.java:62)
> >         at
> > org.apache.maven.surefire.suite.AbstractDirectoryTestSuite.executeTe
> >st Set( AbstractDirectoryTestSuite.java:138
> > )
> >         at
> > org.apache.maven.surefire.suite.AbstractDirectoryTestSuite.execute(
> > AbstractDirectoryTestSuite.java:125)
> >         at org.apache.maven.surefire.Surefire.run(Surefire.java:132)
> >         at sun.reflect.NativeMethodAccessorImpl.invoke0(Native
> > Method) at sun.reflect.NativeMethodAccessorImpl.invoke(
> > NativeMethodAccessorImpl.java:39)
> >         at sun.reflect.DelegatingMethodAccessorImpl.invoke(
> > DelegatingMethodAccessorImpl.java:25)
> >         at java.lang.reflect.Method.invoke(Method.java:585)
> >         at
> > org.apache.maven.surefire.booter.SurefireBooter.runSuitesInProcess(
> > SurefireBooter.java:290)
> >         at org.apache.maven.surefire.booter.SurefireBooter.main(
> > SurefireBooter.java:818)
> >
> > testAsynMethod(org.apache.cxf.tools.wsdlto.jaxws.CodeGenTest)  Time
> > elapsed: 1.291 sec  <<< ERROR!
> > java.lang.ClassNotFoundException:
> > org.apache.hello_world_async_soap_http.GreeterAsync
> >         at java.net.URLClassLoader$1.run(URLClassLoader.java:200)
> >         at java.security.AccessController.doPrivileged(Native
> > Method) at
> > java.net.URLClassLoader.findClass(URLClassLoader.java:188) at
> > java.lang.ClassLoader.loadClass(ClassLoader.java:306) at
> > java.lang.ClassLoader.loadClass(ClassLoader.java:251) at
> > org.apache.cxf.tools.wsdlto.jaxws.CodeGenTest.testAsynMethod(
> > CodeGenTest.java:137)
> >         at sun.reflect.NativeMethodAccessorImpl.invoke0(Native
> > Method) at sun.reflect.NativeMethodAccessorImpl.invoke(
> > NativeMethodAccessorImpl.java:39)
> >         at sun.reflect.DelegatingMethodAccessorImpl.invoke(
> > DelegatingMethodAccessorImpl.java:25)
> >         at java.lang.reflect.Method.invoke(Method.java:585)
> >         at junit.framework.TestCase.runTest(TestCase.java:168)
> >         at junit.framework.TestCase.runBare(TestCase.java:134)
> >         at junit.framework.TestResult$1.protect(TestResult.java:110)
> >         at
> > junit.framework.TestResult.runProtected(TestResult.java:128) at
> > junit.framework.TestResult.run(TestResult.java:113) at
> > junit.framework.TestCase.run(TestCase.java:124)
> >         at junit.framework.TestSuite.runTest(TestSuite.java:232)
> >         at junit.framework.TestSuite.run(TestSuite.java:227)
> >         at org.junit.internal.runners.OldTestClassRunner.run(
> > OldTestClassRunner.java:35)
> >         at org.apache.maven.surefire.junit4.JUnit4TestSet.execute(
> > JUnit4TestSet.java:62)
> >         at
> > org.apache.maven.surefire.suite.AbstractDirectoryTestSuite.executeTe
> >st Set( AbstractDirectoryTestSuite.java:138
> > )
> >         at
> > org.apache.maven.surefire.suite.AbstractDirectoryTestSuite.execute(
> > AbstractDirectoryTestSuite.java:125)
> >         at org.apache.maven.surefire.Surefire.run(Surefire.java:132)
> >         at sun.reflect.NativeMethodAccessorImpl.invoke0(Native
> > Method) at sun.reflect.NativeMethodAccessorImpl.invoke(
> > NativeMethodAccessorImpl.java:39)
> >         at sun.reflect.DelegatingMethodAccessorImpl.invoke(
> > DelegatingMethodAccessorImpl.java:25)
> >         at java.lang.reflect.Method.invoke(Method.java:585)
> >         at
> > org.apache.maven.surefire.booter.SurefireBooter.runSuitesInProcess(
> > SurefireBooter.java:290)
> >         at org.apache.maven.surefire.booter.SurefireBooter.main(
> > SurefireBooter.java:818)

-- 
J. Daniel Kulp
Principal Engineer
IONA
P: 781-902-8727    C: 508-380-7194
daniel.kulp@iona.com
http://www.dankulp.com/blog

Mime
View raw message