curator-dev mailing list archives

Site index · List index
Message view « Date » · « Thread »
Top « Date » · « Thread »
From Apache Jenkins Server <jenk...@builds.apache.org>
Subject Build failed in Jenkins: Curator » Curator Framework #99
Date Tue, 05 Feb 2019 17:36:46 GMT
See <https://builds.apache.org/job/Curator/org.apache.curator$curator-framework/99/display/redirect?page=changes>

Changes:

[randgalt] CURATOR-498

[randgalt] CURATOR-498 - minor tuning to testSessionSurvives() test

------------------------------------------
Established TCP socket on 35225
maven32-agent.jar already up to date
maven32-interceptor.jar already up to date
maven3-interceptor-commons.jar already up to date
<===[JENKINS REMOTING CAPACITY]===>   channel started
Executing Maven:  -N -B -Dmaven.repo.local=/home/jenkins/jenkins-slave/maven-repositories/1
-f <https://builds.apache.org/job/Curator/org.apache.curator$curator-framework/ws/pom.xml>
$Mavenargs
[INFO] Scanning for projects...
[INFO]                                                                         
[INFO] ------------------------------------------------------------------------
[INFO] Building Curator Framework 4.1.1-SNAPSHOT
[INFO] ------------------------------------------------------------------------
[INFO] ------------------------------------------------------------------------
[INFO] BUILD FAILURE
[INFO] ------------------------------------------------------------------------
[INFO] Total time: 6.638 s
[INFO] Finished at: 2019-02-05T17:36:45+00:00
[INFO] Final Memory: 15M/981M
[INFO] ------------------------------------------------------------------------
Waiting for Jenkins to finish collecting data
[ERROR] Unknown lifecycle phase "$Mavenargs". You must specify a valid lifecycle phase or
a goal in the format <plugin-prefix>:<goal> or <plugin-group-id>:<plugin-artifact-id>[:<plugin-version>]:<goal>.
Available lifecycle phases are: validate, initialize, generate-sources, process-sources, generate-resources,
process-resources, compile, process-classes, generate-test-sources, process-test-sources,
generate-test-resources, process-test-resources, test-compile, process-test-classes, test,
prepare-package, package, pre-integration-test, integration-test, post-integration-test, verify,
install, deploy, pre-clean, clean, post-clean, pre-site, site, post-site, site-deploy. ->
[Help 1]
[ERROR] 
[ERROR] To see the full stack trace of the errors, re-run Maven with the -e switch.
[ERROR] Re-run Maven using the -X switch to enable full debug logging.
[ERROR] 
[ERROR] For more information about the errors and possible solutions, please read the following
articles:
[ERROR] [Help 1] http://cwiki.apache.org/confluence/display/MAVEN/LifecyclePhaseNotFoundException
[JENKINS] Archiving <https://builds.apache.org/job/Curator/org.apache.curator$curator-framework/ws/pom.xml>
to org.apache.curator/curator-framework/4.1.1-SNAPSHOT/curator-framework-4.1.1-SNAPSHOT.pom

Mime
View raw message