curator-dev mailing list archives

Site index · List index
Message view « Date » · « Thread »
Top « Date » · « Thread »
From Apache Jenkins Server <jenk...@builds.apache.org>
Subject Build failed in Jenkins: Curator #44
Date Sun, 24 Jun 2018 15:24:34 GMT
See <https://builds.apache.org/job/Curator/44/display/redirect?page=changes>

Changes:

[cjmctague] CURATOR-448 - Include curator framework state in error messages

[randgalt] Closes #267

------------------------------------------
[...truncated 1.41 MB...]
Running org.apache.curator.utils.TestCloseableScheduledExecutorService
Tests run: 2, Failures: 0, Errors: 0, Skipped: 0, Time elapsed: 2.532 sec - in org.apache.curator.utils.TestCloseableScheduledExecutorService
Running org.apache.curator.utils.TestCloseableExecutorService
Tests run: 5, Failures: 0, Errors: 0, Skipped: 0, Time elapsed: 0.552 sec - in org.apache.curator.utils.TestCloseableExecutorService
Running org.apache.curator.TestRetryLoop
Tests run: 4, Failures: 0, Errors: 0, Skipped: 0, Time elapsed: 10.166 sec - in org.apache.curator.TestRetryLoop

Results :

Tests run: 22, Failures: 0, Errors: 0, Skipped: 0

[JENKINS] Recording test results
[INFO] 
[INFO] --- maven-bundle-plugin:3.2.0:bundle (default-bundle) @ curator-client ---
[INFO] 
[INFO] --- maven-site-plugin:3.5.1:attach-descriptor (attach-descriptor) @ curator-client
---
[INFO] 
[INFO] --- maven-shade-plugin:2.4.3:shade (apache-curator-guava-shader) @ curator-client ---
[INFO] Excluding org.apache.zookeeper:zookeeper:jar:3.5.3-beta from the shaded jar.
[INFO] Excluding commons-cli:commons-cli:jar:1.2 from the shaded jar.
[INFO] Excluding log4j:log4j:jar:1.2.17 from the shaded jar.
[INFO] Excluding io.netty:netty:jar:3.10.5.Final from the shaded jar.
[INFO] Including com.google.guava:guava:jar:20.0 in the shaded jar.
[INFO] Excluding org.slf4j:slf4j-api:jar:1.7.6 from the shaded jar.
[INFO] Replacing original artifact with shaded artifact.
[INFO] Replacing <https://builds.apache.org/job/Curator/ws/curator-client/target/curator-client-4.0.2-SNAPSHOT.jar>
with <https://builds.apache.org/job/Curator/ws/curator-client/target/curator-client-4.0.2-SNAPSHOT-shaded.jar>
[INFO] 
[INFO] --- maven-license-plugin:1.9.0:check (license) @ curator-client ---
[INFO] Checking licenses...
[CHECKSTYLE] No report found for mojo check[INFO] 

[INFO] --- maven-install-plugin:2.5.2:install (default-install) @ curator-client ---
[INFO] Installing <https://builds.apache.org/job/Curator/ws/curator-client/target/curator-client-4.0.2-SNAPSHOT.jar>
to /home/jenkins/jenkins-slave/maven-repositories/0/org/apache/curator/curator-client/4.0.2-SNAPSHOT/curator-client-4.0.2-SNAPSHOT.jar
[INFO] Installing <https://builds.apache.org/job/Curator/ws/curator-client/pom.xml>
to /home/jenkins/jenkins-slave/maven-repositories/0/org/apache/curator/curator-client/4.0.2-SNAPSHOT/curator-client-4.0.2-SNAPSHOT.pom
[INFO] 
[INFO] --- maven-bundle-plugin:3.2.0:install (default-install) @ curator-client ---
[INFO] Installing org/apache/curator/curator-client/4.0.2-SNAPSHOT/curator-client-4.0.2-SNAPSHOT.jar
[INFO] Writing OBR metadata
[INFO]                                                                         
[INFO] ------------------------------------------------------------------------
[INFO] Building Curator Framework 4.0.2-SNAPSHOT
[INFO] ------------------------------------------------------------------------
[INFO] 
[INFO] --- maven-clean-plugin:3.0.0:clean (default-clean) @ curator-framework ---
[INFO] 
[INFO] --- maven-remote-resources-plugin:1.5:process (process-resource-bundles) @ curator-framework
---
[INFO] 
[INFO] --- maven-resources-plugin:2.7:resources (default-resources) @ curator-framework ---
[INFO] Using 'UTF-8' encoding to copy filtered resources.
[INFO] Copying 2 resources to META-INF
[INFO] Copying 3 resources
[INFO] 
[INFO] --- maven-compiler-plugin:3.5.1:compile (default-compile) @ curator-framework ---
[INFO] Changes detected - recompiling the module!
[INFO] Compiling 167 source files to <https://builds.apache.org/job/Curator/ws/curator-framework/target/classes>
[INFO] <https://builds.apache.org/job/Curator/ws/curator-framework/src/main/java/org/apache/curator/framework/imps/CuratorFrameworkImpl.java>:
Some input files use or override a deprecated API.
[INFO] <https://builds.apache.org/job/Curator/ws/curator-framework/src/main/java/org/apache/curator/framework/imps/CuratorFrameworkImpl.java>:
Recompile with -Xlint:deprecation for details.
[INFO] 
[INFO] >>> clirr-maven-plugin:2.8:check (default) > compile @ curator-framework
>>>
[INFO] 
[INFO] --- maven-remote-resources-plugin:1.5:process (process-resource-bundles) @ curator-framework
---
[INFO] 
[INFO] --- maven-resources-plugin:2.7:resources (default-resources) @ curator-framework ---
[INFO] Using 'UTF-8' encoding to copy filtered resources.
[INFO] Copying 2 resources to META-INF
[INFO] Copying 3 resources
[INFO] Copying 3 resources
[INFO] 
[INFO] --- maven-compiler-plugin:3.5.1:compile (default-compile) @ curator-framework ---
[INFO] Nothing to compile - all classes are up to date
[WARNING] Failed to getClass for org.codehaus.mojo.clirr.ClirrCheckMojo
[CHECKSTYLE] No report found for mojo check
[INFO] 
[INFO] <<< clirr-maven-plugin:2.8:check (default) < compile @ curator-framework
<<<
[INFO] 
[INFO] --- clirr-maven-plugin:2.8:check (default) @ curator-framework ---
[INFO] Comparing to version: 4.0.1
[INFO] Succeeded with 0 errors; 0 warnings; and 0 other changes.
[CHECKSTYLE] No report found for mojo check
[INFO] 
[INFO] --- maven-bundle-plugin:3.2.0:manifest (bundle-manifest) @ curator-framework ---
[INFO] 
[INFO] --- maven-resources-plugin:2.7:testResources (default-testResources) @ curator-framework
---
[INFO] Using 'UTF-8' encoding to copy filtered resources.
[INFO] Copying 7 resources
[INFO] Copying 3 resources
[INFO] 
[INFO] --- maven-compiler-plugin:3.5.1:testCompile (default-testCompile) @ curator-framework
---
[INFO] Changes detected - recompiling the module!
[INFO] Compiling 30 source files to <https://builds.apache.org/job/Curator/ws/curator-framework/target/test-classes>
[INFO] <https://builds.apache.org/job/Curator/ws/curator-framework/src/test/java/org/apache/curator/framework/imps/TestFramework.java>:
<https://builds.apache.org/job/Curator/ws/curator-framework/src/test/java/org/apache/curator/framework/imps/TestFramework.java>
uses or overrides a deprecated API.
[INFO] <https://builds.apache.org/job/Curator/ws/curator-framework/src/test/java/org/apache/curator/framework/imps/TestFramework.java>:
Recompile with -Xlint:deprecation for details.
[INFO] 
[INFO] --- maven-surefire-plugin:2.19.1:test (default-test) @ curator-framework ---

-------------------------------------------------------
 T E S T S
-------------------------------------------------------
Running org.apache.curator.framework.schema.TestSchema
Tests run: 6, Failures: 0, Errors: 0, Skipped: 0, Time elapsed: 2.095 sec - in org.apache.curator.framework.schema.TestSchema
Running org.apache.curator.framework.state.TestConnectionStateManager
Tests run: 1, Failures: 0, Errors: 0, Skipped: 0, Time elapsed: 15.354 sec - in org.apache.curator.framework.state.TestConnectionStateManager
Running org.apache.curator.framework.imps.TestEnabledSessionExpiredState
Tests run: 6, Failures: 0, Errors: 0, Skipped: 0, Time elapsed: 149.436 sec - in org.apache.curator.framework.imps.TestEnabledSessionExpiredState
Running org.apache.curator.framework.imps.TestCompressionInTransactionOld
Tests run: 4, Failures: 0, Errors: 0, Skipped: 0, Time elapsed: 1.549 sec - in org.apache.curator.framework.imps.TestCompressionInTransactionOld
Running org.apache.curator.framework.imps.TestWatcherIdentity
Tests run: 5, Failures: 0, Errors: 0, Skipped: 0, Time elapsed: 31.805 sec - in org.apache.curator.framework.imps.TestWatcherIdentity
Running org.apache.curator.framework.imps.TestWithCluster
Tests run: 2, Failures: 0, Errors: 0, Skipped: 0, Time elapsed: 117.099 sec - in org.apache.curator.framework.imps.TestWithCluster
Running org.apache.curator.framework.imps.TestCompressionInTransactionNew
Tests run: 4, Failures: 0, Errors: 0, Skipped: 0, Time elapsed: 1.534 sec - in org.apache.curator.framework.imps.TestCompressionInTransactionNew
Running org.apache.curator.framework.imps.TestNamespaceFacade
Tests run: 9, Failures: 0, Errors: 0, Skipped: 0, Time elapsed: 1.958 sec - in org.apache.curator.framework.imps.TestNamespaceFacade
Running org.apache.curator.framework.imps.TestReconfiguration
Tests run: 13, Failures: 0, Errors: 0, Skipped: 0, Time elapsed: 17.075 sec - in org.apache.curator.framework.imps.TestReconfiguration
Running org.apache.curator.framework.imps.TestMultiClient
Tests run: 1, Failures: 0, Errors: 0, Skipped: 0, Time elapsed: 1.232 sec - in org.apache.curator.framework.imps.TestMultiClient
Running org.apache.curator.framework.imps.TestRemoveWatches
Tests run: 14, Failures: 0, Errors: 0, Skipped: 0, Time elapsed: 187.187 sec - in org.apache.curator.framework.imps.TestRemoveWatches
Running org.apache.curator.framework.imps.TestExistsBuilder
Tests run: 2, Failures: 0, Errors: 0, Skipped: 0, Time elapsed: 1.363 sec - in org.apache.curator.framework.imps.TestExistsBuilder
Running org.apache.curator.framework.imps.TestBlockUntilConnected
Tests run: 6, Failures: 0, Errors: 0, Skipped: 0, Time elapsed: 19.052 sec - in org.apache.curator.framework.imps.TestBlockUntilConnected
Running org.apache.curator.framework.imps.TestWatcherRemovalManager
Tests run: 15, Failures: 0, Errors: 0, Skipped: 0, Time elapsed: 45.878 sec - in org.apache.curator.framework.imps.TestWatcherRemovalManager
Running org.apache.curator.framework.imps.TestFrameworkEdges
Tests run: 19, Failures: 1, Errors: 0, Skipped: 1, Time elapsed: 289.129 sec <<<
FAILURE! - in org.apache.curator.framework.imps.TestFrameworkEdges
testDeleteChildrenConcurrently(org.apache.curator.framework.imps.TestFrameworkEdges)  Time
elapsed: 56.17 sec  <<< FAILURE!
java.lang.AssertionError: expected [true] but found [false]
	at org.apache.curator.framework.imps.TestFrameworkEdges.testDeleteChildrenConcurrently(TestFrameworkEdges.java:710)

Running org.apache.curator.framework.imps.TestFailedDeleteManager
Tests run: 6, Failures: 0, Errors: 0, Skipped: 0, Time elapsed: 116.357 sec - in org.apache.curator.framework.imps.TestFailedDeleteManager
Running org.apache.curator.framework.imps.TestTransactionsNew
Tests run: 6, Failures: 0, Errors: 0, Skipped: 0, Time elapsed: 1.803 sec - in org.apache.curator.framework.imps.TestTransactionsNew
Running org.apache.curator.framework.imps.TestCreate
Tests run: 6, Failures: 0, Errors: 0, Skipped: 0, Time elapsed: 1.872 sec - in org.apache.curator.framework.imps.TestCreate
Running org.apache.curator.framework.imps.TestEnsureContainers
Tests run: 2, Failures: 0, Errors: 0, Skipped: 0, Time elapsed: 1.371 sec - in org.apache.curator.framework.imps.TestEnsureContainers
Running org.apache.curator.framework.imps.TestCreateReturningStat
Tests run: 7, Failures: 0, Errors: 0, Skipped: 0, Time elapsed: 1.968 sec - in org.apache.curator.framework.imps.TestCreateReturningStat
Running org.apache.curator.framework.imps.TestTempFramework
Tests run: 2, Failures: 0, Errors: 0, Skipped: 0, Time elapsed: 3.277 sec - in org.apache.curator.framework.imps.TestTempFramework
Running org.apache.curator.framework.imps.TestCleanState
Tests run: 0, Failures: 0, Errors: 0, Skipped: 0, Time elapsed: 0.324 sec - in org.apache.curator.framework.imps.TestCleanState
Running org.apache.curator.framework.imps.TestFramework
Tests run: 34, Failures: 0, Errors: 0, Skipped: 0, Time elapsed: 142.46 sec - in org.apache.curator.framework.imps.TestFramework
Running org.apache.curator.framework.imps.TestCompression
Tests run: 3, Failures: 0, Errors: 0, Skipped: 0, Time elapsed: 1.497 sec - in org.apache.curator.framework.imps.TestCompression
Running org.apache.curator.framework.imps.TestNeverConnected
Tests run: 1, Failures: 0, Errors: 0, Skipped: 0, Time elapsed: 1.951 sec - in org.apache.curator.framework.imps.TestNeverConnected
Running org.apache.curator.framework.imps.TestTtlNodes
Tests run: 2, Failures: 0, Errors: 0, Skipped: 0, Time elapsed: 1.391 sec - in org.apache.curator.framework.imps.TestTtlNodes
Running org.apache.curator.framework.imps.TestFrameworkBackground
Tests run: 6, Failures: 0, Errors: 0, Skipped: 0, Time elapsed: 40.002 sec - in org.apache.curator.framework.imps.TestFrameworkBackground
Running org.apache.curator.framework.imps.TestReadOnly
Tests run: 2, Failures: 0, Errors: 0, Skipped: 0, Time elapsed: 30.736 sec - in org.apache.curator.framework.imps.TestReadOnly
Running org.apache.curator.framework.imps.TestTransactionsOld
Tests run: 4, Failures: 0, Errors: 0, Skipped: 0, Time elapsed: 1.807 sec - in org.apache.curator.framework.imps.TestTransactionsOld
Running org.apache.curator.framework.ensemble.TestEnsembleProvider
Tests run: 2, Failures: 0, Errors: 0, Skipped: 0, Time elapsed: 10.874 sec - in org.apache.curator.framework.ensemble.TestEnsembleProvider

Results :

Failed tests: 
org.apache.curator.framework.imps.TestFrameworkEdges.testDeleteChildrenConcurrently(org.apache.curator.framework.imps.TestFrameworkEdges)
  Run 1: PASS
  Run 2: TestFrameworkEdges.testDeleteChildrenConcurrently:710 expected [true] but found [false]


Tests run: 189, Failures: 1, Errors: 0, Skipped: 0

[ERROR] There are test failures.

Please refer to <https://builds.apache.org/job/Curator/ws/curator-framework/target/surefire-reports>
for the individual test results.
[JENKINS] Recording test results
[INFO] 
[INFO] --- maven-bundle-plugin:3.2.0:bundle (default-bundle) @ curator-framework ---
[INFO] 
[INFO] --- maven-site-plugin:3.5.1:attach-descriptor (attach-descriptor) @ curator-framework
---
[INFO] 
[INFO] --- maven-shade-plugin:2.4.3:shade (apache-curator-guava-shader) @ curator-framework
---
[INFO] Excluding org.apache.curator:curator-client:jar:4.0.2-SNAPSHOT from the shaded jar.
[INFO] Excluding org.apache.zookeeper:zookeeper:jar:3.5.3-beta from the shaded jar.
[INFO] Excluding commons-cli:commons-cli:jar:1.2 from the shaded jar.
[INFO] Excluding io.netty:netty:jar:3.10.5.Final from the shaded jar.
[INFO] Excluding com.google.guava:guava:jar:20.0 from the shaded jar.
[INFO] Excluding org.slf4j:slf4j-api:jar:1.7.6 from the shaded jar.
[INFO] Excluding log4j:log4j:jar:1.2.17 from the shaded jar.
[INFO] Replacing original artifact with shaded artifact.
[INFO] Replacing <https://builds.apache.org/job/Curator/ws/curator-framework/target/curator-framework-4.0.2-SNAPSHOT.jar>
with <https://builds.apache.org/job/Curator/ws/curator-framework/target/curator-framework-4.0.2-SNAPSHOT-shaded.jar>
[INFO] 
[INFO] --- maven-jar-plugin:3.0.0:test-jar (default) @ curator-framework ---
[INFO] Building jar: <https://builds.apache.org/job/Curator/ws/curator-framework/target/curator-framework-4.0.2-SNAPSHOT-tests.jar>
[INFO] 
[INFO] --- maven-license-plugin:1.9.0:check (license) @ curator-framework ---
[INFO] Checking licenses...
[INFO] Missing header in: <https://builds.apache.org/job/Curator/ws/curator-framework/src/test/java/org/apache/curator/framework/state/TestConnectionStateManager.java>
[WARNING] Unknown file extension: <https://builds.apache.org/job/Curator/ws/curator-framework/src/test/resources/schema.yaml>
[CHECKSTYLE] No report found for mojo check
[INFO] ------------------------------------------------------------------------
[INFO] Reactor Summary:
[INFO] 
[INFO] Apache Curator ..................................... SUCCESS [ 13.929 s]
[INFO] Curator Testing .................................... SUCCESS [01:19 min]
[INFO] Curator Client ..................................... SUCCESS [ 42.750 s]
[INFO] Curator Framework .................................. FAILURE [21:13 min]
[INFO] Curator Recipes .................................... SKIPPED
[INFO] Curator Service Discovery .......................... SKIPPED
[INFO] Curator Async ...................................... SKIPPED
[INFO] Curator Examples ................................... SKIPPED
[INFO] Curator Service Discovery Server ................... SKIPPED
[INFO] Curator ZooKeeper 3.4 Testing ...................... SKIPPED
[INFO] ------------------------------------------------------------------------
[INFO] BUILD FAILURE
[INFO] ------------------------------------------------------------------------
[INFO] Total time: 23:58 min
[INFO] Finished at: 2018-06-24T15:24:07+00:00
[INFO] Final Memory: 49M/1559M
[INFO] ------------------------------------------------------------------------
[ERROR] Failed to execute goal com.mycila.maven-license-plugin:maven-license-plugin:1.9.0:check
(license) on project curator-framework: Some files do not have the expected license header
-> [Help 1]
[ERROR] 
[ERROR] To see the full stack trace of the errors, re-run Maven with the -e switch.
[ERROR] Re-run Maven using the -X switch to enable full debug logging.
[ERROR] 
[ERROR] For more information about the errors and possible solutions, please read the following
articles:
[ERROR] [Help 1] http://cwiki.apache.org/confluence/display/MAVEN/MojoExecutionException
[ERROR] 
[ERROR] After correcting the problems, you can resume the build with the command
[ERROR]   mvn <goals> -rf :curator-framework
[JENKINS] Archiving <https://builds.apache.org/job/Curator/ws/pom.xml> to org.apache.curator/apache-curator/4.0.2-SNAPSHOT/apache-curator-4.0.2-SNAPSHOT.pom
[JENKINS] Archiving <https://builds.apache.org/job/Curator/ws/target/apache-curator-4.0.2-SNAPSHOT-site.xml>
to org.apache.curator/apache-curator/4.0.2-SNAPSHOT/apache-curator-4.0.2-SNAPSHOT-site.xml
[Fast Archiver] Compressed 39.29 KB of artifacts by 81.5% relative to #43
[JENKINS] Archiving <https://builds.apache.org/job/Curator/ws/curator-test/pom.xml>
to org.apache.curator/curator-test/4.0.2-SNAPSHOT/curator-test-4.0.2-SNAPSHOT.pom
[JENKINS] Archiving <https://builds.apache.org/job/Curator/ws/curator-test/target/curator-test-4.0.2-SNAPSHOT.jar>
to org.apache.curator/curator-test/4.0.2-SNAPSHOT/curator-test-4.0.2-SNAPSHOT.jar
[JENKINS] Archiving <https://builds.apache.org/job/Curator/ws/curator-test-zk34/pom.xml>
to org.apache.curator/curator-test-zk34/4.0.2-SNAPSHOT/curator-test-zk34-4.0.2-SNAPSHOT.pom
[JENKINS] Archiving <https://builds.apache.org/job/Curator/ws/curator-x-async/pom.xml>
to org.apache.curator/curator-x-async/4.0.2-SNAPSHOT/curator-x-async-4.0.2-SNAPSHOT.pom
[JENKINS] Archiving <https://builds.apache.org/job/Curator/ws/curator-examples/pom.xml>
to org.apache.curator/curator-examples/4.0.2-SNAPSHOT/curator-examples-4.0.2-SNAPSHOT.pom
[JENKINS] Archiving <https://builds.apache.org/job/Curator/ws/curator-x-discovery/pom.xml>
to org.apache.curator/curator-x-discovery/4.0.2-SNAPSHOT/curator-x-discovery-4.0.2-SNAPSHOT.pom
[JENKINS] Archiving <https://builds.apache.org/job/Curator/ws/curator-recipes/pom.xml>
to org.apache.curator/curator-recipes/4.0.2-SNAPSHOT/curator-recipes-4.0.2-SNAPSHOT.pom
[JENKINS] Archiving <https://builds.apache.org/job/Curator/ws/curator-x-discovery-server/pom.xml>
to org.apache.curator/curator-x-discovery-server/4.0.2-SNAPSHOT/curator-x-discovery-server-4.0.2-SNAPSHOT.pom
[JENKINS] Archiving <https://builds.apache.org/job/Curator/ws/curator-client/pom.xml>
to org.apache.curator/curator-client/4.0.2-SNAPSHOT/curator-client-4.0.2-SNAPSHOT.pom
[JENKINS] Archiving <https://builds.apache.org/job/Curator/ws/curator-client/target/curator-client-4.0.2-SNAPSHOT.jar>
to org.apache.curator/curator-client/4.0.2-SNAPSHOT/curator-client-4.0.2-SNAPSHOT.jar
[JENKINS] Archiving <https://builds.apache.org/job/Curator/ws/curator-framework/pom.xml>
to org.apache.curator/curator-framework/4.0.2-SNAPSHOT/curator-framework-4.0.2-SNAPSHOT.pom
[JENKINS] Archiving <https://builds.apache.org/job/Curator/ws/curator-framework/target/curator-framework-4.0.2-SNAPSHOT.jar>
to org.apache.curator/curator-framework/4.0.2-SNAPSHOT/curator-framework-4.0.2-SNAPSHOT.jar
[JENKINS] Archiving <https://builds.apache.org/job/Curator/ws/curator-framework/target/curator-framework-4.0.2-SNAPSHOT-tests.jar>
to org.apache.curator/curator-framework/4.0.2-SNAPSHOT/curator-framework-4.0.2-SNAPSHOT-tests.jar
Sending e-mails to: dev@curator.apache.org
channel stopped

Mime
View raw message