curator-dev mailing list archives

Site index · List index
Message view « Date » · « Thread »
Top « Date » · « Thread »
From Apache Jenkins Server <jenk...@builds.apache.org>
Subject Build failed in Jenkins: Curator #40
Date Mon, 21 May 2018 14:32:29 GMT
See <https://builds.apache.org/job/Curator/40/display/redirect>

------------------------------------------
[...truncated 1.42 MB...]
[INFO] --- maven-bundle-plugin:3.2.0:install (default-install) @ curator-client ---
[INFO] Installing org/apache/curator/curator-client/4.0.2-SNAPSHOT/curator-client-4.0.2-SNAPSHOT.jar
[INFO] Writing OBR metadata
[INFO]                                                                         
[INFO] ------------------------------------------------------------------------
[INFO] Building Curator Framework 4.0.2-SNAPSHOT
[INFO] ------------------------------------------------------------------------
[INFO] Downloading: https://repo.maven.apache.org/maven2/com/fasterxml/jackson/core/jackson-core/2.7.3/jackson-core-2.7.3.pom
[INFO] Downloaded: https://repo.maven.apache.org/maven2/com/fasterxml/jackson/core/jackson-core/2.7.3/jackson-core-2.7.3.pom
(5 KB at 329.6 KB/sec)
[INFO] Downloading: https://repo.maven.apache.org/maven2/com/fasterxml/jackson/jackson-parent/2.7/jackson-parent-2.7.pom
[INFO] Downloaded: https://repo.maven.apache.org/maven2/com/fasterxml/jackson/jackson-parent/2.7/jackson-parent-2.7.pom
(8 KB at 568.2 KB/sec)
[INFO] Downloading: https://repo.maven.apache.org/maven2/com/fasterxml/oss-parent/25/oss-parent-25.pom
[INFO] Downloaded: https://repo.maven.apache.org/maven2/com/fasterxml/oss-parent/25/oss-parent-25.pom
(19 KB at 1052.4 KB/sec)
[INFO] Downloading: https://repo.maven.apache.org/maven2/com/fasterxml/jackson/core/jackson-databind/2.7.3/jackson-databind-2.7.3.pom
[INFO] Downloaded: https://repo.maven.apache.org/maven2/com/fasterxml/jackson/core/jackson-databind/2.7.3/jackson-databind-2.7.3.pom
(6 KB at 338.0 KB/sec)
[INFO] Downloading: https://repo.maven.apache.org/maven2/com/fasterxml/jackson/core/jackson-annotations/2.7.0/jackson-annotations-2.7.0.pom
[INFO] Downloaded: https://repo.maven.apache.org/maven2/com/fasterxml/jackson/core/jackson-annotations/2.7.0/jackson-annotations-2.7.0.pom
(2 KB at 101.4 KB/sec)
[INFO] Downloading: https://repo.maven.apache.org/maven2/com/fasterxml/jackson/dataformat/jackson-dataformat-yaml/2.7.3/jackson-dataformat-yaml-2.7.3.pom
[INFO] Downloaded: https://repo.maven.apache.org/maven2/com/fasterxml/jackson/dataformat/jackson-dataformat-yaml/2.7.3/jackson-dataformat-yaml-2.7.3.pom
(8 KB at 502.8 KB/sec)
[INFO] Downloading: https://repo.maven.apache.org/maven2/org/yaml/snakeyaml/1.15/snakeyaml-1.15.pom
[INFO] Downloaded: https://repo.maven.apache.org/maven2/org/yaml/snakeyaml/1.15/snakeyaml-1.15.pom
(26 KB at 1604.2 KB/sec)
[INFO] Downloading: https://repo.maven.apache.org/maven2/com/fasterxml/jackson/core/jackson-core/2.7.3/jackson-core-2.7.3.jar
[INFO] Downloading: https://repo.maven.apache.org/maven2/com/fasterxml/jackson/core/jackson-databind/2.7.3/jackson-databind-2.7.3.jar
[INFO] Downloading: https://repo.maven.apache.org/maven2/com/fasterxml/jackson/core/jackson-annotations/2.7.0/jackson-annotations-2.7.0.jar
[INFO] Downloading: https://repo.maven.apache.org/maven2/com/fasterxml/jackson/dataformat/jackson-dataformat-yaml/2.7.3/jackson-dataformat-yaml-2.7.3.jar
[INFO] Downloading: https://repo.maven.apache.org/maven2/org/yaml/snakeyaml/1.15/snakeyaml-1.15.jar
[INFO] Downloaded: https://repo.maven.apache.org/maven2/com/fasterxml/jackson/core/jackson-annotations/2.7.0/jackson-annotations-2.7.0.jar
(50 KB at 2615.9 KB/sec)
[INFO] Downloaded: https://repo.maven.apache.org/maven2/com/fasterxml/jackson/core/jackson-core/2.7.3/jackson-core-2.7.3.jar
(247 KB at 8503.4 KB/sec)
[INFO] Downloaded: https://repo.maven.apache.org/maven2/org/yaml/snakeyaml/1.15/snakeyaml-1.15.jar
(263 KB at 6743.2 KB/sec)
[INFO] Downloaded: https://repo.maven.apache.org/maven2/com/fasterxml/jackson/dataformat/jackson-dataformat-yaml/2.7.3/jackson-dataformat-yaml-2.7.3.jar
(314 KB at 7129.2 KB/sec)
[INFO] Downloaded: https://repo.maven.apache.org/maven2/com/fasterxml/jackson/core/jackson-databind/2.7.3/jackson-databind-2.7.3.jar
(1175 KB at 13977.4 KB/sec)
[INFO] 
[INFO] --- maven-clean-plugin:3.0.0:clean (default-clean) @ curator-framework ---
[INFO] 
[INFO] --- maven-remote-resources-plugin:1.5:process (process-resource-bundles) @ curator-framework
---
[INFO] 
[INFO] --- maven-resources-plugin:2.7:resources (default-resources) @ curator-framework ---
[INFO] Using 'UTF-8' encoding to copy filtered resources.
[INFO] Copying 2 resources to META-INF
[INFO] Copying 3 resources
[INFO] 
[INFO] --- maven-compiler-plugin:3.5.1:compile (default-compile) @ curator-framework ---
[INFO] Changes detected - recompiling the module!
[INFO] Compiling 167 source files to <https://builds.apache.org/job/Curator/ws/curator-framework/target/classes>
[INFO] <https://builds.apache.org/job/Curator/ws/curator-framework/src/main/java/org/apache/curator/framework/imps/CuratorFrameworkImpl.java>:
Some input files use or override a deprecated API.
[INFO] <https://builds.apache.org/job/Curator/ws/curator-framework/src/main/java/org/apache/curator/framework/imps/CuratorFrameworkImpl.java>:
Recompile with -Xlint:deprecation for details.
[INFO] 
[INFO] >>> clirr-maven-plugin:2.8:check (default) > compile @ curator-framework
>>>
[INFO] 
[INFO] --- maven-remote-resources-plugin:1.5:process (process-resource-bundles) @ curator-framework
---
[INFO] 
[INFO] --- maven-resources-plugin:2.7:resources (default-resources) @ curator-framework ---
[INFO] Using 'UTF-8' encoding to copy filtered resources.
[INFO] Copying 2 resources to META-INF
[INFO] Copying 3 resources
[INFO] Copying 3 resources
[INFO] 
[INFO] --- maven-compiler-plugin:3.5.1:compile (default-compile) @ curator-framework ---
[INFO] Nothing to compile - all classes are up to date
[WARNING] Failed to getClass for org.codehaus.mojo.clirr.ClirrCheckMojo
[CHECKSTYLE] No report found for mojo check
[INFO] 
[INFO] <<< clirr-maven-plugin:2.8:check (default) < compile @ curator-framework
<<<
[INFO] 
[INFO] --- clirr-maven-plugin:2.8:check (default) @ curator-framework ---
[INFO] artifact org.apache.curator:curator-framework: checking for updates from Nexus
[INFO] artifact org.apache.curator:curator-framework: checking for updates from central
[INFO] Comparing to version: 4.0.1
[INFO] Downloading: https://repo.maven.apache.org/maven2/org/apache/curator/curator-framework/4.0.1/curator-framework-4.0.1.jar
[INFO] Downloaded: https://repo.maven.apache.org/maven2/org/apache/curator/curator-framework/4.0.1/curator-framework-4.0.1.jar
(301 KB at 5777.6 KB/sec)
[INFO] Downloading: https://repo.maven.apache.org/maven2/org/apache/curator/curator-framework/4.0.1/curator-framework-4.0.1.pom
[INFO] Downloaded: https://repo.maven.apache.org/maven2/org/apache/curator/curator-framework/4.0.1/curator-framework-4.0.1.pom
(4 KB at 246.0 KB/sec)
[INFO] Succeeded with 0 errors; 0 warnings; and 0 other changes.
[CHECKSTYLE] No report found for mojo check
[INFO] 
[INFO] --- maven-bundle-plugin:3.2.0:manifest (bundle-manifest) @ curator-framework ---
[INFO] 
[INFO] --- maven-resources-plugin:2.7:testResources (default-testResources) @ curator-framework
---
[INFO] Using 'UTF-8' encoding to copy filtered resources.
[INFO] Copying 7 resources
[INFO] Copying 3 resources
[INFO] 
[INFO] --- maven-compiler-plugin:3.5.1:testCompile (default-testCompile) @ curator-framework
---
[INFO] Changes detected - recompiling the module!
[INFO] Compiling 30 source files to <https://builds.apache.org/job/Curator/ws/curator-framework/target/test-classes>
[INFO] <https://builds.apache.org/job/Curator/ws/curator-framework/src/test/java/org/apache/curator/framework/imps/TestFramework.java>:
<https://builds.apache.org/job/Curator/ws/curator-framework/src/test/java/org/apache/curator/framework/imps/TestFramework.java>
uses or overrides a deprecated API.
[INFO] <https://builds.apache.org/job/Curator/ws/curator-framework/src/test/java/org/apache/curator/framework/imps/TestFramework.java>:
Recompile with -Xlint:deprecation for details.
[INFO] 
[INFO] --- maven-surefire-plugin:2.19.1:test (default-test) @ curator-framework ---

-------------------------------------------------------
 T E S T S
-------------------------------------------------------
Running org.apache.curator.framework.ensemble.TestEnsembleProvider
Tests run: 2, Failures: 0, Errors: 0, Skipped: 0, Time elapsed: 10.603 sec - in org.apache.curator.framework.ensemble.TestEnsembleProvider
Running org.apache.curator.framework.schema.TestSchema
Tests run: 6, Failures: 0, Errors: 0, Skipped: 0, Time elapsed: 2.542 sec - in org.apache.curator.framework.schema.TestSchema
Running org.apache.curator.framework.state.TestConnectionStateManager
Tests run: 1, Failures: 0, Errors: 0, Skipped: 0, Time elapsed: 14.997 sec - in org.apache.curator.framework.state.TestConnectionStateManager
Running org.apache.curator.framework.imps.TestExistsBuilder
Tests run: 2, Failures: 0, Errors: 0, Skipped: 0, Time elapsed: 1.201 sec - in org.apache.curator.framework.imps.TestExistsBuilder
Running org.apache.curator.framework.imps.TestCleanState
Tests run: 0, Failures: 0, Errors: 0, Skipped: 0, Time elapsed: 0.243 sec - in org.apache.curator.framework.imps.TestCleanState
Running org.apache.curator.framework.imps.TestWatcherIdentity
Tests run: 5, Failures: 0, Errors: 0, Skipped: 0, Time elapsed: 31.532 sec - in org.apache.curator.framework.imps.TestWatcherIdentity
Running org.apache.curator.framework.imps.TestTtlNodes
Tests run: 2, Failures: 0, Errors: 0, Skipped: 0, Time elapsed: 1.315 sec - in org.apache.curator.framework.imps.TestTtlNodes
Running org.apache.curator.framework.imps.TestFrameworkBackground
Tests run: 6, Failures: 0, Errors: 0, Skipped: 0, Time elapsed: 40.819 sec - in org.apache.curator.framework.imps.TestFrameworkBackground
Running org.apache.curator.framework.imps.TestFrameworkEdges
Tests run: 19, Failures: 1, Errors: 0, Skipped: 1, Time elapsed: 303.845 sec <<<
FAILURE! - in org.apache.curator.framework.imps.TestFrameworkEdges
testDeleteChildrenConcurrently(org.apache.curator.framework.imps.TestFrameworkEdges)  Time
elapsed: 62.979 sec  <<< FAILURE!
java.lang.AssertionError: expected [true] but found [false]
	at org.apache.curator.framework.imps.TestFrameworkEdges.testDeleteChildrenConcurrently(TestFrameworkEdges.java:710)

Running org.apache.curator.framework.imps.TestCompression
Tests run: 3, Failures: 0, Errors: 0, Skipped: 0, Time elapsed: 1.07 sec - in org.apache.curator.framework.imps.TestCompression
Running org.apache.curator.framework.imps.TestEnsureContainers
Tests run: 2, Failures: 0, Errors: 0, Skipped: 0, Time elapsed: 1.085 sec - in org.apache.curator.framework.imps.TestEnsureContainers
Running org.apache.curator.framework.imps.TestCompressionInTransactionOld
Tests run: 4, Failures: 0, Errors: 0, Skipped: 0, Time elapsed: 1.076 sec - in org.apache.curator.framework.imps.TestCompressionInTransactionOld
Running org.apache.curator.framework.imps.TestCompressionInTransactionNew
Tests run: 4, Failures: 0, Errors: 0, Skipped: 0, Time elapsed: 1.081 sec - in org.apache.curator.framework.imps.TestCompressionInTransactionNew
Running org.apache.curator.framework.imps.TestWithCluster
Tests run: 2, Failures: 0, Errors: 0, Skipped: 0, Time elapsed: 119.942 sec - in org.apache.curator.framework.imps.TestWithCluster
Running org.apache.curator.framework.imps.TestFailedDeleteManager
Tests run: 6, Failures: 0, Errors: 0, Skipped: 0, Time elapsed: 117.316 sec - in org.apache.curator.framework.imps.TestFailedDeleteManager
Running org.apache.curator.framework.imps.TestNeverConnected
Tests run: 1, Failures: 0, Errors: 0, Skipped: 0, Time elapsed: 1.719 sec - in org.apache.curator.framework.imps.TestNeverConnected
Running org.apache.curator.framework.imps.TestFramework
Tests run: 34, Failures: 0, Errors: 0, Skipped: 0, Time elapsed: 154.007 sec - in org.apache.curator.framework.imps.TestFramework
Running org.apache.curator.framework.imps.TestRemoveWatches
Tests run: 14, Failures: 0, Errors: 0, Skipped: 0, Time elapsed: 186.549 sec - in org.apache.curator.framework.imps.TestRemoveWatches
Running org.apache.curator.framework.imps.TestCreate
Tests run: 6, Failures: 0, Errors: 0, Skipped: 0, Time elapsed: 1.624 sec - in org.apache.curator.framework.imps.TestCreate
Running org.apache.curator.framework.imps.TestTempFramework
Tests run: 2, Failures: 0, Errors: 0, Skipped: 0, Time elapsed: 2.949 sec - in org.apache.curator.framework.imps.TestTempFramework
Running org.apache.curator.framework.imps.TestReadOnly
Tests run: 2, Failures: 1, Errors: 0, Skipped: 0, Time elapsed: 23.973 sec <<< FAILURE!
- in org.apache.curator.framework.imps.TestReadOnly
testReadOnly(org.apache.curator.framework.imps.TestReadOnly)  Time elapsed: 1.393 sec  <<<
FAILURE!
java.lang.Exception: quorumPeer never got set
	at org.apache.curator.framework.imps.TestReadOnly.testReadOnly(TestReadOnly.java:122)

Running org.apache.curator.framework.imps.TestTransactionsNew
Tests run: 6, Failures: 0, Errors: 0, Skipped: 0, Time elapsed: 2.695 sec - in org.apache.curator.framework.imps.TestTransactionsNew
Running org.apache.curator.framework.imps.TestWatcherRemovalManager
Tests run: 15, Failures: 0, Errors: 0, Skipped: 0, Time elapsed: 51.403 sec - in org.apache.curator.framework.imps.TestWatcherRemovalManager
Running org.apache.curator.framework.imps.TestCreateReturningStat
Tests run: 7, Failures: 0, Errors: 0, Skipped: 0, Time elapsed: 20.34 sec - in org.apache.curator.framework.imps.TestCreateReturningStat
Running org.apache.curator.framework.imps.TestMultiClient
Tests run: 1, Failures: 0, Errors: 0, Skipped: 0, Time elapsed: 0.934 sec - in org.apache.curator.framework.imps.TestMultiClient
Running org.apache.curator.framework.imps.TestBlockUntilConnected
Tests run: 6, Failures: 0, Errors: 0, Skipped: 0, Time elapsed: 18.993 sec - in org.apache.curator.framework.imps.TestBlockUntilConnected
Running org.apache.curator.framework.imps.TestTransactionsOld
Tests run: 4, Failures: 0, Errors: 0, Skipped: 0, Time elapsed: 2.918 sec - in org.apache.curator.framework.imps.TestTransactionsOld
Running org.apache.curator.framework.imps.TestReconfiguration
Tests run: 13, Failures: 0, Errors: 0, Skipped: 0, Time elapsed: 10.298 sec - in org.apache.curator.framework.imps.TestReconfiguration
Running org.apache.curator.framework.imps.TestNamespaceFacade
Tests run: 9, Failures: 0, Errors: 0, Skipped: 0, Time elapsed: 1.577 sec - in org.apache.curator.framework.imps.TestNamespaceFacade
Running org.apache.curator.framework.imps.TestEnabledSessionExpiredState
Tests run: 6, Failures: 0, Errors: 0, Skipped: 0, Time elapsed: 149.787 sec - in org.apache.curator.framework.imps.TestEnabledSessionExpiredState

Results :

Failed tests: 
org.apache.curator.framework.imps.TestFrameworkEdges.testDeleteChildrenConcurrently(org.apache.curator.framework.imps.TestFrameworkEdges)
  Run 1: PASS
  Run 2: TestFrameworkEdges.testDeleteChildrenConcurrently:710 expected [true] but found [false]

  TestReadOnly.testReadOnly:122 ยป  quorumPeer never got set

Tests run: 189, Failures: 2, Errors: 0, Skipped: 0

[ERROR] There are test failures.

Please refer to <https://builds.apache.org/job/Curator/ws/curator-framework/target/surefire-reports>
for the individual test results.
[JENKINS] Recording test results
[INFO] 
[INFO] --- maven-bundle-plugin:3.2.0:bundle (default-bundle) @ curator-framework ---
[INFO] 
[INFO] --- maven-site-plugin:3.5.1:attach-descriptor (attach-descriptor) @ curator-framework
---
[INFO] 
[INFO] --- maven-shade-plugin:2.4.3:shade (apache-curator-guava-shader) @ curator-framework
---
[INFO] Excluding org.apache.curator:curator-client:jar:4.0.2-SNAPSHOT from the shaded jar.
[INFO] Excluding org.apache.zookeeper:zookeeper:jar:3.5.3-beta from the shaded jar.
[INFO] Excluding commons-cli:commons-cli:jar:1.2 from the shaded jar.
[INFO] Excluding io.netty:netty:jar:3.10.5.Final from the shaded jar.
[INFO] Excluding com.google.guava:guava:jar:20.0 from the shaded jar.
[INFO] Excluding org.slf4j:slf4j-api:jar:1.7.6 from the shaded jar.
[INFO] Excluding log4j:log4j:jar:1.2.17 from the shaded jar.
[INFO] Replacing original artifact with shaded artifact.
[INFO] Replacing <https://builds.apache.org/job/Curator/ws/curator-framework/target/curator-framework-4.0.2-SNAPSHOT.jar>
with <https://builds.apache.org/job/Curator/ws/curator-framework/target/curator-framework-4.0.2-SNAPSHOT-shaded.jar>
[INFO] 
[INFO] --- maven-jar-plugin:3.0.0:test-jar (default) @ curator-framework ---
[INFO] Building jar: <https://builds.apache.org/job/Curator/ws/curator-framework/target/curator-framework-4.0.2-SNAPSHOT-tests.jar>
[INFO] 
[INFO] --- maven-license-plugin:1.9.0:check (license) @ curator-framework ---
[INFO] Checking licenses...
[WARNING] Unknown file extension: <https://builds.apache.org/job/Curator/ws/curator-framework/src/test/resources/schema.yaml>
[INFO] Missing header in: <https://builds.apache.org/job/Curator/ws/curator-framework/src/test/java/org/apache/curator/framework/state/TestConnectionStateManager.java>
[CHECKSTYLE] No report found for mojo check
[INFO] ------------------------------------------------------------------------
[INFO] Reactor Summary:
[INFO] 
[INFO] Apache Curator ..................................... SUCCESS [ 20.525 s]
[INFO] Curator Testing .................................... SUCCESS [01:20 min]
[INFO] Curator Client ..................................... SUCCESS [ 37.703 s]
[INFO] Curator Framework .................................. FAILURE [21:54 min]
[INFO] Curator Recipes .................................... SKIPPED
[INFO] Curator Service Discovery .......................... SKIPPED
[INFO] Curator Async ...................................... SKIPPED
[INFO] Curator Examples ................................... SKIPPED
[INFO] Curator Service Discovery Server ................... SKIPPED
[INFO] Curator ZooKeeper 3.4 Testing ...................... SKIPPED
[INFO] ------------------------------------------------------------------------
[INFO] BUILD FAILURE
[INFO] ------------------------------------------------------------------------
[INFO] Total time: 24:43 min
[INFO] Finished at: 2018-05-21T14:32:06+00:00
[INFO] Final Memory: 57M/1843M
[INFO] ------------------------------------------------------------------------
[ERROR] Failed to execute goal com.mycila.maven-license-plugin:maven-license-plugin:1.9.0:check
(license) on project curator-framework: Some files do not have the expected license header
-> [Help 1]
[ERROR] 
[ERROR] To see the full stack trace of the errors, re-run Maven with the -e switch.
[ERROR] Re-run Maven using the -X switch to enable full debug logging.
[ERROR] 
[ERROR] For more information about the errors and possible solutions, please read the following
articles:
[ERROR] [Help 1] http://cwiki.apache.org/confluence/display/MAVEN/MojoExecutionException
[ERROR] 
[ERROR] After correcting the problems, you can resume the build with the command
[ERROR]   mvn <goals> -rf :curator-framework
[JENKINS] Archiving <https://builds.apache.org/job/Curator/ws/pom.xml> to org.apache.curator/apache-curator/4.0.2-SNAPSHOT/apache-curator-4.0.2-SNAPSHOT.pom
[JENKINS] Archiving <https://builds.apache.org/job/Curator/ws/target/apache-curator-4.0.2-SNAPSHOT-site.xml>
to org.apache.curator/apache-curator/4.0.2-SNAPSHOT/apache-curator-4.0.2-SNAPSHOT-site.xml
[Fast Archiver] Compressed 39.29 KB of artifacts by 81.5% relative to #39
[JENKINS] Archiving <https://builds.apache.org/job/Curator/ws/curator-test/pom.xml>
to org.apache.curator/curator-test/4.0.2-SNAPSHOT/curator-test-4.0.2-SNAPSHOT.pom
[JENKINS] Archiving <https://builds.apache.org/job/Curator/ws/curator-test/target/curator-test-4.0.2-SNAPSHOT.jar>
to org.apache.curator/curator-test/4.0.2-SNAPSHOT/curator-test-4.0.2-SNAPSHOT.jar
[JENKINS] Archiving <https://builds.apache.org/job/Curator/ws/curator-test-zk34/pom.xml>
to org.apache.curator/curator-test-zk34/4.0.2-SNAPSHOT/curator-test-zk34-4.0.2-SNAPSHOT.pom
[JENKINS] Archiving <https://builds.apache.org/job/Curator/ws/curator-x-async/pom.xml>
to org.apache.curator/curator-x-async/4.0.2-SNAPSHOT/curator-x-async-4.0.2-SNAPSHOT.pom
[JENKINS] Archiving <https://builds.apache.org/job/Curator/ws/curator-examples/pom.xml>
to org.apache.curator/curator-examples/4.0.2-SNAPSHOT/curator-examples-4.0.2-SNAPSHOT.pom
[JENKINS] Archiving <https://builds.apache.org/job/Curator/ws/curator-x-discovery/pom.xml>
to org.apache.curator/curator-x-discovery/4.0.2-SNAPSHOT/curator-x-discovery-4.0.2-SNAPSHOT.pom
[JENKINS] Archiving <https://builds.apache.org/job/Curator/ws/curator-recipes/pom.xml>
to org.apache.curator/curator-recipes/4.0.2-SNAPSHOT/curator-recipes-4.0.2-SNAPSHOT.pom
[JENKINS] Archiving <https://builds.apache.org/job/Curator/ws/curator-x-discovery-server/pom.xml>
to org.apache.curator/curator-x-discovery-server/4.0.2-SNAPSHOT/curator-x-discovery-server-4.0.2-SNAPSHOT.pom
[JENKINS] Archiving <https://builds.apache.org/job/Curator/ws/curator-client/pom.xml>
to org.apache.curator/curator-client/4.0.2-SNAPSHOT/curator-client-4.0.2-SNAPSHOT.pom
[JENKINS] Archiving <https://builds.apache.org/job/Curator/ws/curator-client/target/curator-client-4.0.2-SNAPSHOT.jar>
to org.apache.curator/curator-client/4.0.2-SNAPSHOT/curator-client-4.0.2-SNAPSHOT.jar
[JENKINS] Archiving <https://builds.apache.org/job/Curator/ws/curator-framework/pom.xml>
to org.apache.curator/curator-framework/4.0.2-SNAPSHOT/curator-framework-4.0.2-SNAPSHOT.pom
[JENKINS] Archiving <https://builds.apache.org/job/Curator/ws/curator-framework/target/curator-framework-4.0.2-SNAPSHOT.jar>
to org.apache.curator/curator-framework/4.0.2-SNAPSHOT/curator-framework-4.0.2-SNAPSHOT.jar
[JENKINS] Archiving <https://builds.apache.org/job/Curator/ws/curator-framework/target/curator-framework-4.0.2-SNAPSHOT-tests.jar>
to org.apache.curator/curator-framework/4.0.2-SNAPSHOT/curator-framework-4.0.2-SNAPSHOT-tests.jar
Sending e-mails to: dev@curator.apache.org
channel stopped

Mime
View raw message