curator-dev mailing list archives

Site index · List index
Message view « Date » · « Thread »
Top « Date » · « Thread »
From Apache Jenkins Server <jenk...@builds.apache.org>
Subject Build failed in Jenkins: Curator #1066
Date Thu, 20 Jul 2017 11:34:55 GMT
See <https://builds.apache.org/job/Curator/1066/display/redirect>

------------------------------------------
[...truncated 1.35 MB...]
	at org.apache.curator.framework.recipes.queue.TestDistributedIdQueue.testOrdering(TestDistributedIdQueue.java:95)

Running org.apache.curator.framework.recipes.queue.TestSimpleDistributedQueue
Tests run: 14, Failures: 0, Errors: 0, Skipped: 0, Time elapsed: 55.725 sec - in org.apache.curator.framework.recipes.queue.TestSimpleDistributedQueue
Running org.apache.curator.framework.recipes.queue.TestBoundedDistributedQueue
Tests run: 2, Failures: 0, Errors: 0, Skipped: 0, Time elapsed: 55.742 sec - in org.apache.curator.framework.recipes.queue.TestBoundedDistributedQueue
Running org.apache.curator.framework.recipes.queue.TestDistributedQueue
Tests run: 16, Failures: 5, Errors: 0, Skipped: 5, Time elapsed: 233.609 sec <<<
FAILURE! - in org.apache.curator.framework.recipes.queue.TestDistributedQueue
testMultiPutterSingleGetter(org.apache.curator.framework.recipes.queue.TestDistributedQueue)
 Time elapsed: 0.03 sec  <<< FAILURE!
java.lang.NoClassDefFoundError: org/mockito/Mockito
	at org.apache.curator.framework.recipes.queue.TestDistributedQueue.testMultiPutterSingleGetter(TestDistributedQueue.java:667)

testPutListener(org.apache.curator.framework.recipes.queue.TestDistributedQueue)  Time elapsed:
0.033 sec  <<< FAILURE!
java.lang.NoClassDefFoundError: org/mockito/Mockito
	at org.apache.curator.framework.recipes.queue.TestDistributedQueue.testPutListener(TestDistributedQueue.java:224)

testPutMulti(org.apache.curator.framework.recipes.queue.TestDistributedQueue)  Time elapsed:
0.022 sec  <<< FAILURE!
java.lang.NoClassDefFoundError: org/mockito/Mockito
	at org.apache.curator.framework.recipes.queue.TestDistributedQueue.testPutMulti(TestDistributedQueue.java:622)

testSafetyBasic(org.apache.curator.framework.recipes.queue.TestDistributedQueue)  Time elapsed:
0.025 sec  <<< FAILURE!
java.lang.NoClassDefFoundError: org/mockito/Mockito
	at org.apache.curator.framework.recipes.queue.TestDistributedQueue.testSafetyBasic(TestDistributedQueue.java:574)

testSimple(org.apache.curator.framework.recipes.queue.TestDistributedQueue)  Time elapsed:
0.016 sec  <<< FAILURE!
java.lang.NoClassDefFoundError: org/mockito/Mockito
	at org.apache.curator.framework.recipes.queue.TestDistributedQueue.testSimple(TestDistributedQueue.java:766)

Running org.apache.curator.framework.recipes.queue.TestQueueSharder
Tests run: 4, Failures: 1, Errors: 0, Skipped: 1, Time elapsed: 195.533 sec <<< FAILURE!
- in org.apache.curator.framework.recipes.queue.TestQueueSharder
testDistribution(org.apache.curator.framework.recipes.queue.TestQueueSharder)  Time elapsed:
60.202 sec  <<< FAILURE!
java.lang.NoClassDefFoundError: org/apache/commons/math/stat/descriptive/SummaryStatistics
	at org.apache.curator.framework.recipes.queue.TestQueueSharder.testDistribution(TestQueueSharder.java:78)

Running org.apache.curator.framework.recipes.queue.TestDistributedDelayQueue
Tests run: 8, Failures: 4, Errors: 0, Skipped: 4, Time elapsed: 13.483 sec <<< FAILURE!
- in org.apache.curator.framework.recipes.queue.TestDistributedDelayQueue
testBasic(org.apache.curator.framework.recipes.queue.TestDistributedDelayQueue)  Time elapsed:
0.015 sec  <<< FAILURE!
java.lang.NoClassDefFoundError: org/mockito/Mockito
	at org.apache.curator.framework.recipes.queue.TestDistributedDelayQueue.testBasic(TestDistributedDelayQueue.java:82)

testLateAddition(org.apache.curator.framework.recipes.queue.TestDistributedDelayQueue)  Time
elapsed: 0.03 sec  <<< FAILURE!
java.lang.NoClassDefFoundError: org/mockito/Mockito
	at org.apache.curator.framework.recipes.queue.TestDistributedDelayQueue.testLateAddition(TestDistributedDelayQueue.java:51)

testSimple(org.apache.curator.framework.recipes.queue.TestDistributedDelayQueue)  Time elapsed:
0.016 sec  <<< FAILURE!
java.lang.NoClassDefFoundError: org/mockito/Mockito
	at org.apache.curator.framework.recipes.queue.TestDistributedDelayQueue.testSimple(TestDistributedDelayQueue.java:111)

testSorting(org.apache.curator.framework.recipes.queue.TestDistributedDelayQueue)  Time elapsed:
1.817 sec  <<< FAILURE!
java.lang.NoClassDefFoundError: org/mockito/Mockito
	at org.apache.curator.framework.recipes.queue.TestDistributedDelayQueue.testSorting(TestDistributedDelayQueue.java:183)

Running org.apache.curator.framework.recipes.locks.TestInterProcessMultiMutex
Tests run: 11, Failures: 0, Errors: 0, Skipped: 0, Time elapsed: 72.95 sec - in org.apache.curator.framework.recipes.locks.TestInterProcessMultiMutex
Running org.apache.curator.framework.recipes.locks.TestInterProcessSemaphoreMutex
Tests run: 8, Failures: 0, Errors: 0, Skipped: 1, Time elapsed: 87.775 sec - in org.apache.curator.framework.recipes.locks.TestInterProcessSemaphoreMutex
Running org.apache.curator.framework.recipes.locks.TestLockACLs
Tests run: 2, Failures: 0, Errors: 0, Skipped: 0, Time elapsed: 3.057 sec - in org.apache.curator.framework.recipes.locks.TestLockACLs
Running org.apache.curator.framework.recipes.locks.TestInterProcessMutex
Tests run: 12, Failures: 0, Errors: 0, Skipped: 0, Time elapsed: 75.399 sec - in org.apache.curator.framework.recipes.locks.TestInterProcessMutex
Running org.apache.curator.framework.recipes.locks.TestChildReaper
Tests run: 7, Failures: 0, Errors: 0, Skipped: 0, Time elapsed: 362.844 sec - in org.apache.curator.framework.recipes.locks.TestChildReaper
Running org.apache.curator.framework.recipes.locks.TestReaper
Tests run: 16, Failures: 0, Errors: 0, Skipped: 0, Time elapsed: 209.801 sec - in org.apache.curator.framework.recipes.locks.TestReaper
Running org.apache.curator.framework.recipes.locks.TestInterProcessMutexBase
Tests run: 0, Failures: 0, Errors: 0, Skipped: 0, Time elapsed: 0.248 sec - in org.apache.curator.framework.recipes.locks.TestInterProcessMutexBase
Running org.apache.curator.framework.recipes.locks.TestInterProcessSemaphore

Results :

Failed tests: 
org.apache.curator.framework.recipes.cache.TestTreeCache.teardown(org.apache.curator.framework.recipes.cache.TestTreeCache)
  Run 1: TestTreeCache>BaseTestTreeCache.teardown:123->BaseTestTreeCache.assertNoMoreEvents:143
Expected no events, found 2; first event: TreeCacheEvent{type=CONNECTION_RECONNECTED, data=null}
expected [true] but found [false]
  Run 2: PASS
  Run 3: PASS
  Run 4: PASS
  Run 5: PASS
  Run 6: PASS
  Run 7: PASS
  Run 8: PASS
  Run 9: PASS
  Run 10: PASS
  Run 11: PASS

org.apache.curator.framework.recipes.nodes.TestPersistentTtlNode.testBasic(org.apache.curator.framework.recipes.nodes.TestPersistentTtlNode)
  Run 1: PASS
  Run 2: TestPersistentTtlNode.testBasic:67 » NoSuchField CONTAINER

org.apache.curator.framework.recipes.nodes.TestPersistentTtlNode.testEventsOnParent(org.apache.curator.framework.recipes.nodes.TestPersistentTtlNode)
  Run 1: PASS
  Run 2: TestPersistentTtlNode.testEventsOnParent:116 » NoSuchField CONTAINER

org.apache.curator.framework.recipes.nodes.TestPersistentTtlNode.testForcedDeleteOfTouchNode(org.apache.curator.framework.recipes.nodes.TestPersistentTtlNode)
  Run 1: PASS
  Run 2: TestPersistentTtlNode.testForcedDeleteOfTouchNode:92 » NoSuchField CONTAINER

org.apache.curator.framework.recipes.queue.TestDistributedDelayQueue.testBasic(org.apache.curator.framework.recipes.queue.TestDistributedDelayQueue)
  Run 1: PASS
  Run 2: TestDistributedDelayQueue.testBasic:82 NoClassDefFound org/mockito/Mockito

org.apache.curator.framework.recipes.queue.TestDistributedDelayQueue.testLateAddition(org.apache.curator.framework.recipes.queue.TestDistributedDelayQueue)
  Run 1: PASS
  Run 2: TestDistributedDelayQueue.testLateAddition:51 NoClassDefFound org/mockito/Mock...

org.apache.curator.framework.recipes.queue.TestDistributedDelayQueue.testSimple(org.apache.curator.framework.recipes.queue.TestDistributedDelayQueue)
  Run 1: PASS
  Run 2: TestDistributedDelayQueue.testSimple:111 NoClassDefFound org/mockito/Mockito

org.apache.curator.framework.recipes.queue.TestDistributedDelayQueue.testSorting(org.apache.curator.framework.recipes.queue.TestDistributedDelayQueue)
  Run 1: PASS
  Run 2: TestDistributedDelayQueue.testSorting:183 NoClassDefFound org/mockito/Mockito

org.apache.curator.framework.recipes.queue.TestDistributedIdQueue.testOrdering(org.apache.curator.framework.recipes.queue.TestDistributedIdQueue)
  Run 1: PASS
  Run 2: TestDistributedIdQueue.testOrdering:95 NoClassDefFound org/mockito/Mockito

org.apache.curator.framework.recipes.queue.TestDistributedPriorityQueue.testAdditions(org.apache.curator.framework.recipes.queue.TestDistributedPriorityQueue)
  Run 1: PASS
  Run 2: TestDistributedPriorityQueue.testAdditions:149 NoClassDefFound org/mockito/Moc...

org.apache.curator.framework.recipes.queue.TestDistributedPriorityQueue.testMinItemsBeforeRefresh(org.apache.curator.framework.recipes.queue.TestDistributedPriorityQueue)
  Run 1: PASS
  Run 2: TestDistributedPriorityQueue.testMinItemsBeforeRefresh:52 NoClassDefFound org/...

org.apache.curator.framework.recipes.queue.TestDistributedPriorityQueue.testSimple(org.apache.curator.framework.recipes.queue.TestDistributedPriorityQueue)
  Run 1: PASS
  Run 2: TestDistributedPriorityQueue.testSimple:185 NoClassDefFound org/mockito/Mockit...

org.apache.curator.framework.recipes.queue.TestDistributedQueue.testMultiPutterSingleGetter(org.apache.curator.framework.recipes.queue.TestDistributedQueue)
  Run 1: PASS
  Run 2: TestDistributedQueue.testMultiPutterSingleGetter:667 NoClassDefFound org/mocki...

org.apache.curator.framework.recipes.queue.TestDistributedQueue.testPutListener(org.apache.curator.framework.recipes.queue.TestDistributedQueue)
  Run 1: PASS
  Run 2: TestDistributedQueue.testPutListener:224 NoClassDefFound org/mockito/Mockito

org.apache.curator.framework.recipes.queue.TestDistributedQueue.testPutMulti(org.apache.curator.framework.recipes.queue.TestDistributedQueue)
  Run 1: PASS
  Run 2: TestDistributedQueue.testPutMulti:622 NoClassDefFound org/mockito/Mockito

org.apache.curator.framework.recipes.queue.TestDistributedQueue.testSafetyBasic(org.apache.curator.framework.recipes.queue.TestDistributedQueue)
  Run 1: PASS
  Run 2: TestDistributedQueue.testSafetyBasic:574 NoClassDefFound org/mockito/Mockito

org.apache.curator.framework.recipes.queue.TestDistributedQueue.testSimple(org.apache.curator.framework.recipes.queue.TestDistributedQueue)
  Run 1: PASS
  Run 2: TestDistributedQueue.testSimple:766 NoClassDefFound org/mockito/Mockito

org.apache.curator.framework.recipes.queue.TestQueueSharder.testDistribution(org.apache.curator.framework.recipes.queue.TestQueueSharder)
  Run 1: PASS
  Run 2: TestQueueSharder.testDistribution:78 NoClassDefFound org/apache/commons/math/s...


Tests run: 346, Failures: 18, Errors: 0, Skipped: 11

[JENKINS] Recording test results
[INFO] ------------------------------------------------------------------------
[INFO] Reactor Summary:
[INFO] 
[INFO] Apache Curator ..................................... SUCCESS [ 13.041 s]
[INFO] Curator Testing .................................... SUCCESS [01:05 min]
[INFO] Curator Client ..................................... SUCCESS [ 52.052 s]
[INFO] Curator Framework .................................. SUCCESS [37:40 min]
[INFO] Curator Recipes .................................... SUCCESS [  02:13 h]
[INFO] Curator Service Discovery .......................... SUCCESS [02:39 min]
[INFO] Curator Async ...................................... SUCCESS [11:00 min]
[INFO] Curator Examples ................................... SUCCESS [  6.171 s]
[INFO] Curator Service Discovery Server ................... SUCCESS [ 17.272 s]
[INFO] Curator RPC Proxy .................................. SUCCESS [ 17.340 s]
[INFO] curator-test-zk34 .................................. FAILURE [  01:10 h]
[INFO] ------------------------------------------------------------------------
[INFO] BUILD FAILURE
[INFO] ------------------------------------------------------------------------
[INFO] Total time: 04:18 h
[INFO] Finished at: 2017-07-20T11:34:34+00:00
[INFO] Final Memory: 55M/1380M
[INFO] ------------------------------------------------------------------------
[ERROR] Failed to execute goal org.apache.maven.plugins:maven-surefire-plugin:2.18.1:test
(default-test) on project curator-test-zk34: ExecutionException: java.lang.RuntimeException:
There was an error in the forked process
[ERROR] java.lang.ArrayStoreException: sun.reflect.annotation.TypeNotPresentExceptionProxy
[ERROR] at sun.reflect.annotation.AnnotationParser.parseClassArray(AnnotationParser.java:724)
[ERROR] at sun.reflect.annotation.AnnotationParser.parseArray(AnnotationParser.java:531)
[ERROR] at sun.reflect.annotation.AnnotationParser.parseMemberValue(AnnotationParser.java:355)
[ERROR] at sun.reflect.annotation.AnnotationParser.parseAnnotation2(AnnotationParser.java:286)
[ERROR] at sun.reflect.annotation.AnnotationParser.parseAnnotations2(AnnotationParser.java:120)
[ERROR] at sun.reflect.annotation.AnnotationParser.parseAnnotations(AnnotationParser.java:72)
[ERROR] at java.lang.reflect.Executable.declaredAnnotations(Executable.java:599)
[ERROR] at java.lang.reflect.Executable.declaredAnnotations(Executable.java:597)
[ERROR] at java.lang.reflect.Executable.getAnnotation(Executable.java:570)
[ERROR] at java.lang.reflect.Method.getAnnotation(Method.java:622)
[ERROR] at org.testng.internal.annotations.JDK15AnnotationFinder.findAnnotation(JDK15AnnotationFinder.java:111)
[ERROR] at org.testng.internal.TestNGClassFinder.<init>(TestNGClassFinder.java:77)
[ERROR] at org.testng.internal.TestNGClassFinder.<init>(TestNGClassFinder.java:40)
[ERROR] at org.testng.TestRunner.initMethods(TestRunner.java:403)
[ERROR] at org.testng.TestRunner.init(TestRunner.java:252)
[ERROR] at org.testng.TestRunner.init(TestRunner.java:222)
[ERROR] at org.testng.TestRunner.<init>(TestRunner.java:163)
[ERROR] at org.testng.SuiteRunner$DefaultTestRunnerFactory.newTestRunner(SuiteRunner.java:585)
[ERROR] at org.testng.SuiteRunner.init(SuiteRunner.java:189)
[ERROR] at org.testng.SuiteRunner.<init>(SuiteRunner.java:136)
[ERROR] at org.testng.TestNG.createSuiteRunner(TestNG.java:1375)
[ERROR] at org.testng.TestNG.createSuiteRunners(TestNG.java:1355)
[ERROR] at org.testng.TestNG.runSuitesLocally(TestNG.java:1209)
[ERROR] at org.testng.TestNG.runSuites(TestNG.java:1133)
[ERROR] at org.testng.TestNG.run(TestNG.java:1104)
[ERROR] at org.apache.maven.surefire.testng.TestNGExecutor.run(TestNGExecutor.java:115)
[ERROR] at org.apache.maven.surefire.testng.TestNGDirectoryTestSuite.executeSingleClass(TestNGDirectoryTestSuite.java:129)
[ERROR] at org.apache.maven.surefire.testng.TestNGDirectoryTestSuite.execute(TestNGDirectoryTestSuite.java:113)
[ERROR] at org.apache.maven.surefire.testng.TestNGProvider.invoke(TestNGProvider.java:111)
[ERROR] at org.apache.maven.surefire.booter.ForkedBooter.invokeProviderInSameClassLoader(ForkedBooter.java:203)
[ERROR] at org.apache.maven.surefire.booter.ForkedBooter.runSuitesInProcess(ForkedBooter.java:155)
[ERROR] at org.apache.maven.surefire.booter.ForkedBooter.main(ForkedBooter.java:103)
[ERROR] -> [Help 1]
[ERROR] 
[ERROR] To see the full stack trace of the errors, re-run Maven with the -e switch.
[ERROR] Re-run Maven using the -X switch to enable full debug logging.
[ERROR] 
[ERROR] For more information about the errors and possible solutions, please read the following
articles:
[ERROR] [Help 1] http://cwiki.apache.org/confluence/display/MAVEN/MojoFailureException
[ERROR] 
[ERROR] After correcting the problems, you can resume the build with the command
[ERROR]   mvn <goals> -rf :curator-test-zk34
[JENKINS] Archiving <https://builds.apache.org/job/Curator/ws/pom.xml> to org.apache.curator/apache-curator/3.3.1-SNAPSHOT/apache-curator-3.3.1-SNAPSHOT.pom
[JENKINS] Archiving <https://builds.apache.org/job/Curator/ws/target/apache-curator-3.3.1-SNAPSHOT-site.xml>
to org.apache.curator/apache-curator/3.3.1-SNAPSHOT/apache-curator-3.3.1-SNAPSHOT-site.xml
[JENKINS] Archiving <https://builds.apache.org/job/Curator/ws/curator-x-rpc/pom.xml>
to org.apache.curator/curator-x-rpc/3.3.1-SNAPSHOT/curator-x-rpc-3.3.1-SNAPSHOT.pom
[JENKINS] Archiving <https://builds.apache.org/job/Curator/ws/curator-x-rpc/target/curator-x-rpc-3.3.1-SNAPSHOT.jar>
to org.apache.curator/curator-x-rpc/3.3.1-SNAPSHOT/curator-x-rpc-3.3.1-SNAPSHOT.jar
[JENKINS] Archiving <https://builds.apache.org/job/Curator/ws/curator-test/pom.xml>
to org.apache.curator/curator-test/3.3.1-SNAPSHOT/curator-test-3.3.1-SNAPSHOT.pom
[JENKINS] Archiving <https://builds.apache.org/job/Curator/ws/curator-test/target/curator-test-3.3.1-SNAPSHOT.jar>
to org.apache.curator/curator-test/3.3.1-SNAPSHOT/curator-test-3.3.1-SNAPSHOT.jar
[JENKINS] Archiving <https://builds.apache.org/job/Curator/ws/curator-test-zk34/pom.xml>
to org.apache.curator/curator-test-zk34/3.3.1-SNAPSHOT/curator-test-zk34-3.3.1-SNAPSHOT.pom
[Fast Archiver] No prior successful build to compare, so performing full copy of artifacts
[JENKINS] Archiving <https://builds.apache.org/job/Curator/ws/curator-x-async/pom.xml>
to org.apache.curator/curator-x-async/3.3.1-SNAPSHOT/curator-x-async-3.3.1-SNAPSHOT.pom
[JENKINS] Archiving <https://builds.apache.org/job/Curator/ws/curator-x-async/target/curator-x-async-3.3.1-SNAPSHOT.jar>
to org.apache.curator/curator-x-async/3.3.1-SNAPSHOT/curator-x-async-3.3.1-SNAPSHOT.jar
[JENKINS] Archiving <https://builds.apache.org/job/Curator/ws/curator-examples/pom.xml>
to org.apache.curator/curator-examples/3.3.1-SNAPSHOT/curator-examples-3.3.1-SNAPSHOT.pom
[JENKINS] Archiving <https://builds.apache.org/job/Curator/ws/curator-examples/target/curator-examples-3.3.1-SNAPSHOT.jar>
to org.apache.curator/curator-examples/3.3.1-SNAPSHOT/curator-examples-3.3.1-SNAPSHOT.jar
[JENKINS] Archiving <https://builds.apache.org/job/Curator/ws/curator-x-discovery/pom.xml>
to org.apache.curator/curator-x-discovery/3.3.1-SNAPSHOT/curator-x-discovery-3.3.1-SNAPSHOT.pom
[JENKINS] Archiving <https://builds.apache.org/job/Curator/ws/curator-x-discovery/target/curator-x-discovery-3.3.1-SNAPSHOT.jar>
to org.apache.curator/curator-x-discovery/3.3.1-SNAPSHOT/curator-x-discovery-3.3.1-SNAPSHOT.jar
[JENKINS] Archiving <https://builds.apache.org/job/Curator/ws/curator-recipes/pom.xml>
to org.apache.curator/curator-recipes/3.3.1-SNAPSHOT/curator-recipes-3.3.1-SNAPSHOT.pom
[JENKINS] Archiving <https://builds.apache.org/job/Curator/ws/curator-recipes/target/curator-recipes-3.3.1-SNAPSHOT.jar>
to org.apache.curator/curator-recipes/3.3.1-SNAPSHOT/curator-recipes-3.3.1-SNAPSHOT.jar
[JENKINS] Archiving <https://builds.apache.org/job/Curator/ws/curator-recipes/target/curator-recipes-3.3.1-SNAPSHOT-tests.jar>
to org.apache.curator/curator-recipes/3.3.1-SNAPSHOT/curator-recipes-3.3.1-SNAPSHOT-tests.jar
[JENKINS] Archiving <https://builds.apache.org/job/Curator/ws/curator-x-discovery-server/pom.xml>
to org.apache.curator/curator-x-discovery-server/3.3.1-SNAPSHOT/curator-x-discovery-server-3.3.1-SNAPSHOT.pom
[JENKINS] Archiving <https://builds.apache.org/job/Curator/ws/curator-x-discovery-server/target/curator-x-discovery-server-3.3.1-SNAPSHOT.jar>
to org.apache.curator/curator-x-discovery-server/3.3.1-SNAPSHOT/curator-x-discovery-server-3.3.1-SNAPSHOT.jar
[JENKINS] Archiving <https://builds.apache.org/job/Curator/ws/curator-client/pom.xml>
to org.apache.curator/curator-client/3.3.1-SNAPSHOT/curator-client-3.3.1-SNAPSHOT.pom
[JENKINS] Archiving <https://builds.apache.org/job/Curator/ws/curator-client/target/curator-client-3.3.1-SNAPSHOT.jar>
to org.apache.curator/curator-client/3.3.1-SNAPSHOT/curator-client-3.3.1-SNAPSHOT.jar
[JENKINS] Archiving <https://builds.apache.org/job/Curator/ws/curator-framework/pom.xml>
to org.apache.curator/curator-framework/3.3.1-SNAPSHOT/curator-framework-3.3.1-SNAPSHOT.pom
[JENKINS] Archiving <https://builds.apache.org/job/Curator/ws/curator-framework/target/curator-framework-3.3.1-SNAPSHOT.jar>
to org.apache.curator/curator-framework/3.3.1-SNAPSHOT/curator-framework-3.3.1-SNAPSHOT.jar
[JENKINS] Archiving <https://builds.apache.org/job/Curator/ws/curator-framework/target/curator-framework-3.3.1-SNAPSHOT-tests.jar>
to org.apache.curator/curator-framework/3.3.1-SNAPSHOT/curator-framework-3.3.1-SNAPSHOT-tests.jar
Sending e-mails to: dev@curator.apache.org
Sending e-mails to: dev@curator.apache.org
Sending e-mails to: dev@curator.apache.org
channel stopped

Mime
View raw message