curator-dev mailing list archives

Site index · List index
Message view « Date » · « Thread »
Top « Date » · « Thread »
From Apache Jenkins Server <jenk...@builds.apache.org>
Subject Build failed in Jenkins: Curator-3.0 » Curator Recipes #106
Date Thu, 12 Jan 2017 22:41:09 GMT
See <https://builds.apache.org/job/Curator-3.0/org.apache.curator$curator-recipes/106/>

------------------------------------------
Established TCP socket on 59627
maven32-agent.jar already up to date
maven32-interceptor.jar already up to date
maven3-interceptor-commons.jar already up to date
<===[JENKINS REMOTING CAPACITY]===>   channel started
Executing Maven:  -N -B -Dmaven.repo.local=/home/jenkins/jenkins-slave/maven-repositories/0
-f <https://builds.apache.org/job/Curator-3.0/org.apache.curator$curator-recipes/ws/pom.xml>
clean -Dcurator-retry-failed-tests=true -Dtiming-multiple=3 -Dtiming-waiting-multiple=10 -fn
verify
[INFO] Scanning for projects...
[INFO]                                                                         
[INFO] ------------------------------------------------------------------------
[INFO] Building Curator Recipes 3.2.2-SNAPSHOT
[INFO] ------------------------------------------------------------------------
[INFO] Downloading: http://repository.apache.org/snapshots/org/apache/curator/curator-framework/3.2.2-SNAPSHOT/maven-metadata.xml
[INFO] Downloading: http://repository.apache.org/snapshots/org/apache/curator/curator-framework/3.2.2-SNAPSHOT/curator-framework-3.2.2-SNAPSHOT.pom
[WARNING] The POM for org.apache.curator:curator-framework:jar:3.2.2-SNAPSHOT is missing,
no dependency information available
[WARNING] The POM for org.apache.curator:curator-framework:jar:tests:3.2.2-SNAPSHOT is missing,
no dependency information available
[INFO] Downloading: http://repository.apache.org/snapshots/org/apache/curator/curator-test/3.2.2-SNAPSHOT/maven-metadata.xml
[INFO] Downloading: http://repository.apache.org/snapshots/org/apache/curator/curator-test/3.2.2-SNAPSHOT/curator-test-3.2.2-SNAPSHOT.pom
[WARNING] The POM for org.apache.curator:curator-test:jar:3.2.2-SNAPSHOT is missing, no dependency
information available
[INFO] Downloading: http://repository.apache.org/snapshots/org/apache/curator/curator-framework/3.2.2-SNAPSHOT/curator-framework-3.2.2-SNAPSHOT.jar
[INFO] Downloading: http://repository.apache.org/snapshots/org/apache/curator/curator-framework/3.2.2-SNAPSHOT/curator-framework-3.2.2-SNAPSHOT-tests.jar
[INFO] Downloading: http://repository.apache.org/snapshots/org/apache/curator/curator-test/3.2.2-SNAPSHOT/curator-test-3.2.2-SNAPSHOT.jar
[INFO] ------------------------------------------------------------------------
[INFO] BUILD FAILURE
[INFO] ------------------------------------------------------------------------
[INFO] Total time: 3.680 s
[INFO] Finished at: 2017-01-12T22:38:10+00:00
[INFO] Final Memory: 15M/310M
[INFO] ------------------------------------------------------------------------
[ERROR] Failed to execute goal on project curator-recipes: Could not resolve dependencies
for project org.apache.curator:curator-recipes:bundle:3.2.2-SNAPSHOT: The following artifacts
could not be resolved: org.apache.curator:curator-framework:jar:3.2.2-SNAPSHOT, org.apache.curator:curator-framework:jar:tests:3.2.2-SNAPSHOT,
org.apache.curator:curator-test:jar:3.2.2-SNAPSHOT: Could not find artifact org.apache.curator:curator-framework:jar:3.2.2-SNAPSHOT
in Nexus (http://repository.apache.org/snapshots) -> [Help 1]
[ERROR] 
[ERROR] To see the full stack trace of the errors, re-run Maven with the -e switch.
[ERROR] Re-run Maven using the -X switch to enable full debug logging.
[ERROR] 
[ERROR] For more information about the errors and possible solutions, please read the following
articles:
[ERROR] [Help 1] http://cwiki.apache.org/confluence/display/MAVEN/DependencyResolutionException
[INFO] Build failures were ignored.
U4P0+vJLE4u1gvPjexLDVPzxdEuhYV5Rf55ZekOlc7RKnPKH7IxMBQUcQgBdWQnJ9XnJ+TqucMoUEKGSCAEaSwAACsNFCqYAAAAA==[ERROR]
To see the full stack trace of the errors, re-run Maven with the -e switch.
[ERROR] Re-run Maven using the -X switch to enable full debug logging.
[ERROR] 
[ERROR] For more information about the errors and possible solutions, please read the following
articles:
[ERROR] [Help 1] http://cwiki.apache.org/confluence/display/MAVEN/DependencyResolutionException
[INFO] Build failures were ignored.
[JENKINS] Archiving <https://builds.apache.org/job/Curator-3.0/org.apache.curator$curator-recipes/ws/pom.xml>
to org.apache.curator/curator-recipes/3.2.2-SNAPSHOT/curator-recipes-3.2.2-SNAPSHOT.pom

Mime
View raw message