curator-dev mailing list archives

Site index · List index
Message view « Date » · « Thread »
Top « Date » · « Thread »
From Apache Jenkins Server <jenk...@builds.apache.org>
Subject Build failed in Jenkins: Curator-3.0 #81
Date Thu, 28 Jul 2016 02:40:34 GMT
See <https://builds.apache.org/job/Curator-3.0/81/changes>

Changes:

[dragonsinth] TreeCache does not need to use CloseableExecutorService.

[markap14] CURATOR-337: Do not attempt to release a mutex unless it has actually

------------------------------------------
[...truncated 229 lines...]
[INFO] 
[INFO] --- maven-site-plugin:3.4:attach-descriptor (attach-descriptor) @ curator-client ---
[INFO] 
[INFO] --- maven-license-plugin:1.9.0:check (license) @ curator-client ---
[INFO] Checking licenses...
[CHECKSTYLE] No report found for mojo check
[INFO]                                                                         
[INFO] ------------------------------------------------------------------------
[INFO] Building Curator Framework 3.2.1-SNAPSHOT
[INFO] ------------------------------------------------------------------------
[INFO] 
[INFO] --- maven-clean-plugin:2.5:clean (default-clean) @ curator-framework ---
[INFO] 
[INFO] --- maven-remote-resources-plugin:1.5:process (default) @ curator-framework ---
[INFO] 
[INFO] --- maven-resources-plugin:2.7:resources (default-resources) @ curator-framework ---
[INFO] Using 'UTF-8' encoding to copy filtered resources.
[INFO] Copying 2 resources to META-INF
[INFO] Copying 3 resources
[INFO] 
[INFO] --- maven-compiler-plugin:3.2:compile (default-compile) @ curator-framework ---
[INFO] Changes detected - recompiling the module!
[INFO] Compiling 161 source files to <https://builds.apache.org/job/Curator-3.0/ws/curator-framework/target/classes>
[INFO] <https://builds.apache.org/job/Curator-3.0/ws/curator-framework/src/main/java/org/apache/curator/framework/imps/CuratorTempFrameworkImpl.java>:
Some input files use or override a deprecated API.
[INFO] <https://builds.apache.org/job/Curator-3.0/ws/curator-framework/src/main/java/org/apache/curator/framework/imps/CuratorTempFrameworkImpl.java>:
Recompile with -Xlint:deprecation for details.
[INFO] 
[INFO] >>> clirr-maven-plugin:2.6.1:check (default) > compile @ curator-framework
>>>
[INFO] 
[INFO] --- maven-remote-resources-plugin:1.5:process (default) @ curator-framework ---
[INFO] 
[INFO] --- maven-resources-plugin:2.7:resources (default-resources) @ curator-framework ---
[INFO] Using 'UTF-8' encoding to copy filtered resources.
[INFO] Copying 2 resources to META-INF
[INFO] Copying 3 resources
[INFO] Copying 3 resources
[INFO] 
[INFO] --- maven-compiler-plugin:3.2:compile (default-compile) @ curator-framework ---
[INFO] Nothing to compile - all classes are up to date
[WARNING] Failed to getClass for org.codehaus.mojo.clirr.ClirrCheckMojo
[INFO] 
[CHECKSTYLE] No report found for mojo check[INFO] <<< clirr-maven-plugin:2.6.1:check
(default) < compile @ curator-framework <<<
[INFO] 
[INFO] --- clirr-maven-plugin:2.6.1:check (default) @ curator-framework ---

[INFO] artifact org.apache.curator:curator-framework: checking for updates from Nexus
[INFO] artifact org.apache.curator:curator-framework: checking for updates from central
[INFO] Comparing to version: 3.2.0
[INFO] Downloading: https://repo.maven.apache.org/maven2/org/apache/curator/curator-framework/3.2.0/curator-framework-3.2.0.jar
[INFO] Downloaded: https://repo.maven.apache.org/maven2/org/apache/curator/curator-framework/3.2.0/curator-framework-3.2.0.jar
(290 KB at 2143.2 KB/sec)
[INFO] Downloading: https://repo.maven.apache.org/maven2/org/apache/curator/curator-framework/3.2.0/curator-framework-3.2.0.pom
[INFO] Downloaded: https://repo.maven.apache.org/maven2/org/apache/curator/curator-framework/3.2.0/curator-framework-3.2.0.pom
(4 KB at 49.9 KB/sec)
[INFO] Succeeded with 0 errors; 0 warnings; and 0 other changes.
[CHECKSTYLE] No report found for mojo check[INFO] 
[INFO] --- maven-bundle-plugin:2.3.7:manifest (bundle-manifest) @ curator-framework ---

[INFO] 
[INFO] --- maven-resources-plugin:2.7:testResources (default-testResources) @ curator-framework
---
[INFO] Using 'UTF-8' encoding to copy filtered resources.
[INFO] Copying 7 resources
[INFO] Copying 3 resources
[INFO] 
[INFO] --- maven-compiler-plugin:3.2:testCompile (default-testCompile) @ curator-framework
---
[INFO] Changes detected - recompiling the module!
[INFO] Compiling 25 source files to <https://builds.apache.org/job/Curator-3.0/ws/curator-framework/target/test-classes>
[INFO] <https://builds.apache.org/job/Curator-3.0/ws/curator-framework/src/test/java/org/apache/curator/framework/imps/TestFramework.java>:
Some input files use or override a deprecated API.
[INFO] <https://builds.apache.org/job/Curator-3.0/ws/curator-framework/src/test/java/org/apache/curator/framework/imps/TestFramework.java>:
Recompile with -Xlint:deprecation for details.
[INFO] 
[INFO] --- maven-surefire-plugin:2.18.1:test (default-test) @ curator-framework ---
[INFO] Surefire report directory: <https://builds.apache.org/job/Curator-3.0/ws/curator-framework/target/surefire-reports>

-------------------------------------------------------
 T E S T S
-------------------------------------------------------
Running org.apache.curator.framework.imps.TestReadOnly
Tests run: 2, Failures: 0, Errors: 0, Skipped: 0, Time elapsed: 51.527 sec - in org.apache.curator.framework.imps.TestReadOnly
Running org.apache.curator.framework.imps.TestFailedDeleteManager
Tests run: 12, Failures: 0, Errors: 0, Skipped: 0, Time elapsed: 678.291 sec - in org.apache.curator.framework.imps.TestFailedDeleteManager
Running org.apache.curator.framework.imps.TestFramework
Tests run: 68, Failures: 0, Errors: 0, Skipped: 0, Time elapsed: 438.278 sec - in org.apache.curator.framework.imps.TestFramework
Running org.apache.curator.framework.imps.TestEnabledSessionExpiredState
Tests run: 6, Failures: 0, Errors: 0, Skipped: 0, Time elapsed: 220.388 sec - in org.apache.curator.framework.imps.TestEnabledSessionExpiredState
Running org.apache.curator.framework.imps.TestTempFramework
Tests run: 4, Failures: 0, Errors: 0, Skipped: 0, Time elapsed: 5.13 sec - in org.apache.curator.framework.imps.TestTempFramework
Running org.apache.curator.framework.imps.TestCreateReturningStat
Tests run: 12, Failures: 0, Errors: 0, Skipped: 0, Time elapsed: 4.624 sec - in org.apache.curator.framework.imps.TestCreateReturningStat
Running org.apache.curator.framework.imps.TestMultiClient
Tests run: 2, Failures: 0, Errors: 0, Skipped: 0, Time elapsed: 1.101 sec - in org.apache.curator.framework.imps.TestMultiClient
Running org.apache.curator.framework.imps.TestTransactionsOld
Tests run: 8, Failures: 0, Errors: 0, Skipped: 0, Time elapsed: 1.834 sec - in org.apache.curator.framework.imps.TestTransactionsOld
Running org.apache.curator.framework.imps.TestEnsureContainers
Tests run: 4, Failures: 0, Errors: 0, Skipped: 0, Time elapsed: 1.32 sec - in org.apache.curator.framework.imps.TestEnsureContainers
Running org.apache.curator.framework.imps.TestRemoveWatches
Tests run: 28, Failures: 0, Errors: 0, Skipped: 0, Time elapsed: 236.086 sec - in org.apache.curator.framework.imps.TestRemoveWatches
Running org.apache.curator.framework.imps.TestCleanState
Tests run: 0, Failures: 0, Errors: 0, Skipped: 0, Time elapsed: 0.365 sec - in org.apache.curator.framework.imps.TestCleanState
Running org.apache.curator.framework.imps.TestNamespaceFacade
Tests run: 16, Failures: 0, Errors: 0, Skipped: 0, Time elapsed: 2.154 sec - in org.apache.curator.framework.imps.TestNamespaceFacade
Running org.apache.curator.framework.imps.TestFrameworkBackground
Tests run: 12, Failures: 0, Errors: 0, Skipped: 0, Time elapsed: 112.102 sec - in org.apache.curator.framework.imps.TestFrameworkBackground
Running org.apache.curator.framework.imps.TestTransactionsNew
Tests run: 12, Failures: 0, Errors: 0, Skipped: 0, Time elapsed: 5.769 sec - in org.apache.curator.framework.imps.TestTransactionsNew
Running org.apache.curator.framework.imps.TestWatcherRemovalManager
Tests run: 30, Failures: 0, Errors: 0, Skipped: 0, Time elapsed: 132.98 sec - in org.apache.curator.framework.imps.TestWatcherRemovalManager
Running org.apache.curator.framework.imps.TestNeverConnected
Tests run: 1, Failures: 0, Errors: 0, Skipped: 0, Time elapsed: 2.079 sec - in org.apache.curator.framework.imps.TestNeverConnected
Running org.apache.curator.framework.imps.TestFrameworkEdges
Tests run: 32, Failures: 0, Errors: 0, Skipped: 0, Time elapsed: 430.467 sec - in org.apache.curator.framework.imps.TestFrameworkEdges
Running org.apache.curator.framework.imps.TestWithCluster
Tests run: 2, Failures: 0, Errors: 0, Skipped: 0, Time elapsed: 302.234 sec - in org.apache.curator.framework.imps.TestWithCluster
Running org.apache.curator.framework.imps.TestCompressionInTransactionNew
Tests run: 8, Failures: 0, Errors: 0, Skipped: 0, Time elapsed: 1.596 sec - in org.apache.curator.framework.imps.TestCompressionInTransactionNew
Running org.apache.curator.framework.imps.TestReconfiguration
Tests run: 10, Failures: 0, Errors: 0, Skipped: 0, Time elapsed: 123.732 sec - in org.apache.curator.framework.imps.TestReconfiguration
Running org.apache.curator.framework.imps.TestBlockUntilConnected
Tests run: 12, Failures: 0, Errors: 0, Skipped: 0, Time elapsed: 84.73 sec - in org.apache.curator.framework.imps.TestBlockUntilConnected
Running org.apache.curator.framework.imps.TestCompression
Tests run: 6, Failures: 0, Errors: 0, Skipped: 0, Time elapsed: 1.572 sec - in org.apache.curator.framework.imps.TestCompression
Running org.apache.curator.framework.imps.TestWatcherIdentity
Tests run: 10, Failures: 0, Errors: 0, Skipped: 0, Time elapsed: 86.011 sec - in org.apache.curator.framework.imps.TestWatcherIdentity
Running org.apache.curator.framework.imps.TestCompressionInTransactionOld
Tests run: 8, Failures: 0, Errors: 0, Skipped: 0, Time elapsed: 1.512 sec - in org.apache.curator.framework.imps.TestCompressionInTransactionOld
Running org.apache.curator.framework.schema.TestSchema
Tests run: 6, Failures: 0, Errors: 0, Skipped: 0, Time elapsed: 1.874 sec - in org.apache.curator.framework.schema.TestSchema

Results :

Tests run: 311, Failures: 0, Errors: 0, Skipped: 0

[JENKINS] Recording test results
[INFO] 
[INFO] --- maven-bundle-plugin:2.3.7:bundle (default-bundle) @ curator-framework ---
[INFO] 
[INFO] --- maven-site-plugin:3.4:attach-descriptor (attach-descriptor) @ curator-framework
---
[INFO] 
[INFO] --- maven-jar-plugin:2.5:test-jar (default) @ curator-framework ---
[INFO] Building jar: <https://builds.apache.org/job/Curator-3.0/ws/curator-framework/target/curator-framework-3.2.1-SNAPSHOT-tests.jar>
[INFO] 
[INFO] --- maven-license-plugin:1.9.0:check (license) @ curator-framework ---
[INFO] Checking licenses...
[WARNING] Unknown file extension: <https://builds.apache.org/job/Curator-3.0/ws/curator-framework/src/test/resources/schema.yaml>
[CHECKSTYLE] No report found for mojo check
[INFO]                                                                         
[INFO] ------------------------------------------------------------------------
[INFO] Building Curator Recipes 3.2.1-SNAPSHOT
[INFO] ------------------------------------------------------------------------
[INFO] 
[INFO] --- maven-clean-plugin:2.5:clean (default-clean) @ curator-recipes ---
[INFO] 
[INFO] --- maven-remote-resources-plugin:1.5:process (default) @ curator-recipes ---
[INFO] 
[INFO] --- maven-resources-plugin:2.7:resources (default-resources) @ curator-recipes ---
[INFO] Using 'UTF-8' encoding to copy filtered resources.
[INFO] Copying 2 resources to META-INF
[INFO] Copying 3 resources
[INFO] 
[INFO] --- maven-compiler-plugin:3.2:compile (default-compile) @ curator-recipes ---
[INFO] Changes detected - recompiling the module!
[INFO] Compiling 86 source files to <https://builds.apache.org/job/Curator-3.0/ws/curator-recipes/target/classes>
[INFO] <https://builds.apache.org/job/Curator-3.0/ws/curator-recipes/src/main/java/org/apache/curator/framework/recipes/queue/DistributedQueue.java>:
Some input files use or override a deprecated API.
[INFO] <https://builds.apache.org/job/Curator-3.0/ws/curator-recipes/src/main/java/org/apache/curator/framework/recipes/queue/DistributedQueue.java>:
Recompile with -Xlint:deprecation for details.
[INFO] -------------------------------------------------------------
[ERROR] COMPILATION ERROR : 
[INFO] -------------------------------------------------------------
[ERROR] <https://builds.apache.org/job/Curator-3.0/ws/curator-recipes/src/main/java/org/apache/curator/framework/recipes/cache/TreeCache.java>:[596,19]
cannot find symbol
  symbol:   method removeWatchers()
  location: variable client of type org.apache.curator.framework.CuratorFramework
[INFO] 1 error
[INFO] -------------------------------------------------------------
[INFO]                                                                         
[INFO] ------------------------------------------------------------------------
[INFO] Building Curator Service Discovery 3.2.1-SNAPSHOT
[INFO] ------------------------------------------------------------------------
[INFO] Downloading: http://repository.apache.org/snapshots/org/apache/curator/curator-recipes/3.2.1-SNAPSHOT/maven-metadata.xml
[INFO] Downloading: http://repository.apache.org/snapshots/org/apache/curator/curator-recipes/3.2.1-SNAPSHOT/curator-recipes-3.2.1-SNAPSHOT.jar
[INFO]                                                                         
[INFO] ------------------------------------------------------------------------
[INFO] Building Curator Examples 3.2.1-SNAPSHOT
[INFO] ------------------------------------------------------------------------
[INFO] Downloading: http://repository.apache.org/snapshots/org/apache/curator/curator-x-discovery/3.2.1-SNAPSHOT/maven-metadata.xml
[INFO] Downloading: http://repository.apache.org/snapshots/org/apache/curator/curator-x-discovery/3.2.1-SNAPSHOT/curator-x-discovery-3.2.1-SNAPSHOT.jar
[INFO]                                                                         
[INFO] ------------------------------------------------------------------------
[INFO] Building Curator Service Discovery Server 3.2.1-SNAPSHOT
[INFO] ------------------------------------------------------------------------
[INFO]                                                                         
[INFO] ------------------------------------------------------------------------
[INFO] Building Curator RPC Proxy 3.2.1-SNAPSHOT
[INFO] ------------------------------------------------------------------------
[INFO] ------------------------------------------------------------------------
[INFO] Reactor Summary:
[INFO] 
[INFO] Apache Curator ..................................... SUCCESS [ 12.461 s]
[INFO] Curator Testing .................................... SUCCESS [ 11.359 s]
[INFO] Curator Client ..................................... SUCCESS [ 55.910 s]
[INFO] Curator Framework .................................. SUCCESS [49:01 min]
[INFO] Curator Recipes .................................... FAILURE [  1.672 s]
[INFO] Curator Service Discovery .......................... FAILURE [  0.569 s]
[INFO] Curator Examples ................................... FAILURE [  0.406 s]
[INFO] Curator Service Discovery Server ................... FAILURE [  1.232 s]
[INFO] Curator RPC Proxy .................................. FAILURE [  3.328 s]
[INFO] ------------------------------------------------------------------------
[INFO] BUILD FAILURE
[INFO] ------------------------------------------------------------------------
[INFO] Total time: 50:36 min
[INFO] Finished at: 2016-07-28T02:40:24+00:00
[INFO] Final Memory: 34M/350M
[INFO] ------------------------------------------------------------------------
Waiting for Jenkins to finish collecting data
[ERROR] Failed to execute goal org.apache.maven.plugins:maven-compiler-plugin:3.2:compile
(default-compile) on project curator-recipes: Compilation failure
[ERROR] <https://builds.apache.org/job/Curator-3.0/ws/curator-recipes/src/main/java/org/apache/curator/framework/recipes/cache/TreeCache.java>:[596,19]
cannot find symbol
[ERROR] symbol:   method removeWatchers()
[ERROR] location: variable client of type org.apache.curator.framework.CuratorFramework
[ERROR] -> [Help 1]
[ERROR] Failed to execute goal on project curator-x-discovery: Could not resolve dependencies
for project org.apache.curator:curator-x-discovery:bundle:3.2.1-SNAPSHOT: Could not find artifact
org.apache.curator:curator-recipes:jar:3.2.1-SNAPSHOT in Nexus (http://repository.apache.org/snapshots)
-> [Help 2]
[ERROR] Failed to execute goal on project curator-examples: Could not resolve dependencies
for project org.apache.curator:curator-examples:jar:3.2.1-SNAPSHOT: The following artifacts
could not be resolved: org.apache.curator:curator-recipes:jar:3.2.1-SNAPSHOT, org.apache.curator:curator-x-discovery:jar:3.2.1-SNAPSHOT:
Failure to find org.apache.curator:curator-recipes:jar:3.2.1-SNAPSHOT in http://repository.apache.org/snapshots
was cached in the local repository, resolution will not be reattempted until the update interval
of Nexus has elapsed or updates are forced -> [Help 2]
[ERROR] Failed to execute goal on project curator-x-discovery-server: Could not resolve dependencies
for project org.apache.curator:curator-x-discovery-server:bundle:3.2.1-SNAPSHOT: The following
artifacts could not be resolved: org.apache.curator:curator-x-discovery:jar:3.2.1-SNAPSHOT,
org.apache.curator:curator-recipes:jar:3.2.1-SNAPSHOT: Failure to find org.apache.curator:curator-x-discovery:jar:3.2.1-SNAPSHOT
in http://repository.apache.org/snapshots was cached in the local repository, resolution will
not be reattempted until the update interval of Nexus has elapsed or updates are forced ->
[Help 2]
[ERROR] Failed to execute goal on project curator-x-rpc: Could not resolve dependencies for
project org.apache.curator:curator-x-rpc:jar:3.2.1-SNAPSHOT: The following artifacts could
not be resolved: org.apache.curator:curator-recipes:jar:3.2.1-SNAPSHOT, org.apache.curator:curator-x-discovery:jar:3.2.1-SNAPSHOT:
Failure to find org.apache.curator:curator-recipes:jar:3.2.1-SNAPSHOT in http://repository.apache.org/snapshots
was cached in the local repository, resolution will not be reattempted until the update interval
of Nexus has elapsed or updates are forced -> [Help 2]
[ERROR] 
[ERROR] To see the full stack trace of the errors, re-run Maven with the -e switch.
[ERROR] Re-run Maven using the -X switch to enable full debug logging.
[ERROR] 
[ERROR] For more information about the errors and possible solutions, please read the following
articles:
[ERROR] [Help 1] http://cwiki.apache.org/confluence/display/MAVEN/MojoFailureException
[ERROR] [Help 2] http://cwiki.apache.org/confluence/display/MAVEN/DependencyResolutionException
[ERROR] 
[ERROR] After correcting the problems, you can resume the build with the command
[ERROR]   mvn <goals> -rf :curator-recipes
[INFO] Build failures were ignored.
[JENKINS] Archiving <https://builds.apache.org/job/Curator-3.0/ws/curator-x-rpc/pom.xml>
to org.apache.curator/curator-x-rpc/3.2.1-SNAPSHOT/curator-x-rpc-3.2.1-SNAPSHOT.pom
[JENKINS] Archiving <https://builds.apache.org/job/Curator-3.0/ws/curator-client/pom.xml>
to org.apache.curator/curator-client/3.2.1-SNAPSHOT/curator-client-3.2.1-SNAPSHOT.pom
[JENKINS] Archiving <https://builds.apache.org/job/Curator-3.0/ws/curator-client/target/curator-client-3.2.1-SNAPSHOT.jar>
to org.apache.curator/curator-client/3.2.1-SNAPSHOT/curator-client-3.2.1-SNAPSHOT.jar
[JENKINS] Archiving <https://builds.apache.org/job/Curator-3.0/ws/curator-framework/pom.xml>
to org.apache.curator/curator-framework/3.2.1-SNAPSHOT/curator-framework-3.2.1-SNAPSHOT.pom
[JENKINS] Archiving <https://builds.apache.org/job/Curator-3.0/ws/curator-framework/target/curator-framework-3.2.1-SNAPSHOT.jar>
to org.apache.curator/curator-framework/3.2.1-SNAPSHOT/curator-framework-3.2.1-SNAPSHOT.jar
[JENKINS] Archiving <https://builds.apache.org/job/Curator-3.0/ws/curator-framework/target/curator-framework-3.2.1-SNAPSHOT-tests.jar>
to org.apache.curator/curator-framework/3.2.1-SNAPSHOT/curator-framework-3.2.1-SNAPSHOT-tests.jar
[JENKINS] Archiving <https://builds.apache.org/job/Curator-3.0/ws/curator-x-discovery-server/pom.xml>
to org.apache.curator/curator-x-discovery-server/3.2.1-SNAPSHOT/curator-x-discovery-server-3.2.1-SNAPSHOT.pom
[JENKINS] Archiving <https://builds.apache.org/job/Curator-3.0/ws/curator-examples/pom.xml>
to org.apache.curator/curator-examples/3.2.1-SNAPSHOT/curator-examples-3.2.1-SNAPSHOT.pom
[JENKINS] Archiving <https://builds.apache.org/job/Curator-3.0/ws/curator-test/pom.xml>
to org.apache.curator/curator-test/3.2.1-SNAPSHOT/curator-test-3.2.1-SNAPSHOT.pom
[JENKINS] Archiving <https://builds.apache.org/job/Curator-3.0/ws/curator-test/target/curator-test-3.2.1-SNAPSHOT.jar>
to org.apache.curator/curator-test/3.2.1-SNAPSHOT/curator-test-3.2.1-SNAPSHOT.jar
[JENKINS] Archiving <https://builds.apache.org/job/Curator-3.0/ws/curator-recipes/pom.xml>
to org.apache.curator/curator-recipes/3.2.1-SNAPSHOT/curator-recipes-3.2.1-SNAPSHOT.pom
[JENKINS] Archiving <https://builds.apache.org/job/Curator-3.0/ws/pom.xml> to org.apache.curator/apache-curator/3.2.1-SNAPSHOT/apache-curator-3.2.1-SNAPSHOT.pom
[JENKINS] Archiving <https://builds.apache.org/job/Curator-3.0/ws/target/apache-curator-3.2.1-SNAPSHOT-site.xml>
to org.apache.curator/apache-curator/3.2.1-SNAPSHOT/apache-curator-3.2.1-SNAPSHOT-site.xml
Compressed 35.71 KB of artifacts by 89.6% relative to #80
[JENKINS] Archiving <https://builds.apache.org/job/Curator-3.0/ws/curator-x-discovery/pom.xml>
to org.apache.curator/curator-x-discovery/3.2.1-SNAPSHOT/curator-x-discovery-3.2.1-SNAPSHOT.pom
Sending e-mails to: dev@curator.apache.org
Sending e-mails to: dev@curator.apache.org
Sending e-mails to: dev@curator.apache.org
Sending e-mails to: dev@curator.apache.org
Sending e-mails to: dev@curator.apache.org
channel stopped

Mime
View raw message