curator-dev mailing list archives

Site index · List index
Message view « Date » · « Thread »
Top « Date » · « Thread »
From Apache Jenkins Server <jenk...@builds.apache.org>
Subject Build failed in Jenkins: Curator-3.0 #64
Date Thu, 21 Apr 2016 04:49:58 GMT
See <https://builds.apache.org/job/Curator-3.0/64/changes>

Changes:

[cammckenzie] CURATOR-317 - Manually applied CURATOR-317 change to Curator 3.0 branch 

------------------------------------------
[...truncated 3481 lines...]
[INFO] Downloading: https://repo.maven.apache.org/maven2/com/fasterxml/jackson/dataformat/jackson-dataformat-yaml/2.3.2/jackson-dataformat-yaml-2.3.2.jar
[INFO] Downloaded: https://repo.maven.apache.org/maven2/com/fasterxml/classmate/1.0.0/classmate-1.0.0.jar
(59 KB at 213.3 KB/sec)
[INFO] Downloading: https://repo.maven.apache.org/maven2/io/dropwizard/dropwizard-logging/0.7.0/dropwizard-logging-0.7.0.jar
[INFO] Downloaded: https://repo.maven.apache.org/maven2/org/hibernate/hibernate-validator/5.0.2.Final/hibernate-validator-5.0.2.Final.jar
(561 KB at 2003.1 KB/sec)
[INFO] Downloading: https://repo.maven.apache.org/maven2/com/codahale/metrics/metrics-logback/3.0.1/metrics-logback-3.0.1.jar
[INFO] Downloaded: https://repo.maven.apache.org/maven2/org/glassfish/web/javax.el/2.2.6/javax.el-2.2.6.jar
(115 KB at 408.2 KB/sec)
[INFO] Downloading: https://repo.maven.apache.org/maven2/com/codahale/metrics/metrics-core/3.0.1/metrics-core-3.0.1.jar
[INFO] Downloaded: https://repo.maven.apache.org/maven2/javax/el/javax.el-api/2.2.5/javax.el-api-2.2.5.jar
(38 KB at 134.4 KB/sec)
[INFO] Downloading: https://repo.maven.apache.org/maven2/org/slf4j/jul-to-slf4j/1.7.6/jul-to-slf4j-1.7.6.jar
[INFO] Downloaded: https://repo.maven.apache.org/maven2/org/slf4j/jul-to-slf4j/1.7.6/jul-to-slf4j-1.7.6.jar
(5 KB at 15.4 KB/sec)
[INFO] Downloading: https://repo.maven.apache.org/maven2/ch/qos/logback/logback-core/1.1.1/logback-core-1.1.1.jar
[INFO] Downloaded: https://repo.maven.apache.org/maven2/io/dropwizard/dropwizard-logging/0.7.0/dropwizard-logging-0.7.0.jar
(23 KB at 73.1 KB/sec)
[INFO] Downloading: https://repo.maven.apache.org/maven2/ch/qos/logback/logback-classic/1.1.1/logback-classic-1.1.1.jar
[INFO] Downloaded: https://repo.maven.apache.org/maven2/com/codahale/metrics/metrics-core/3.0.1/metrics-core-3.0.1.jar
(84 KB at 264.1 KB/sec)
[INFO] Downloading: https://repo.maven.apache.org/maven2/org/slf4j/log4j-over-slf4j/1.7.6/log4j-over-slf4j-1.7.6.jar
[INFO] Downloaded: https://repo.maven.apache.org/maven2/com/codahale/metrics/metrics-logback/3.0.1/metrics-logback-3.0.1.jar
(4 KB at 12.2 KB/sec)
[INFO] Downloading: https://repo.maven.apache.org/maven2/org/eclipse/jetty/jetty-util/9.0.7.v20131107/jetty-util-9.0.7.v20131107.jar
[INFO] Downloaded: https://repo.maven.apache.org/maven2/com/fasterxml/jackson/dataformat/jackson-dataformat-yaml/2.3.2/jackson-dataformat-yaml-2.3.2.jar
(351 KB at 1097.8 KB/sec)
[INFO] Downloaded: https://repo.maven.apache.org/maven2/org/slf4j/log4j-over-slf4j/1.7.6/log4j-over-slf4j-1.7.6.jar
(23 KB at 64.9 KB/sec)
[INFO] Downloaded: https://repo.maven.apache.org/maven2/ch/qos/logback/logback-classic/1.1.1/logback-classic-1.1.1.jar
(265 KB at 734.7 KB/sec)
[INFO] Downloaded: https://repo.maven.apache.org/maven2/org/eclipse/jetty/jetty-util/9.0.7.v20131107/jetty-util-9.0.7.v20131107.jar
(333 KB at 922.2 KB/sec)
[INFO] Downloaded: https://repo.maven.apache.org/maven2/ch/qos/logback/logback-core/1.1.1/logback-core-1.1.1.jar
(418 KB at 1138.3 KB/sec)
[INFO] 
[INFO] --- maven-clean-plugin:2.5:clean (default-clean) @ curator-x-rpc ---
[INFO] 
[INFO] --- maven-remote-resources-plugin:1.5:process (default) @ curator-x-rpc ---
[INFO] 
[INFO] --- maven-resources-plugin:2.7:resources (default-resources) @ curator-x-rpc ---
[INFO] Using 'UTF-8' encoding to copy filtered resources.
[INFO] Copying 1 resource
[INFO] Copying 1 resource
[INFO] Copying 3 resources
[INFO] 
[INFO] --- maven-compiler-plugin:3.2:compile (default-compile) @ curator-x-rpc ---
[INFO] Changes detected - recompiling the module!
[INFO] Compiling 63 source files to <https://builds.apache.org/job/Curator-3.0/ws/curator-x-rpc/target/classes>
[INFO] <https://builds.apache.org/job/Curator-3.0/ws/curator-x-rpc/src/main/java/org/apache/curator/x/rpc/idl/services/CuratorProjectionService.java>:
<https://builds.apache.org/job/Curator-3.0/ws/curator-x-rpc/src/main/java/org/apache/curator/x/rpc/idl/services/CuratorProjectionService.java>
uses or overrides a deprecated API.
[INFO] <https://builds.apache.org/job/Curator-3.0/ws/curator-x-rpc/src/main/java/org/apache/curator/x/rpc/idl/services/CuratorProjectionService.java>:
Recompile with -Xlint:deprecation for details.
[INFO] 
[INFO] >>> clirr-maven-plugin:2.6.1:check (default) > compile @ curator-x-rpc
>>>
[INFO] 
[INFO] --- maven-remote-resources-plugin:1.5:process (default) @ curator-x-rpc ---
[INFO] 
[INFO] --- maven-resources-plugin:2.7:resources (default-resources) @ curator-x-rpc ---
[INFO] Using 'UTF-8' encoding to copy filtered resources.
[INFO] Copying 1 resource
[INFO] Copying 1 resource
[INFO] Copying 3 resources
[INFO] Copying 3 resources
[INFO] 
[INFO] --- maven-compiler-plugin:3.2:compile (default-compile) @ curator-x-rpc ---
[INFO] Nothing to compile - all classes are up to date
[WARNING] Failed to getClass for org.codehaus.mojo.clirr.ClirrCheckMojo
[CHECKSTYLE] No report found for mojo check
[INFO] 
[INFO] <<< clirr-maven-plugin:2.6.1:check (default) < compile @ curator-x-rpc
<<<
[INFO] 
[INFO] --- clirr-maven-plugin:2.6.1:check (default) @ curator-x-rpc ---
[INFO] Skipping execution
[CHECKSTYLE] No report found for mojo check
[INFO] 
[INFO] --- maven-bundle-plugin:2.3.7:manifest (bundle-manifest) @ curator-x-rpc ---
[INFO] 
[INFO] --- maven-resources-plugin:2.7:testResources (default-testResources) @ curator-x-rpc
---
[INFO] Using 'UTF-8' encoding to copy filtered resources.
[INFO] Copying 4 resources
[INFO] Copying 3 resources
[INFO] 
[INFO] --- maven-compiler-plugin:3.2:testCompile (default-testCompile) @ curator-x-rpc ---
[INFO] Changes detected - recompiling the module!
[INFO] Compiling 52 source files to <https://builds.apache.org/job/Curator-3.0/ws/curator-x-rpc/target/test-classes>
[INFO] <https://builds.apache.org/job/Curator-3.0/ws/curator-x-rpc/src/test/java/org/apache/curator/generated/CuratorException.java>:
Some input files use unchecked or unsafe operations.
[INFO] <https://builds.apache.org/job/Curator-3.0/ws/curator-x-rpc/src/test/java/org/apache/curator/generated/CuratorException.java>:
Recompile with -Xlint:unchecked for details.
[INFO] 
[INFO] --- maven-surefire-plugin:2.18.1:test (default-test) @ curator-x-rpc ---
[INFO] Surefire report directory: <https://builds.apache.org/job/Curator-3.0/ws/curator-x-rpc/target/surefire-reports>

-------------------------------------------------------
 T E S T S
-------------------------------------------------------
Running org.apache.curator.x.rpc.TestClient
Tests run: 0, Failures: 0, Errors: 0, Skipped: 0, Time elapsed: 0.341 sec - in org.apache.curator.x.rpc.TestClient
Running org.apache.curator.x.rpc.TestServer
Tests run: 0, Failures: 0, Errors: 0, Skipped: 0, Time elapsed: 0.344 sec - in org.apache.curator.x.rpc.TestServer

Results :

Tests run: 0, Failures: 0, Errors: 0, Skipped: 0

[JENKINS] Recording test results
[INFO] 
[INFO] --- maven-jar-plugin:2.5:jar (default-jar) @ curator-x-rpc ---
[INFO] Building jar: <https://builds.apache.org/job/Curator-3.0/ws/curator-x-rpc/target/curator-x-rpc-3.1.1-SNAPSHOT.jar>
[INFO] 
[INFO] --- maven-site-plugin:3.4:attach-descriptor (attach-descriptor) @ curator-x-rpc ---
[INFO] 
[INFO] --- maven-shade-plugin:2.3:shade (default) @ curator-x-rpc ---
[INFO] Downloading: https://repo.maven.apache.org/maven2/org/apache/maven/maven-project/2.2.0/maven-project-2.2.0.jar
[INFO] Downloading: https://repo.maven.apache.org/maven2/org/apache/maven/maven-profile/2.2.0/maven-profile-2.2.0.jar
[INFO] Downloading: https://repo.maven.apache.org/maven2/org/apache/maven/maven-artifact-manager/2.2.0/maven-artifact-manager-2.2.0.jar
[INFO] Downloading: https://repo.maven.apache.org/maven2/org/apache/maven/maven-plugin-registry/2.2.0/maven-plugin-registry-2.2.0.jar
[INFO] Downloaded: https://repo.maven.apache.org/maven2/org/apache/maven/maven-plugin-registry/2.2.0/maven-plugin-registry-2.2.0.jar
(30 KB at 763.4 KB/sec)
[INFO] Downloaded: https://repo.maven.apache.org/maven2/org/apache/maven/maven-profile/2.2.0/maven-profile-2.2.0.jar
(35 KB at 863.2 KB/sec)
[INFO] Downloaded: https://repo.maven.apache.org/maven2/org/apache/maven/maven-artifact-manager/2.2.0/maven-artifact-manager-2.2.0.jar
(64 KB at 1596.0 KB/sec)
[INFO] Downloaded: https://repo.maven.apache.org/maven2/org/apache/maven/maven-project/2.2.0/maven-project-2.2.0.jar
(153 KB at 3243.7 KB/sec)
[INFO] Including org.apache.curator:curator-recipes:jar:3.1.1-SNAPSHOT in the shaded jar.
[INFO] Including org.apache.curator:curator-framework:jar:3.1.1-SNAPSHOT in the shaded jar.
[INFO] Including org.apache.curator:curator-client:jar:3.1.1-SNAPSHOT in the shaded jar.
[INFO] Including org.apache.curator:curator-x-discovery:jar:3.1.1-SNAPSHOT in the shaded jar.
[INFO] Including org.codehaus.jackson:jackson-mapper-asl:jar:1.9.13 in the shaded jar.
[INFO] Including org.codehaus.jackson:jackson-core-asl:jar:1.9.13 in the shaded jar.
[INFO] Including com.facebook.swift:swift-service:jar:0.12.0 in the shaded jar.
[INFO] Including com.facebook.swift:swift-annotations:jar:0.12.0 in the shaded jar.
[INFO] Including com.facebook.swift:swift-codec:jar:0.12.0 in the shaded jar.
[INFO] Including org.ow2.asm:asm-all:jar:4.1 in the shaded jar.
[INFO] Including com.thoughtworks.paranamer:paranamer:jar:2.5.2 in the shaded jar.
[INFO] Including org.apache.thrift:libthrift:jar:0.9.1 in the shaded jar.
[INFO] Including org.apache.commons:commons-lang3:jar:3.1 in the shaded jar.
[INFO] Including org.apache.httpcomponents:httpclient:jar:4.2.5 in the shaded jar.
[INFO] Including commons-logging:commons-logging:jar:1.1.1 in the shaded jar.
[INFO] Including commons-codec:commons-codec:jar:1.6 in the shaded jar.
[INFO] Including org.apache.httpcomponents:httpcore:jar:4.2.4 in the shaded jar.
[INFO] Including com.google.guava:guava:jar:16.0.1 in the shaded jar.
[INFO] Including com.facebook.nifty:nifty-client:jar:0.12.0 in the shaded jar.
[INFO] Including com.google.inject:guice:jar:3.0 in the shaded jar.
[INFO] Including aopalliance:aopalliance:jar:1.0 in the shaded jar.
[INFO] Including com.facebook.nifty:nifty-core:jar:0.12.0 in the shaded jar.
[INFO] Including javax.inject:javax.inject:jar:1 in the shaded jar.
[INFO] Including com.google.inject.extensions:guice-multibindings:jar:3.0 in the shaded jar.
[INFO] Including io.airlift:configuration:jar:0.83 in the shaded jar.
[INFO] Including javax.validation:validation-api:jar:1.1.0.Final in the shaded jar.
[INFO] Including org.apache.bval:bval-jsr303:jar:0.5 in the shaded jar.
[INFO] Including org.apache.bval:bval-core:jar:0.5 in the shaded jar.
[INFO] Including commons-beanutils:commons-beanutils-core:jar:1.8.3 in the shaded jar.
[INFO] Including cglib:cglib-nodep:jar:2.2.2 in the shaded jar.
[INFO] Including io.airlift:stats:jar:0.83 in the shaded jar.
[INFO] Including io.airlift:units:jar:0.83 in the shaded jar.
[INFO] Including org.slf4j:slf4j-api:jar:1.7.6 in the shaded jar.
[INFO] Including io.netty:netty:jar:3.7.0.Final in the shaded jar.
[INFO] Including com.google.code.findbugs:annotations:jar:2.0.2 in the shaded jar.
[INFO] Including org.weakref:jmxutils:jar:1.14 in the shaded jar.
[INFO] Including io.dropwizard:dropwizard-configuration:jar:0.7.0 in the shaded jar.
[INFO] Including io.dropwizard:dropwizard-jackson:jar:0.7.0 in the shaded jar.
[INFO] Including io.dropwizard:dropwizard-util:jar:0.7.0 in the shaded jar.
[INFO] Including com.fasterxml.jackson.core:jackson-annotations:jar:2.3.0 in the shaded jar.
[INFO] Including com.google.code.findbugs:jsr305:jar:2.0.3 in the shaded jar.
[INFO] Including joda-time:joda-time:jar:2.3 in the shaded jar.
[INFO] Including com.fasterxml.jackson.core:jackson-core:jar:2.3.2 in the shaded jar.
[INFO] Including com.fasterxml.jackson.core:jackson-databind:jar:2.3.2 in the shaded jar.
[INFO] Including com.fasterxml.jackson.datatype:jackson-datatype-guava:jar:2.3.2 in the shaded
jar.
[INFO] Including com.fasterxml.jackson.module:jackson-module-afterburner:jar:2.3.2 in the
shaded jar.
[INFO] Including com.fasterxml.jackson.datatype:jackson-datatype-joda:jar:2.3.2 in the shaded
jar.
[INFO] Including io.dropwizard:dropwizard-validation:jar:0.7.0 in the shaded jar.
[INFO] Including org.hibernate:hibernate-validator:jar:5.0.2.Final in the shaded jar.
[INFO] Including org.jboss.logging:jboss-logging:jar:3.1.1.GA in the shaded jar.
[INFO] Including com.fasterxml:classmate:jar:1.0.0 in the shaded jar.
[INFO] Including org.glassfish.web:javax.el:jar:2.2.6 in the shaded jar.
[INFO] Including javax.el:javax.el-api:jar:2.2.5 in the shaded jar.
[INFO] Including com.fasterxml.jackson.dataformat:jackson-dataformat-yaml:jar:2.3.2 in the
shaded jar.
[INFO] Including commons-lang:commons-lang:jar:2.6 in the shaded jar.
[INFO] Including io.dropwizard:dropwizard-logging:jar:0.7.0 in the shaded jar.
[INFO] Including com.codahale.metrics:metrics-logback:jar:3.0.1 in the shaded jar.
[INFO] Including com.codahale.metrics:metrics-core:jar:3.0.1 in the shaded jar.
[INFO] Including org.slf4j:jul-to-slf4j:jar:1.7.6 in the shaded jar.
[INFO] Including ch.qos.logback:logback-core:jar:1.1.1 in the shaded jar.
[INFO] Including ch.qos.logback:logback-classic:jar:1.1.1 in the shaded jar.
[INFO] Including org.slf4j:log4j-over-slf4j:jar:1.7.6 in the shaded jar.
[INFO] Including org.eclipse.jetty:jetty-util:jar:9.0.7.v20131107 in the shaded jar.
[INFO] Including org.apache.zookeeper:zookeeper:jar:3.5.1-alpha in the shaded jar.
[INFO] Including commons-cli:commons-cli:jar:1.2 in the shaded jar.
[INFO] Including net.java.dev.javacc:javacc:jar:5.0 in the shaded jar.
[WARNING] jsr305-2.0.3.jar, annotations-2.0.2.jar define 34 overlappping classes: 
[WARNING]   - javax.annotation.Nonnegative
[WARNING]   - javax.annotation.CheckForSigned
[WARNING]   - javax.annotation.CheckForNull
[WARNING]   - javax.annotation.Tainted
[WARNING]   - javax.annotation.meta.TypeQualifierValidator
[WARNING]   - javax.annotation.meta.TypeQualifier
[WARNING]   - javax.annotation.Syntax
[WARNING]   - javax.annotation.Detainted
[WARNING]   - javax.annotation.Nonnull$Checker
[WARNING]   - javax.annotation.meta.TypeQualifierNickname
[WARNING]   - 24 more...
[WARNING] maven-shade-plugin has detected that some .class files
[WARNING] are present in two or more JARs. When this happens, only
[WARNING] one single version of the class is copied in the uberjar.
[WARNING] Usually this is not harmful and you can skeep these
[WARNING] warnings, otherwise try to manually exclude artifacts
[WARNING] based on mvn dependency:tree -Ddetail=true and the above
[WARNING] output
[WARNING] See http://docs.codehaus.org/display/MAVENUSER/Shade+Plugin
[INFO] Replacing original artifact with shaded artifact.
[INFO] Replacing <https://builds.apache.org/job/Curator-3.0/ws/curator-x-rpc/target/curator-x-rpc-3.1.1-SNAPSHOT.jar>
with <https://builds.apache.org/job/Curator-3.0/ws/curator-x-rpc/target/curator-x-rpc-3.1.1-SNAPSHOT-shaded.jar>
[INFO] 
[INFO] --- maven-license-plugin:1.9.0:check (license) @ curator-x-rpc ---
[INFO] Checking licenses...
[CHECKSTYLE] No report found for mojo check
[INFO] ------------------------------------------------------------------------
[INFO] Reactor Summary:
[INFO] 
[INFO] Apache Curator ..................................... SUCCESS [  8.977 s]
[INFO] Curator Testing .................................... SUCCESS [  6.936 s]
[INFO] Curator Client ..................................... SUCCESS [01:16 min]
[INFO] Curator Framework .................................. FAILURE [49:36 min]
[INFO] Curator Recipes .................................... SUCCESS [  03:02 h]
[INFO] Curator Service Discovery .......................... SUCCESS [04:55 min]
[INFO] Curator Examples ................................... SUCCESS [  3.285 s]
[INFO] Curator Service Discovery Server ................... SUCCESS [ 13.917 s]
[INFO] Curator RPC Proxy .................................. SUCCESS [ 15.418 s]
[INFO] ------------------------------------------------------------------------
[INFO] BUILD FAILURE
[INFO] ------------------------------------------------------------------------
[INFO] Total time: 03:59 h
[INFO] Finished at: 2016-04-21T04:49:52+00:00
[INFO] Final Memory: 43M/362M
[INFO] ------------------------------------------------------------------------
[ERROR] Failed to execute goal com.mycila.maven-license-plugin:maven-license-plugin:1.9.0:check
(license) on project curator-framework: Some files do not have the expected license header
-> [Help 1]
[ERROR] 
[ERROR] To see the full stack trace of the errors, re-run Maven with the -e switch.
[ERROR] Re-run Maven using the -X switch to enable full debug logging.
[ERROR] 
[ERROR] For more information about the errors and possible solutions, please read the following
articles:
[ERROR] [Help 1] http://cwiki.apache.org/confluence/display/MAVEN/MojoExecutionException
[ERROR] 
[ERROR] After correcting the problems, you can resume the build with the command
[ERROR]   mvn <goals> -rf :curator-framework
[INFO] Build failures were ignored.
[JENKINS] Archiving <https://builds.apache.org/job/Curator-3.0/ws/curator-x-rpc/pom.xml>
to org.apache.curator/curator-x-rpc/3.1.1-SNAPSHOT/curator-x-rpc-3.1.1-SNAPSHOT.pom
[JENKINS] Archiving <https://builds.apache.org/job/Curator-3.0/ws/curator-x-rpc/target/curator-x-rpc-3.1.1-SNAPSHOT.jar>
to org.apache.curator/curator-x-rpc/3.1.1-SNAPSHOT/curator-x-rpc-3.1.1-SNAPSHOT.jar
[JENKINS] Archiving <https://builds.apache.org/job/Curator-3.0/ws/curator-client/pom.xml>
to org.apache.curator/curator-client/3.1.1-SNAPSHOT/curator-client-3.1.1-SNAPSHOT.pom
[JENKINS] Archiving <https://builds.apache.org/job/Curator-3.0/ws/curator-client/target/curator-client-3.1.1-SNAPSHOT.jar>
to org.apache.curator/curator-client/3.1.1-SNAPSHOT/curator-client-3.1.1-SNAPSHOT.jar
[JENKINS] Archiving <https://builds.apache.org/job/Curator-3.0/ws/curator-framework/pom.xml>
to org.apache.curator/curator-framework/3.1.1-SNAPSHOT/curator-framework-3.1.1-SNAPSHOT.pom
[JENKINS] Archiving <https://builds.apache.org/job/Curator-3.0/ws/curator-framework/target/curator-framework-3.1.1-SNAPSHOT.jar>
to org.apache.curator/curator-framework/3.1.1-SNAPSHOT/curator-framework-3.1.1-SNAPSHOT.jar
[JENKINS] Archiving <https://builds.apache.org/job/Curator-3.0/ws/curator-x-discovery-server/pom.xml>
to org.apache.curator/curator-x-discovery-server/3.1.1-SNAPSHOT/curator-x-discovery-server-3.1.1-SNAPSHOT.pom
[JENKINS] Archiving <https://builds.apache.org/job/Curator-3.0/ws/curator-x-discovery-server/target/curator-x-discovery-server-3.1.1-SNAPSHOT.jar>
to org.apache.curator/curator-x-discovery-server/3.1.1-SNAPSHOT/curator-x-discovery-server-3.1.1-SNAPSHOT.jar
[JENKINS] Archiving <https://builds.apache.org/job/Curator-3.0/ws/curator-examples/pom.xml>
to org.apache.curator/curator-examples/3.1.1-SNAPSHOT/curator-examples-3.1.1-SNAPSHOT.pom
[JENKINS] Archiving <https://builds.apache.org/job/Curator-3.0/ws/curator-examples/target/curator-examples-3.1.1-SNAPSHOT.jar>
to org.apache.curator/curator-examples/3.1.1-SNAPSHOT/curator-examples-3.1.1-SNAPSHOT.jar
[JENKINS] Archiving <https://builds.apache.org/job/Curator-3.0/ws/curator-test/pom.xml>
to org.apache.curator/curator-test/3.1.1-SNAPSHOT/curator-test-3.1.1-SNAPSHOT.pom
[JENKINS] Archiving <https://builds.apache.org/job/Curator-3.0/ws/curator-test/target/curator-test-3.1.1-SNAPSHOT.jar>
to org.apache.curator/curator-test/3.1.1-SNAPSHOT/curator-test-3.1.1-SNAPSHOT.jar
[JENKINS] Archiving <https://builds.apache.org/job/Curator-3.0/ws/curator-recipes/pom.xml>
to org.apache.curator/curator-recipes/3.1.1-SNAPSHOT/curator-recipes-3.1.1-SNAPSHOT.pom
[JENKINS] Archiving <https://builds.apache.org/job/Curator-3.0/ws/curator-recipes/target/curator-recipes-3.1.1-SNAPSHOT.jar>
to org.apache.curator/curator-recipes/3.1.1-SNAPSHOT/curator-recipes-3.1.1-SNAPSHOT.jar
[JENKINS] Archiving <https://builds.apache.org/job/Curator-3.0/ws/pom.xml> to org.apache.curator/apache-curator/3.1.1-SNAPSHOT/apache-curator-3.1.1-SNAPSHOT.pom
[JENKINS] Archiving <https://builds.apache.org/job/Curator-3.0/ws/target/apache-curator-3.1.1-SNAPSHOT-site.xml>
to org.apache.curator/apache-curator/3.1.1-SNAPSHOT/apache-curator-3.1.1-SNAPSHOT-site.xml
Compressed 34.88 KB of artifacts by 91.7% relative to #63
[JENKINS] Archiving <https://builds.apache.org/job/Curator-3.0/ws/curator-x-discovery/pom.xml>
to org.apache.curator/curator-x-discovery/3.1.1-SNAPSHOT/curator-x-discovery-3.1.1-SNAPSHOT.pom
[JENKINS] Archiving <https://builds.apache.org/job/Curator-3.0/ws/curator-x-discovery/target/curator-x-discovery-3.1.1-SNAPSHOT.jar>
to org.apache.curator/curator-x-discovery/3.1.1-SNAPSHOT/curator-x-discovery-3.1.1-SNAPSHOT.jar
Sending e-mails to: dev@curator.apache.org
Sending e-mails to: dev@curator.apache.org
channel stopped

Mime
View raw message