curator-dev mailing list archives

Site index · List index
Message view « Date » · « Thread »
Top « Date » · « Thread »
From Apache Jenkins Server <jenk...@builds.apache.org>
Subject Build failed in Jenkins: Curator-3.0 #62
Date Tue, 29 Mar 2016 02:47:41 GMT
See <https://builds.apache.org/job/Curator-3.0/62/changes>

Changes:

[nir.dothan] Added a new DYNAMIC_SEQUENTIAL ServiceType which creates an

[nir.dothan] added validation for DYNAMIC_SEQUENTIAL service type added a break in

[nir.dothan] added an enum method to indicate if a ServiceType.isDynamic()

------------------------------------------
[...truncated 4925 lines...]
Running org.apache.curator.x.rpc.TestServer
Tests run: 0, Failures: 0, Errors: 0, Skipped: 0, Time elapsed: 0.382 sec - in org.apache.curator.x.rpc.TestServer

Results :

Tests run: 0, Failures: 0, Errors: 0, Skipped: 0

[JENKINS] Recording test results
[INFO] 
[INFO] --- maven-jar-plugin:2.5:jar (default-jar) @ curator-x-rpc ---
[INFO] Building jar: <https://builds.apache.org/job/Curator-3.0/ws/curator-x-rpc/target/curator-x-rpc-3.1.1-SNAPSHOT.jar>
[INFO] 
[INFO] --- maven-site-plugin:3.4:attach-descriptor (attach-descriptor) @ curator-x-rpc ---
[INFO] 
[INFO] --- maven-shade-plugin:2.3:shade (default) @ curator-x-rpc ---
[INFO] Downloading: https://repo.maven.apache.org/maven2/org/apache/maven/maven-compat/3.0/maven-compat-3.0.pom
[INFO] Downloaded: https://repo.maven.apache.org/maven2/org/apache/maven/maven-compat/3.0/maven-compat-3.0.pom
(4 KB at 490.8 KB/sec)
[INFO] Downloading: https://repo.maven.apache.org/maven2/org/apache/maven/wagon/wagon-provider-api/1.0-beta-6/wagon-provider-api-1.0-beta-6.pom
[INFO] Downloaded: https://repo.maven.apache.org/maven2/org/apache/maven/wagon/wagon-provider-api/1.0-beta-6/wagon-provider-api-1.0-beta-6.pom
(2 KB at 245.5 KB/sec)
[INFO] Downloading: https://repo.maven.apache.org/maven2/org/apache/maven/wagon/wagon/1.0-beta-6/wagon-1.0-beta-6.pom
[INFO] Downloaded: https://repo.maven.apache.org/maven2/org/apache/maven/wagon/wagon/1.0-beta-6/wagon-1.0-beta-6.pom
(13 KB at 1728.0 KB/sec)
[INFO] Downloading: https://repo.maven.apache.org/maven2/org/ow2/asm/asm/5.0.2/asm-5.0.2.pom
[INFO] Downloaded: https://repo.maven.apache.org/maven2/org/ow2/asm/asm/5.0.2/asm-5.0.2.pom
(2 KB at 210.0 KB/sec)
[INFO] Downloading: https://repo.maven.apache.org/maven2/org/ow2/asm/asm-parent/5.0.2/asm-parent-5.0.2.pom
[INFO] Downloaded: https://repo.maven.apache.org/maven2/org/ow2/asm/asm-parent/5.0.2/asm-parent-5.0.2.pom
(6 KB at 596.2 KB/sec)
[INFO] Downloading: https://repo.maven.apache.org/maven2/org/ow2/asm/asm-commons/5.0.2/asm-commons-5.0.2.pom
[INFO] Downloaded: https://repo.maven.apache.org/maven2/org/ow2/asm/asm-commons/5.0.2/asm-commons-5.0.2.pom
(3 KB at 255.6 KB/sec)
[INFO] Downloading: https://repo.maven.apache.org/maven2/org/ow2/asm/asm-tree/5.0.2/asm-tree-5.0.2.pom
[INFO] Downloaded: https://repo.maven.apache.org/maven2/org/ow2/asm/asm-tree/5.0.2/asm-tree-5.0.2.pom
(3 KB at 254.3 KB/sec)
[INFO] Downloading: https://repo.maven.apache.org/maven2/org/jdom/jdom/1.1/jdom-1.1.pom
[INFO] Downloaded: https://repo.maven.apache.org/maven2/org/jdom/jdom/1.1/jdom-1.1.pom (3
KB at 305.2 KB/sec)
[INFO] Downloading: https://repo.maven.apache.org/maven2/org/apache/maven/shared/maven-dependency-tree/2.1/maven-dependency-tree-2.1.pom
[INFO] Downloaded: https://repo.maven.apache.org/maven2/org/apache/maven/shared/maven-dependency-tree/2.1/maven-dependency-tree-2.1.pom
(7 KB at 736.8 KB/sec)
[INFO] Downloading: https://repo.maven.apache.org/maven2/org/apache/maven/maven-project/2.2.0/maven-project-2.2.0.pom
[INFO] Downloaded: https://repo.maven.apache.org/maven2/org/apache/maven/maven-project/2.2.0/maven-project-2.2.0.pom
(3 KB at 338.5 KB/sec)
[INFO] Downloading: https://repo.maven.apache.org/maven2/org/apache/maven/maven/2.2.0/maven-2.2.0.pom
[INFO] Downloaded: https://repo.maven.apache.org/maven2/org/apache/maven/maven/2.2.0/maven-2.2.0.pom
(22 KB at 2741.2 KB/sec)
[INFO] Downloading: https://repo.maven.apache.org/maven2/org/apache/maven/maven-settings/2.2.0/maven-settings-2.2.0.pom
[INFO] Downloaded: https://repo.maven.apache.org/maven2/org/apache/maven/maven-settings/2.2.0/maven-settings-2.2.0.pom
(3 KB at 266.0 KB/sec)
[INFO] Downloading: https://repo.maven.apache.org/maven2/org/apache/maven/maven-model/2.2.0/maven-model-2.2.0.pom
[INFO] Downloaded: https://repo.maven.apache.org/maven2/org/apache/maven/maven-model/2.2.0/maven-model-2.2.0.pom
(4 KB at 316.4 KB/sec)
[INFO] Downloading: https://repo.maven.apache.org/maven2/org/apache/maven/maven-profile/2.2.0/maven-profile-2.2.0.pom
[INFO] Downloaded: https://repo.maven.apache.org/maven2/org/apache/maven/maven-profile/2.2.0/maven-profile-2.2.0.pom
(3 KB at 235.6 KB/sec)
[INFO] Downloading: https://repo.maven.apache.org/maven2/org/apache/maven/maven-artifact-manager/2.2.0/maven-artifact-manager-2.2.0.pom
[INFO] Downloaded: https://repo.maven.apache.org/maven2/org/apache/maven/maven-artifact-manager/2.2.0/maven-artifact-manager-2.2.0.pom
(4 KB at 432.9 KB/sec)
[INFO] Downloading: https://repo.maven.apache.org/maven2/org/apache/maven/maven-repository-metadata/2.2.0/maven-repository-metadata-2.2.0.pom
[INFO] Downloaded: https://repo.maven.apache.org/maven2/org/apache/maven/maven-repository-metadata/2.2.0/maven-repository-metadata-2.2.0.pom
(2 KB at 261.0 KB/sec)
[INFO] Downloading: https://repo.maven.apache.org/maven2/org/apache/maven/maven-artifact/2.2.0/maven-artifact-2.2.0.pom
[INFO] Downloaded: https://repo.maven.apache.org/maven2/org/apache/maven/maven-artifact/2.2.0/maven-artifact-2.2.0.pom
(2 KB at 193.0 KB/sec)
[INFO] Downloading: https://repo.maven.apache.org/maven2/org/apache/maven/maven-plugin-registry/2.2.0/maven-plugin-registry-2.2.0.pom
[INFO] Downloaded: https://repo.maven.apache.org/maven2/org/apache/maven/maven-plugin-registry/2.2.0/maven-plugin-registry-2.2.0.pom
(2 KB at 269.1 KB/sec)
[INFO] Downloading: https://repo.maven.apache.org/maven2/org/vafer/jdependency/0.9/jdependency-0.9.pom
[INFO] Downloaded: https://repo.maven.apache.org/maven2/org/vafer/jdependency/0.9/jdependency-0.9.pom
(11 KB at 1159.7 KB/sec)
[INFO] Downloading: https://repo.maven.apache.org/maven2/commons-io/commons-io/2.2/commons-io-2.2.pom
[INFO] Downloaded: https://repo.maven.apache.org/maven2/commons-io/commons-io/2.2/commons-io-2.2.pom
(11 KB at 1346.9 KB/sec)
[INFO] Downloading: https://repo.maven.apache.org/maven2/org/apache/commons/commons-parent/24/commons-parent-24.pom
[INFO] Downloaded: https://repo.maven.apache.org/maven2/org/apache/commons/commons-parent/24/commons-parent-24.pom
(47 KB at 5128.6 KB/sec)
[INFO] Downloading: https://repo.maven.apache.org/maven2/org/ow2/asm/asm-analysis/5.0.2/asm-analysis-5.0.2.pom
[INFO] Downloaded: https://repo.maven.apache.org/maven2/org/ow2/asm/asm-analysis/5.0.2/asm-analysis-5.0.2.pom
(3 KB at 292.4 KB/sec)
[INFO] Downloading: https://repo.maven.apache.org/maven2/org/ow2/asm/asm-util/5.0.2/asm-util-5.0.2.pom
[INFO] Downloaded: https://repo.maven.apache.org/maven2/org/ow2/asm/asm-util/5.0.2/asm-util-5.0.2.pom
(3 KB at 254.9 KB/sec)
[INFO] Downloading: https://repo.maven.apache.org/maven2/com/google/guava/guava/11.0.2/guava-11.0.2.pom
[INFO] Downloaded: https://repo.maven.apache.org/maven2/com/google/guava/guava/11.0.2/guava-11.0.2.pom
(6 KB at 593.5 KB/sec)
[INFO] Downloading: https://repo.maven.apache.org/maven2/com/google/guava/guava-parent/11.0.2/guava-parent-11.0.2.pom
[INFO] Downloaded: https://repo.maven.apache.org/maven2/com/google/guava/guava-parent/11.0.2/guava-parent-11.0.2.pom
(2 KB at 273.3 KB/sec)
[INFO] Downloading: https://repo.maven.apache.org/maven2/com/google/code/findbugs/jsr305/1.3.9/jsr305-1.3.9.pom
[INFO] Downloaded: https://repo.maven.apache.org/maven2/com/google/code/findbugs/jsr305/1.3.9/jsr305-1.3.9.pom
(965 B at 117.8 KB/sec)
[INFO] Downloading: https://repo.maven.apache.org/maven2/org/codehaus/plexus/plexus-interpolation/1.14/plexus-interpolation-1.14.jar
[INFO] Downloading: https://repo.maven.apache.org/maven2/org/apache/maven/maven-compat/3.0/maven-compat-3.0.jar
[INFO] Downloading: https://repo.maven.apache.org/maven2/org/apache/maven/wagon/wagon-provider-api/1.0-beta-6/wagon-provider-api-1.0-beta-6.jar
[INFO] Downloading: https://repo.maven.apache.org/maven2/org/ow2/asm/asm/5.0.2/asm-5.0.2.jar
[INFO] Downloading: https://repo.maven.apache.org/maven2/org/apache/maven/maven-artifact/3.0/maven-artifact-3.0.jar
[INFO] Downloaded: https://repo.maven.apache.org/maven2/org/ow2/asm/asm/5.0.2/asm-5.0.2.jar
(52 KB at 3465.6 KB/sec)
[INFO] Downloading: https://repo.maven.apache.org/maven2/org/ow2/asm/asm-commons/5.0.2/asm-commons-5.0.2.jar
[INFO] Downloaded: https://repo.maven.apache.org/maven2/org/codehaus/plexus/plexus-interpolation/1.14/plexus-interpolation-1.14.jar
(60 KB at 3727.5 KB/sec)
[INFO] Downloading: https://repo.maven.apache.org/maven2/org/ow2/asm/asm-tree/5.0.2/asm-tree-5.0.2.jar
[INFO] Downloaded: https://repo.maven.apache.org/maven2/org/apache/maven/maven-artifact/3.0/maven-artifact-3.0.jar
(51 KB at 3168.2 KB/sec)
[INFO] Downloading: https://repo.maven.apache.org/maven2/org/jdom/jdom/1.1/jdom-1.1.jar
[INFO] Downloaded: https://repo.maven.apache.org/maven2/org/apache/maven/wagon/wagon-provider-api/1.0-beta-6/wagon-provider-api-1.0-beta-6.jar
(52 KB at 2473.3 KB/sec)
[INFO] Downloading: https://repo.maven.apache.org/maven2/org/apache/maven/shared/maven-dependency-tree/2.1/maven-dependency-tree-2.1.jar
[INFO] Downloaded: https://repo.maven.apache.org/maven2/org/ow2/asm/asm-commons/5.0.2/asm-commons-5.0.2.jar
(41 KB at 1629.6 KB/sec)
[INFO] Downloading: https://repo.maven.apache.org/maven2/org/apache/maven/maven-project/2.2.0/maven-project-2.2.0.jar
[INFO] Downloaded: https://repo.maven.apache.org/maven2/org/ow2/asm/asm-tree/5.0.2/asm-tree-5.0.2.jar
(29 KB at 1090.6 KB/sec)
[INFO] Downloading: https://repo.maven.apache.org/maven2/org/apache/maven/maven-profile/2.2.0/maven-profile-2.2.0.jar
[INFO] Downloaded: https://repo.maven.apache.org/maven2/org/apache/maven/maven-compat/3.0/maven-compat-3.0.jar
(279 KB at 9593.5 KB/sec)
[INFO] Downloading: https://repo.maven.apache.org/maven2/org/apache/maven/maven-artifact-manager/2.2.0/maven-artifact-manager-2.2.0.jar
[INFO] Downloaded: https://repo.maven.apache.org/maven2/org/apache/maven/shared/maven-dependency-tree/2.1/maven-dependency-tree-2.1.jar
(59 KB at 1888.6 KB/sec)
[INFO] Downloading: https://repo.maven.apache.org/maven2/org/apache/maven/maven-plugin-registry/2.2.0/maven-plugin-registry-2.2.0.jar
[INFO] Downloaded: https://repo.maven.apache.org/maven2/org/jdom/jdom/1.1/jdom-1.1.jar (150
KB at 4153.5 KB/sec)
[INFO] Downloading: https://repo.maven.apache.org/maven2/org/vafer/jdependency/0.9/jdependency-0.9.jar
[INFO] Downloaded: https://repo.maven.apache.org/maven2/org/apache/maven/maven-profile/2.2.0/maven-profile-2.2.0.jar
(35 KB at 1015.5 KB/sec)
[INFO] Downloading: https://repo.maven.apache.org/maven2/commons-io/commons-io/2.2/commons-io-2.2.jar
[INFO] Downloaded: https://repo.maven.apache.org/maven2/org/apache/maven/maven-artifact-manager/2.2.0/maven-artifact-manager-2.2.0.jar
(64 KB at 1773.4 KB/sec)
[INFO] Downloading: https://repo.maven.apache.org/maven2/org/ow2/asm/asm-analysis/5.0.2/asm-analysis-5.0.2.jar
[INFO] Downloaded: https://repo.maven.apache.org/maven2/org/apache/maven/maven-plugin-registry/2.2.0/maven-plugin-registry-2.2.0.jar
(30 KB at 707.6 KB/sec)
[INFO] Downloading: https://repo.maven.apache.org/maven2/org/ow2/asm/asm-util/5.0.2/asm-util-5.0.2.jar
[INFO] Downloaded: https://repo.maven.apache.org/maven2/org/vafer/jdependency/0.9/jdependency-0.9.jar
(22 KB at 508.6 KB/sec)
[INFO] Downloading: https://repo.maven.apache.org/maven2/com/google/guava/guava/11.0.2/guava-11.0.2.jar
[INFO] Downloaded: https://repo.maven.apache.org/maven2/org/apache/maven/maven-project/2.2.0/maven-project-2.2.0.jar
(153 KB at 3545.5 KB/sec)
[INFO] Downloading: https://repo.maven.apache.org/maven2/com/google/code/findbugs/jsr305/1.3.9/jsr305-1.3.9.jar
[INFO] Downloaded: https://repo.maven.apache.org/maven2/org/ow2/asm/asm-analysis/5.0.2/asm-analysis-5.0.2.jar
(20 KB at 453.8 KB/sec)
[INFO] Downloaded: https://repo.maven.apache.org/maven2/commons-io/commons-io/2.2/commons-io-2.2.jar
(170 KB at 3531.6 KB/sec)
[INFO] Downloaded: https://repo.maven.apache.org/maven2/org/ow2/asm/asm-util/5.0.2/asm-util-5.0.2.jar
(43 KB at 862.9 KB/sec)
[INFO] Downloaded: https://repo.maven.apache.org/maven2/com/google/code/findbugs/jsr305/1.3.9/jsr305-1.3.9.jar
(33 KB at 608.3 KB/sec)
[INFO] Downloaded: https://repo.maven.apache.org/maven2/com/google/guava/guava/11.0.2/guava-11.0.2.jar
(1610 KB at 15329.2 KB/sec)
[INFO] Including org.apache.curator:curator-recipes:jar:3.1.1-SNAPSHOT in the shaded jar.
[INFO] Including org.apache.curator:curator-framework:jar:3.1.1-SNAPSHOT in the shaded jar.
[INFO] Including org.apache.curator:curator-client:jar:3.1.1-SNAPSHOT in the shaded jar.
[INFO] Including org.apache.curator:curator-x-discovery:jar:3.1.1-SNAPSHOT in the shaded jar.
[INFO] Including org.codehaus.jackson:jackson-mapper-asl:jar:1.9.13 in the shaded jar.
[INFO] Including org.codehaus.jackson:jackson-core-asl:jar:1.9.13 in the shaded jar.
[INFO] Including com.facebook.swift:swift-service:jar:0.12.0 in the shaded jar.
[INFO] Including com.facebook.swift:swift-annotations:jar:0.12.0 in the shaded jar.
[INFO] Including com.facebook.swift:swift-codec:jar:0.12.0 in the shaded jar.
[INFO] Including org.ow2.asm:asm-all:jar:4.1 in the shaded jar.
[INFO] Including com.thoughtworks.paranamer:paranamer:jar:2.5.2 in the shaded jar.
[INFO] Including org.apache.thrift:libthrift:jar:0.9.1 in the shaded jar.
[INFO] Including org.apache.commons:commons-lang3:jar:3.1 in the shaded jar.
[INFO] Including org.apache.httpcomponents:httpclient:jar:4.2.5 in the shaded jar.
[INFO] Including commons-logging:commons-logging:jar:1.1.1 in the shaded jar.
[INFO] Including commons-codec:commons-codec:jar:1.6 in the shaded jar.
[INFO] Including org.apache.httpcomponents:httpcore:jar:4.2.4 in the shaded jar.
[INFO] Including com.google.guava:guava:jar:16.0.1 in the shaded jar.
[INFO] Including com.facebook.nifty:nifty-client:jar:0.12.0 in the shaded jar.
[INFO] Including com.google.inject:guice:jar:3.0 in the shaded jar.
[INFO] Including aopalliance:aopalliance:jar:1.0 in the shaded jar.
[INFO] Including com.facebook.nifty:nifty-core:jar:0.12.0 in the shaded jar.
[INFO] Including javax.inject:javax.inject:jar:1 in the shaded jar.
[INFO] Including com.google.inject.extensions:guice-multibindings:jar:3.0 in the shaded jar.
[INFO] Including io.airlift:configuration:jar:0.83 in the shaded jar.
[INFO] Including javax.validation:validation-api:jar:1.1.0.Final in the shaded jar.
[INFO] Including org.apache.bval:bval-jsr303:jar:0.5 in the shaded jar.
[INFO] Including org.apache.bval:bval-core:jar:0.5 in the shaded jar.
[INFO] Including commons-beanutils:commons-beanutils-core:jar:1.8.3 in the shaded jar.
[INFO] Including cglib:cglib-nodep:jar:2.2.2 in the shaded jar.
[INFO] Including io.airlift:stats:jar:0.83 in the shaded jar.
[INFO] Including io.airlift:units:jar:0.83 in the shaded jar.
[INFO] Including org.slf4j:slf4j-api:jar:1.7.6 in the shaded jar.
[INFO] Including io.netty:netty:jar:3.7.0.Final in the shaded jar.
[INFO] Including com.google.code.findbugs:annotations:jar:2.0.2 in the shaded jar.
[INFO] Including org.weakref:jmxutils:jar:1.14 in the shaded jar.
[INFO] Including io.dropwizard:dropwizard-configuration:jar:0.7.0 in the shaded jar.
[INFO] Including io.dropwizard:dropwizard-jackson:jar:0.7.0 in the shaded jar.
[INFO] Including io.dropwizard:dropwizard-util:jar:0.7.0 in the shaded jar.
[INFO] Including com.fasterxml.jackson.core:jackson-annotations:jar:2.3.0 in the shaded jar.
[INFO] Including com.google.code.findbugs:jsr305:jar:2.0.3 in the shaded jar.
[INFO] Including joda-time:joda-time:jar:2.3 in the shaded jar.
[INFO] Including com.fasterxml.jackson.core:jackson-core:jar:2.3.2 in the shaded jar.
[INFO] Including com.fasterxml.jackson.core:jackson-databind:jar:2.3.2 in the shaded jar.
[INFO] Including com.fasterxml.jackson.datatype:jackson-datatype-guava:jar:2.3.2 in the shaded
jar.
[INFO] Including com.fasterxml.jackson.module:jackson-module-afterburner:jar:2.3.2 in the
shaded jar.
[INFO] Including com.fasterxml.jackson.datatype:jackson-datatype-joda:jar:2.3.2 in the shaded
jar.
[INFO] Including io.dropwizard:dropwizard-validation:jar:0.7.0 in the shaded jar.
[INFO] Including org.hibernate:hibernate-validator:jar:5.0.2.Final in the shaded jar.
[INFO] Including org.jboss.logging:jboss-logging:jar:3.1.1.GA in the shaded jar.
[INFO] Including com.fasterxml:classmate:jar:1.0.0 in the shaded jar.
[INFO] Including org.glassfish.web:javax.el:jar:2.2.6 in the shaded jar.
[INFO] Including javax.el:javax.el-api:jar:2.2.5 in the shaded jar.
[INFO] Including com.fasterxml.jackson.dataformat:jackson-dataformat-yaml:jar:2.3.2 in the
shaded jar.
[INFO] Including commons-lang:commons-lang:jar:2.6 in the shaded jar.
[INFO] Including io.dropwizard:dropwizard-logging:jar:0.7.0 in the shaded jar.
[INFO] Including com.codahale.metrics:metrics-logback:jar:3.0.1 in the shaded jar.
[INFO] Including com.codahale.metrics:metrics-core:jar:3.0.1 in the shaded jar.
[INFO] Including org.slf4j:jul-to-slf4j:jar:1.7.6 in the shaded jar.
[INFO] Including ch.qos.logback:logback-core:jar:1.1.1 in the shaded jar.
[INFO] Including ch.qos.logback:logback-classic:jar:1.1.1 in the shaded jar.
[INFO] Including org.slf4j:log4j-over-slf4j:jar:1.7.6 in the shaded jar.
[INFO] Including org.eclipse.jetty:jetty-util:jar:9.0.7.v20131107 in the shaded jar.
[INFO] Including org.apache.zookeeper:zookeeper:jar:3.5.1-alpha in the shaded jar.
[INFO] Including commons-cli:commons-cli:jar:1.2 in the shaded jar.
[INFO] Including net.java.dev.javacc:javacc:jar:5.0 in the shaded jar.
[WARNING] jsr305-2.0.3.jar, annotations-2.0.2.jar define 34 overlappping classes: 
[WARNING]   - javax.annotation.Nonnegative
[WARNING]   - javax.annotation.CheckForSigned
[WARNING]   - javax.annotation.CheckForNull
[WARNING]   - javax.annotation.Tainted
[WARNING]   - javax.annotation.meta.TypeQualifierValidator
[WARNING]   - javax.annotation.meta.TypeQualifier
[WARNING]   - javax.annotation.Syntax
[WARNING]   - javax.annotation.Detainted
[WARNING]   - javax.annotation.Nonnull$Checker
[WARNING]   - javax.annotation.meta.TypeQualifierNickname
[WARNING]   - 24 more...
[WARNING] maven-shade-plugin has detected that some .class files
[WARNING] are present in two or more JARs. When this happens, only
[WARNING] one single version of the class is copied in the uberjar.
[WARNING] Usually this is not harmful and you can skeep these
[WARNING] warnings, otherwise try to manually exclude artifacts
[WARNING] based on mvn dependency:tree -Ddetail=true and the above
[WARNING] output
[WARNING] See http://docs.codehaus.org/display/MAVENUSER/Shade+Plugin
[INFO] Replacing original artifact with shaded artifact.
[INFO] Replacing <https://builds.apache.org/job/Curator-3.0/ws/curator-x-rpc/target/curator-x-rpc-3.1.1-SNAPSHOT.jar>
with <https://builds.apache.org/job/Curator-3.0/ws/curator-x-rpc/target/curator-x-rpc-3.1.1-SNAPSHOT-shaded.jar>
[INFO] 
[INFO] --- maven-license-plugin:1.9.0:check (license) @ curator-x-rpc ---
[INFO] Checking licenses...
[CHECKSTYLE] No report found for mojo check
[INFO] ------------------------------------------------------------------------
[INFO] Reactor Summary:
[INFO] 
[INFO] Apache Curator ..................................... SUCCESS [ 11.067 s]
[INFO] Curator Testing .................................... SUCCESS [  7.566 s]
[INFO] Curator Client ..................................... SUCCESS [01:15 min]
[INFO] Curator Framework .................................. FAILURE [49:06 min]
[INFO] Curator Recipes .................................... SUCCESS [  02:58 h]
[INFO] Curator Service Discovery .......................... SUCCESS [04:57 min]
[INFO] Curator Examples ................................... SUCCESS [  3.331 s]
[INFO] Curator Service Discovery Server ................... SUCCESS [ 15.562 s]
[INFO] Curator RPC Proxy .................................. SUCCESS [ 15.602 s]
[INFO] ------------------------------------------------------------------------
[INFO] BUILD FAILURE
[INFO] ------------------------------------------------------------------------
[INFO] Total time: 03:55 h
[INFO] Finished at: 2016-03-29T02:47:32+00:00
[INFO] Final Memory: 45M/462M
[INFO] ------------------------------------------------------------------------
[ERROR] Failed to execute goal com.mycila.maven-license-plugin:maven-license-plugin:1.9.0:check
(license) on project curator-framework: Some files do not have the expected license header
-> [Help 1]
[ERROR] 
[ERROR] To see the full stack trace of the errors, re-run Maven with the -e switch.
[ERROR] Re-run Maven using the -X switch to enable full debug logging.
[ERROR] 
[ERROR] For more information about the errors and possible solutions, please read the following
articles:
[ERROR] [Help 1] http://cwiki.apache.org/confluence/display/MAVEN/MojoExecutionException
[ERROR] 
[ERROR] After correcting the problems, you can resume the build with the command
[ERROR]   mvn <goals> -rf :curator-framework
[INFO] Build failures were ignored.
[JENKINS] Archiving <https://builds.apache.org/job/Curator-3.0/ws/curator-x-rpc/pom.xml>
to org.apache.curator/curator-x-rpc/3.1.1-SNAPSHOT/curator-x-rpc-3.1.1-SNAPSHOT.pom
[JENKINS] Archiving <https://builds.apache.org/job/Curator-3.0/ws/curator-x-rpc/target/curator-x-rpc-3.1.1-SNAPSHOT.jar>
to org.apache.curator/curator-x-rpc/3.1.1-SNAPSHOT/curator-x-rpc-3.1.1-SNAPSHOT.jar
[JENKINS] Archiving <https://builds.apache.org/job/Curator-3.0/ws/curator-client/pom.xml>
to org.apache.curator/curator-client/3.1.1-SNAPSHOT/curator-client-3.1.1-SNAPSHOT.pom
[JENKINS] Archiving <https://builds.apache.org/job/Curator-3.0/ws/curator-client/target/curator-client-3.1.1-SNAPSHOT.jar>
to org.apache.curator/curator-client/3.1.1-SNAPSHOT/curator-client-3.1.1-SNAPSHOT.jar
[JENKINS] Archiving <https://builds.apache.org/job/Curator-3.0/ws/curator-framework/pom.xml>
to org.apache.curator/curator-framework/3.1.1-SNAPSHOT/curator-framework-3.1.1-SNAPSHOT.pom
[JENKINS] Archiving <https://builds.apache.org/job/Curator-3.0/ws/curator-framework/target/curator-framework-3.1.1-SNAPSHOT.jar>
to org.apache.curator/curator-framework/3.1.1-SNAPSHOT/curator-framework-3.1.1-SNAPSHOT.jar
[JENKINS] Archiving <https://builds.apache.org/job/Curator-3.0/ws/curator-x-discovery-server/pom.xml>
to org.apache.curator/curator-x-discovery-server/3.1.1-SNAPSHOT/curator-x-discovery-server-3.1.1-SNAPSHOT.pom
[JENKINS] Archiving <https://builds.apache.org/job/Curator-3.0/ws/curator-x-discovery-server/target/curator-x-discovery-server-3.1.1-SNAPSHOT.jar>
to org.apache.curator/curator-x-discovery-server/3.1.1-SNAPSHOT/curator-x-discovery-server-3.1.1-SNAPSHOT.jar
[JENKINS] Archiving <https://builds.apache.org/job/Curator-3.0/ws/curator-examples/pom.xml>
to org.apache.curator/curator-examples/3.1.1-SNAPSHOT/curator-examples-3.1.1-SNAPSHOT.pom
[JENKINS] Archiving <https://builds.apache.org/job/Curator-3.0/ws/curator-examples/target/curator-examples-3.1.1-SNAPSHOT.jar>
to org.apache.curator/curator-examples/3.1.1-SNAPSHOT/curator-examples-3.1.1-SNAPSHOT.jar
[JENKINS] Archiving <https://builds.apache.org/job/Curator-3.0/ws/curator-test/pom.xml>
to org.apache.curator/curator-test/3.1.1-SNAPSHOT/curator-test-3.1.1-SNAPSHOT.pom
[JENKINS] Archiving <https://builds.apache.org/job/Curator-3.0/ws/curator-test/target/curator-test-3.1.1-SNAPSHOT.jar>
to org.apache.curator/curator-test/3.1.1-SNAPSHOT/curator-test-3.1.1-SNAPSHOT.jar
[JENKINS] Archiving <https://builds.apache.org/job/Curator-3.0/ws/curator-recipes/pom.xml>
to org.apache.curator/curator-recipes/3.1.1-SNAPSHOT/curator-recipes-3.1.1-SNAPSHOT.pom
[JENKINS] Archiving <https://builds.apache.org/job/Curator-3.0/ws/curator-recipes/target/curator-recipes-3.1.1-SNAPSHOT.jar>
to org.apache.curator/curator-recipes/3.1.1-SNAPSHOT/curator-recipes-3.1.1-SNAPSHOT.jar
[JENKINS] Archiving <https://builds.apache.org/job/Curator-3.0/ws/pom.xml> to org.apache.curator/apache-curator/3.1.1-SNAPSHOT/apache-curator-3.1.1-SNAPSHOT.pom
[JENKINS] Archiving <https://builds.apache.org/job/Curator-3.0/ws/target/apache-curator-3.1.1-SNAPSHOT-site.xml>
to org.apache.curator/apache-curator/3.1.1-SNAPSHOT/apache-curator-3.1.1-SNAPSHOT-site.xml
Compressed 34.88 KB of artifacts by 91.7% relative to #61
[JENKINS] Archiving <https://builds.apache.org/job/Curator-3.0/ws/curator-x-discovery/pom.xml>
to org.apache.curator/curator-x-discovery/3.1.1-SNAPSHOT/curator-x-discovery-3.1.1-SNAPSHOT.pom
[JENKINS] Archiving <https://builds.apache.org/job/Curator-3.0/ws/curator-x-discovery/target/curator-x-discovery-3.1.1-SNAPSHOT.jar>
to org.apache.curator/curator-x-discovery/3.1.1-SNAPSHOT/curator-x-discovery-3.1.1-SNAPSHOT.jar
Sending e-mails to: dev@curator.apache.org
Sending e-mails to: dev@curator.apache.org
channel stopped

Mime
View raw message