curator-dev mailing list archives

Site index · List index
Message view « Date » · « Thread »
Top « Date » · « Thread »
From Apache Jenkins Server <jenk...@builds.apache.org>
Subject Build failed in Jenkins: Curator #970
Date Thu, 10 Mar 2016 23:27:37 GMT
See <https://builds.apache.org/job/Curator/970/changes>

Changes:

[randgalt] Added a method for background operations to intercept exeptions.

------------------------------------------
[...truncated 577 lines...]
[INFO] Nothing to compile - all classes are up to date
[WARNING] Failed to getClass for org.codehaus.mojo.clirr.ClirrCheckMojo
[CHECKSTYLE] No report found for mojo check
[INFO] 
[INFO] <<< clirr-maven-plugin:2.6.1:check (default) < compile @ curator-client
<<<
[INFO] 
[INFO] --- clirr-maven-plugin:2.6.1:check (default) @ curator-client ---
[INFO] artifact org.apache.curator:curator-client: checking for updates from Nexus
[INFO] artifact org.apache.curator:curator-client: checking for updates from central
[INFO] Comparing to version: 2.10.0
[INFO] Downloading: https://repo.maven.apache.org/maven2/org/apache/curator/curator-client/2.10.0/curator-client-2.10.0.jar
[INFO] Downloaded: https://repo.maven.apache.org/maven2/org/apache/curator/curator-client/2.10.0/curator-client-2.10.0.jar
(72 KB at 1839.1 KB/sec)
[INFO] Downloading: https://repo.maven.apache.org/maven2/org/apache/curator/curator-client/2.10.0/curator-client-2.10.0.pom
[INFO] Downloaded: https://repo.maven.apache.org/maven2/org/apache/curator/curator-client/2.10.0/curator-client-2.10.0.pom
(3 KB at 80.1 KB/sec)
[INFO] Succeeded with 0 errors; 0 warnings; and 0 other changes.
[CHECKSTYLE] No report found for mojo check[INFO] 

[INFO] --- maven-bundle-plugin:2.3.7:manifest (bundle-manifest) @ curator-client ---
[INFO] 
[INFO] --- maven-resources-plugin:2.6:testResources (default-testResources) @ curator-client
---
[INFO] Using 'UTF-8' encoding to copy filtered resources.
[INFO] Copying 1 resource
[INFO] Copying 3 resources
[INFO] 
[INFO] --- maven-compiler-plugin:3.1:testCompile (default-testCompile) @ curator-client ---
[INFO] Changes detected - recompiling the module!
[INFO] Compiling 8 source files to <https://builds.apache.org/job/Curator/ws/curator-client/target/test-classes>
[INFO] 
[INFO] --- maven-surefire-plugin:2.17:test (default-test) @ curator-client ---
[INFO] Surefire report directory: <https://builds.apache.org/job/Curator/ws/curator-client/target/surefire-reports>
[INFO] Downloading: https://repo.maven.apache.org/maven2/org/apache/maven/surefire/surefire-testng/2.17/surefire-testng-2.17.pom
[INFO] Downloaded: https://repo.maven.apache.org/maven2/org/apache/maven/surefire/surefire-testng/2.17/surefire-testng-2.17.pom
(3 KB at 82.6 KB/sec)
[INFO] Downloading: https://repo.maven.apache.org/maven2/org/testng/testng/5.7/testng-5.7.pom
[INFO] Downloaded: https://repo.maven.apache.org/maven2/org/testng/testng/5.7/testng-5.7.pom
(12 KB at 325.3 KB/sec)
[INFO] Downloading: https://repo.maven.apache.org/maven2/org/apache/maven/surefire/surefire-testng/2.17/surefire-testng-2.17.jar
[INFO] Downloaded: https://repo.maven.apache.org/maven2/org/apache/maven/surefire/surefire-testng/2.17/surefire-testng-2.17.jar
(36 KB at 682.7 KB/sec)
[INFO] Downloading: https://repo.maven.apache.org/maven2/org/apache/maven/surefire/surefire-testng-utils/2.17/surefire-testng-utils-2.17.jar
[INFO] Downloaded: https://repo.maven.apache.org/maven2/org/apache/maven/surefire/surefire-testng-utils/2.17/surefire-testng-utils-2.17.jar
(29 KB at 782.3 KB/sec)

-------------------------------------------------------
 T E S T S
-------------------------------------------------------

-------------------------------------------------------
 T E S T S
-------------------------------------------------------
Running org.apache.curator.TestEnsurePath
Tests run: 2, Failures: 0, Errors: 0, Skipped: 0, Time elapsed: 0.856 sec - in org.apache.curator.TestEnsurePath
Running org.apache.curator.TestRetryLoop
Tests run: 4, Failures: 0, Errors: 0, Skipped: 0, Time elapsed: 14.265 sec - in org.apache.curator.TestRetryLoop
Running org.apache.curator.utils.TestCloseableExecutorService
Tests run: 5, Failures: 0, Errors: 0, Skipped: 0, Time elapsed: 0.541 sec - in org.apache.curator.utils.TestCloseableExecutorService
Running org.apache.curator.utils.TestZKPaths
Tests run: 2, Failures: 0, Errors: 0, Skipped: 0, Time elapsed: 0.465 sec - in org.apache.curator.utils.TestZKPaths
Running org.apache.curator.utils.TestCloseableScheduledExecutorService
Tests run: 2, Failures: 0, Errors: 0, Skipped: 0, Time elapsed: 2.525 sec - in org.apache.curator.utils.TestCloseableScheduledExecutorService
Running org.apache.curator.ensemble.exhibitor.TestExhibitorEnsembleProvider
Tests run: 3, Failures: 0, Errors: 0, Skipped: 0, Time elapsed: 5.683 sec - in org.apache.curator.ensemble.exhibitor.TestExhibitorEnsembleProvider
Running org.apache.curator.TestSessionFailRetryLoop
Tests run: 4, Failures: 0, Errors: 0, Skipped: 0, Time elapsed: 11.319 sec - in org.apache.curator.TestSessionFailRetryLoop

Results :

Tests run: 22, Failures: 0, Errors: 0, Skipped: 0

[JENKINS] Recording test results
[INFO] 
[INFO] --- maven-bundle-plugin:2.3.7:bundle (default-bundle) @ curator-client ---
[INFO] 
[INFO] --- maven-site-plugin:3.4:attach-descriptor (attach-descriptor) @ curator-client ---
[INFO] 
[INFO] --- maven-license-plugin:1.9.0:check (license) @ curator-client ---
[INFO] Checking licenses...
[CHECKSTYLE] No report found for mojo check[INFO] 
[INFO] --- maven-install-plugin:2.5.2:install (default-install) @ curator-client ---
[INFO] Installing <https://builds.apache.org/job/Curator/ws/curator-client/target/curator-client-2.10.1-SNAPSHOT.jar>
to /jenkins/maven-repositories/0/org/apache/curator/curator-client/2.10.1-SNAPSHOT/curator-client-2.10.1-SNAPSHOT.jar
[INFO] Installing <https://builds.apache.org/job/Curator/ws/curator-client/pom.xml>
to /jenkins/maven-repositories/0/org/apache/curator/curator-client/2.10.1-SNAPSHOT/curator-client-2.10.1-SNAPSHOT.pom

[INFO] 
[INFO] --- maven-bundle-plugin:2.3.7:install (default-install) @ curator-client ---
[INFO] Writing OBR metadata
[INFO] Installing org/apache/curator/curator-client/2.10.1-SNAPSHOT/curator-client-2.10.1-SNAPSHOT.jar
[INFO] Writing OBR metadata
[INFO]                                                                         
[INFO] ------------------------------------------------------------------------
[INFO] Building Curator Framework 2.10.1-SNAPSHOT
[INFO] ------------------------------------------------------------------------
[INFO] 
[INFO] --- maven-clean-plugin:2.5:clean (default-clean) @ curator-framework ---
[INFO] 
[INFO] --- maven-remote-resources-plugin:1.5:process (default) @ curator-framework ---
[INFO] 
[INFO] --- maven-resources-plugin:2.6:resources (default-resources) @ curator-framework ---
[INFO] Using 'UTF-8' encoding to copy filtered resources.
[INFO] Copying 2 resources to META-INF
[INFO] Copying 3 resources
[INFO] 
[INFO] --- maven-compiler-plugin:3.1:compile (default-compile) @ curator-framework ---
[INFO] Changes detected - recompiling the module!
[INFO] Compiling 103 source files to <https://builds.apache.org/job/Curator/ws/curator-framework/target/classes>
[INFO] 
[INFO] >>> clirr-maven-plugin:2.6.1:check (default) > compile @ curator-framework
>>>
[INFO] 
[INFO] --- maven-remote-resources-plugin:1.5:process (default) @ curator-framework ---
[INFO] 
[INFO] --- maven-resources-plugin:2.6:resources (default-resources) @ curator-framework ---
[INFO] Using 'UTF-8' encoding to copy filtered resources.
[INFO] Copying 2 resources to META-INF
[INFO] Copying 3 resources
[INFO] Copying 3 resources
[INFO] 
[INFO] --- maven-compiler-plugin:3.1:compile (default-compile) @ curator-framework ---
[INFO] Nothing to compile - all classes are up to date
[WARNING] Failed to getClass for org.codehaus.mojo.clirr.ClirrCheckMojo
[CHECKSTYLE] No report found for mojo check[INFO] 
[INFO] <<< clirr-maven-plugin:2.6.1:check (default) < compile @ curator-framework
<<<

[INFO] 
[INFO] --- clirr-maven-plugin:2.6.1:check (default) @ curator-framework ---
[INFO] artifact org.apache.curator:curator-framework: checking for updates from Nexus
[INFO] artifact org.apache.curator:curator-framework: checking for updates from central
[INFO] Comparing to version: 2.10.0
[INFO] Downloading: https://repo.maven.apache.org/maven2/org/apache/curator/curator-framework/2.10.0/curator-framework-2.10.0.jar
[INFO] Downloaded: https://repo.maven.apache.org/maven2/org/apache/curator/curator-framework/2.10.0/curator-framework-2.10.0.jar
(191 KB at 2009.0 KB/sec)
[INFO] Downloading: https://repo.maven.apache.org/maven2/org/apache/curator/curator-framework/2.10.0/curator-framework-2.10.0.pom
[INFO] Downloaded: https://repo.maven.apache.org/maven2/org/apache/curator/curator-framework/2.10.0/curator-framework-2.10.0.pom
(3 KB at 42.0 KB/sec)
[ERROR] 7006: org.apache.curator.framework.imps.SyncBuilderImpl: Return type of method 'public
org.apache.curator.framework.api.Pathable inBackground()' has been changed to org.apache.curator.framework.api.ErrorListenerPathable
[ERROR] 7006: org.apache.curator.framework.imps.SyncBuilderImpl: Return type of method 'public
org.apache.curator.framework.api.Pathable inBackground(java.lang.Object)' has been changed
to org.apache.curator.framework.api.ErrorListenerPathable
[ERROR] 7006: org.apache.curator.framework.imps.SyncBuilderImpl: Return type of method 'public
org.apache.curator.framework.api.Pathable inBackground(org.apache.curator.framework.api.BackgroundCallback)'
has been changed to org.apache.curator.framework.api.ErrorListenerPathable
[ERROR] 7006: org.apache.curator.framework.imps.SyncBuilderImpl: Return type of method 'public
org.apache.curator.framework.api.Pathable inBackground(org.apache.curator.framework.api.BackgroundCallback,
java.lang.Object)' has been changed to org.apache.curator.framework.api.ErrorListenerPathable
[ERROR] 7006: org.apache.curator.framework.imps.SyncBuilderImpl: Return type of method 'public
org.apache.curator.framework.api.Pathable inBackground(org.apache.curator.framework.api.BackgroundCallback,
java.util.concurrent.Executor)' has been changed to org.apache.curator.framework.api.ErrorListenerPathable
[ERROR] 7006: org.apache.curator.framework.imps.SyncBuilderImpl: Return type of method 'public
org.apache.curator.framework.api.Pathable inBackground(org.apache.curator.framework.api.BackgroundCallback,
java.lang.Object, java.util.concurrent.Executor)' has been changed to org.apache.curator.framework.api.ErrorListenerPathable
[INFO] Succeeded with 6 errors; 0 warnings; and 0 other changes.
[CHECKSTYLE] No report found for mojo check
[INFO] 
[INFO] --- maven-bundle-plugin:2.3.7:manifest (bundle-manifest) @ curator-framework ---
[INFO] 
[INFO] --- maven-resources-plugin:2.6:testResources (default-testResources) @ curator-framework
---
[INFO] Using 'UTF-8' encoding to copy filtered resources.
[INFO] Copying 1 resource
[INFO] Copying 3 resources
[INFO] 
[INFO] --- maven-compiler-plugin:3.1:testCompile (default-testCompile) @ curator-framework
---
[INFO] Changes detected - recompiling the module!
[INFO] Compiling 16 source files to <https://builds.apache.org/job/Curator/ws/curator-framework/target/test-classes>
[INFO] 
[INFO] --- maven-surefire-plugin:2.17:test (default-test) @ curator-framework ---
[INFO] Surefire report directory: <https://builds.apache.org/job/Curator/ws/curator-framework/target/surefire-reports>

-------------------------------------------------------
 T E S T S
-------------------------------------------------------

-------------------------------------------------------
 T E S T S
-------------------------------------------------------
Running org.apache.curator.framework.imps.TestWithCluster
Tests run: 2, Failures: 0, Errors: 0, Skipped: 0, Time elapsed: 180.193 sec - in org.apache.curator.framework.imps.TestWithCluster
Running org.apache.curator.framework.imps.TestFailedDeleteManager
Tests run: 6, Failures: 0, Errors: 0, Skipped: 0, Time elapsed: 342.253 sec - in org.apache.curator.framework.imps.TestFailedDeleteManager
Running org.apache.curator.framework.imps.TestMultiClient
Tests run: 1, Failures: 0, Errors: 0, Skipped: 0, Time elapsed: 1.996 sec - in org.apache.curator.framework.imps.TestMultiClient
Running org.apache.curator.framework.imps.TestFramework
Tests run: 31, Failures: 0, Errors: 0, Skipped: 0, Time elapsed: 87.679 sec - in org.apache.curator.framework.imps.TestFramework
Running org.apache.curator.framework.imps.TestEnsureContainers
Tests run: 2, Failures: 0, Errors: 0, Skipped: 0, Time elapsed: 3.089 sec - in org.apache.curator.framework.imps.TestEnsureContainers
Running org.apache.curator.framework.imps.TestNamespaceFacade
Tests run: 8, Failures: 0, Errors: 0, Skipped: 0, Time elapsed: 9.211 sec - in org.apache.curator.framework.imps.TestNamespaceFacade
Running org.apache.curator.framework.imps.TestFrameworkEdges
Tests run: 14, Failures: 0, Errors: 0, Skipped: 0, Time elapsed: 153.69 sec - in org.apache.curator.framework.imps.TestFrameworkEdges
Running org.apache.curator.framework.imps.TestWatcherIdentity
Tests run: 4, Failures: 0, Errors: 0, Skipped: 0, Time elapsed: 40.245 sec - in org.apache.curator.framework.imps.TestWatcherIdentity
Running org.apache.curator.framework.imps.TestCompressionInTransaction
Tests run: 4, Failures: 0, Errors: 0, Skipped: 0, Time elapsed: 5.068 sec - in org.apache.curator.framework.imps.TestCompressionInTransaction
Running org.apache.curator.framework.imps.TestNeverConnected
Tests run: 1, Failures: 0, Errors: 0, Skipped: 0, Time elapsed: 3.544 sec - in org.apache.curator.framework.imps.TestNeverConnected
Running org.apache.curator.framework.imps.TestCompression
Tests run: 3, Failures: 0, Errors: 0, Skipped: 0, Time elapsed: 4.033 sec - in org.apache.curator.framework.imps.TestCompression
Running org.apache.curator.framework.imps.TestReadOnly
Tests run: 2, Failures: 0, Errors: 0, Skipped: 0, Time elapsed: 67.743 sec - in org.apache.curator.framework.imps.TestReadOnly
Running org.apache.curator.framework.imps.TestTempFramework
Tests run: 2, Failures: 0, Errors: 0, Skipped: 0, Time elapsed: 4.99 sec - in org.apache.curator.framework.imps.TestTempFramework
Running org.apache.curator.framework.imps.TestFrameworkBackground
Tests run: 6, Failures: 0, Errors: 0, Skipped: 0, Time elapsed: 32.671 sec - in org.apache.curator.framework.imps.TestFrameworkBackground
Running org.apache.curator.framework.imps.TestTransactions
Tests run: 4, Failures: 0, Errors: 0, Skipped: 0, Time elapsed: 5.113 sec - in org.apache.curator.framework.imps.TestTransactions
Running org.apache.curator.framework.imps.TestBlockUntilConnected
Tests run: 6, Failures: 0, Errors: 0, Skipped: 0, Time elapsed: 32.48 sec - in org.apache.curator.framework.imps.TestBlockUntilConnected

Results :

Tests run: 96, Failures: 0, Errors: 0, Skipped: 0

[JENKINS] Recording test results
[INFO] 
[INFO] --- maven-bundle-plugin:2.3.7:bundle (default-bundle) @ curator-framework ---
[INFO] 
[INFO] --- maven-site-plugin:3.4:attach-descriptor (attach-descriptor) @ curator-framework
---
[INFO] 
[INFO] --- maven-license-plugin:1.9.0:check (license) @ curator-framework ---
[INFO] Checking licenses...
[INFO] Missing header in: <https://builds.apache.org/job/Curator/ws/curator-framework/src/main/java/org/apache/curator/framework/api/ErrorListenerPathable.java>
[INFO] Missing header in: <https://builds.apache.org/job/Curator/ws/curator-framework/src/main/java/org/apache/curator/framework/api/ErrorListenerPathAndBytesable.java>
[CHECKSTYLE] No report found for mojo check
[INFO] ------------------------------------------------------------------------
[INFO] Reactor Summary:
[INFO] 
[INFO] Apache Curator ..................................... SUCCESS [ 14.161 s]
[INFO] Curator Testing .................................... SUCCESS [  9.370 s]
[INFO] Curator Client ..................................... SUCCESS [01:12 min]
[INFO] Curator Framework .................................. FAILURE [16:26 min]
[INFO] Curator Recipes .................................... SKIPPED
[INFO] Curator Service Discovery .......................... SKIPPED
[INFO] Curator Examples ................................... SKIPPED
[INFO] Curator Service Discovery Server ................... SKIPPED
[INFO] Curator RPC Proxy .................................. SKIPPED
[INFO] ------------------------------------------------------------------------
[INFO] BUILD FAILURE
[INFO] ------------------------------------------------------------------------
[INFO] Total time: 18:15 min
[INFO] Finished at: 2016-03-10T23:27:34+00:00
[INFO] Final Memory: 26M/239M
[INFO] ------------------------------------------------------------------------
[ERROR] Failed to execute goal com.mycila.maven-license-plugin:maven-license-plugin:1.9.0:check
(license) on project curator-framework: Some files do not have the expected license header
-> [Help 1]
[ERROR] 
[ERROR] To see the full stack trace of the errors, re-run Maven with the -e switch.
[ERROR] Re-run Maven using the -X switch to enable full debug logging.
[ERROR] 
[ERROR] For more information about the errors and possible solutions, please read the following
articles:
[ERROR] [Help 1] http://cwiki.apache.org/confluence/display/MAVEN/MojoExecutionException
[ERROR] 
[ERROR] After correcting the problems, you can resume the build with the command
[ERROR]   mvn <goals> -rf :curator-framework
[JENKINS] Archiving <https://builds.apache.org/job/Curator/ws/curator-x-rpc/pom.xml>
to org.apache.curator/curator-x-rpc/2.10.1-SNAPSHOT/curator-x-rpc-2.10.1-SNAPSHOT.pom
[JENKINS] Archiving <https://builds.apache.org/job/Curator/ws/curator-client/pom.xml>
to org.apache.curator/curator-client/2.10.1-SNAPSHOT/curator-client-2.10.1-SNAPSHOT.pom
[JENKINS] Archiving <https://builds.apache.org/job/Curator/ws/curator-client/target/curator-client-2.10.1-SNAPSHOT.jar>
to org.apache.curator/curator-client/2.10.1-SNAPSHOT/curator-client-2.10.1-SNAPSHOT.jar
[JENKINS] Archiving <https://builds.apache.org/job/Curator/ws/curator-framework/pom.xml>
to org.apache.curator/curator-framework/2.10.1-SNAPSHOT/curator-framework-2.10.1-SNAPSHOT.pom
[JENKINS] Archiving <https://builds.apache.org/job/Curator/ws/curator-framework/target/curator-framework-2.10.1-SNAPSHOT.jar>
to org.apache.curator/curator-framework/2.10.1-SNAPSHOT/curator-framework-2.10.1-SNAPSHOT.jar
[JENKINS] Archiving <https://builds.apache.org/job/Curator/ws/curator-x-discovery-server/pom.xml>
to org.apache.curator/curator-x-discovery-server/2.10.1-SNAPSHOT/curator-x-discovery-server-2.10.1-SNAPSHOT.pom
[JENKINS] Archiving <https://builds.apache.org/job/Curator/ws/curator-examples/pom.xml>
to org.apache.curator/curator-examples/2.10.1-SNAPSHOT/curator-examples-2.10.1-SNAPSHOT.pom
[JENKINS] Archiving <https://builds.apache.org/job/Curator/ws/curator-test/pom.xml>
to org.apache.curator/curator-test/2.10.1-SNAPSHOT/curator-test-2.10.1-SNAPSHOT.pom
[JENKINS] Archiving <https://builds.apache.org/job/Curator/ws/curator-test/target/curator-test-2.10.1-SNAPSHOT.jar>
to org.apache.curator/curator-test/2.10.1-SNAPSHOT/curator-test-2.10.1-SNAPSHOT.jar
[JENKINS] Archiving <https://builds.apache.org/job/Curator/ws/curator-recipes/pom.xml>
to org.apache.curator/curator-recipes/2.10.1-SNAPSHOT/curator-recipes-2.10.1-SNAPSHOT.pom
[JENKINS] Archiving <https://builds.apache.org/job/Curator/ws/pom.xml> to org.apache.curator/apache-curator/2.10.1-SNAPSHOT/apache-curator-2.10.1-SNAPSHOT.pom
[JENKINS] Archiving <https://builds.apache.org/job/Curator/ws/target/apache-curator-2.10.1-SNAPSHOT-site.xml>
to org.apache.curator/apache-curator/2.10.1-SNAPSHOT/apache-curator-2.10.1-SNAPSHOT-site.xml
Compressed 35.22 KB of artifacts by 90.9% relative to #969
[JENKINS] Archiving <https://builds.apache.org/job/Curator/ws/curator-x-discovery/pom.xml>
to org.apache.curator/curator-x-discovery/2.10.1-SNAPSHOT/curator-x-discovery-2.10.1-SNAPSHOT.pom
Sending e-mails to: dev@curator.apache.org
channel stopped

Mime
View raw message