curator-dev mailing list archives

Site index · List index
Message view « Date » · « Thread »
Top « Date » · « Thread »
From Apache Jenkins Server <jenk...@builds.apache.org>
Subject Build failed in Jenkins: Curator-3.0 #46
Date Mon, 11 Jan 2016 00:50:56 GMT
See <https://builds.apache.org/job/Curator-3.0/46/changes>

Changes:

[cammckenzie] [maven-release-plugin] prepare release apache-curator-2.9.1-SNAPSHOT

[cammckenzie] [maven-release-plugin] prepare for next development iteration

[cammckenzie] [maven-release-plugin] prepare release apache-curator-2.9.1

[cammckenzie] [maven-release-plugin] prepare for next development iteration

[cammckenzie] Back to 2.9.1-SNAPSHOT

[randgalt] Moved findAndDeleteProtectedNodeInBackground code into separate

[randgalt] Don't queue background operation if the client is closed

[randgalt] oops - bad commit for this file

------------------------------------------
[...truncated 103 lines...]
[WARNING] Failed to getClass for org.codehaus.mojo.clirr.ClirrCheckMojo
[CHECKSTYLE] No report found for mojo check[INFO] 
[INFO] <<< clirr-maven-plugin:2.6.1:check (default) < compile @ curator-test <<<
[INFO] 
[INFO] --- clirr-maven-plugin:2.6.1:check (default) @ curator-test ---

[INFO] artifact org.apache.curator:curator-test: checking for updates from Nexus
[INFO] artifact org.apache.curator:curator-test: checking for updates from central
[INFO] Comparing to version: 3.0.0
[INFO] Downloading: https://repo.maven.apache.org/maven2/org/apache/curator/curator-test/3.0.0/curator-test-3.0.0.jar
[INFO] Downloaded: https://repo.maven.apache.org/maven2/org/apache/curator/curator-test/3.0.0/curator-test-3.0.0.jar
(43 KB at 284.7 KB/sec)
[INFO] Downloading: https://repo.maven.apache.org/maven2/org/apache/curator/curator-test/3.0.0/curator-test-3.0.0.pom
[INFO] Downloaded: https://repo.maven.apache.org/maven2/org/apache/curator/curator-test/3.0.0/curator-test-3.0.0.pom
(3 KB at 29.8 KB/sec)
[INFO] Downloading: https://repo.maven.apache.org/maven2/org/apache/curator/apache-curator/3.0.0/apache-curator-3.0.0.pom
[INFO] Downloaded: https://repo.maven.apache.org/maven2/org/apache/curator/apache-curator/3.0.0/apache-curator-3.0.0.pom
(30 KB at 395.0 KB/sec)
[INFO] Succeeded with 0 errors; 0 warnings; and 0 other changes.
[CHECKSTYLE] No report found for mojo check[INFO] 
[INFO] --- maven-bundle-plugin:2.3.7:manifest (bundle-manifest) @ curator-test ---

[INFO] 
[INFO] --- maven-resources-plugin:2.7:testResources (default-testResources) @ curator-test
---
[INFO] Using 'UTF-8' encoding to copy filtered resources.
[INFO] skip non existing resourceDirectory <https://builds.apache.org/job/Curator-3.0/ws/curator-test/src/test/resources>
[INFO] Copying 3 resources
[INFO] 
[INFO] --- maven-compiler-plugin:3.2:testCompile (default-testCompile) @ curator-test ---
[INFO] No sources to compile
[INFO] 
[INFO] --- maven-surefire-plugin:2.18.1:test (default-test) @ curator-test ---
[JENKINS] Recording test results
[INFO] 
[INFO] --- maven-jar-plugin:2.5:jar (default-jar) @ curator-test ---
[INFO] Building jar: <https://builds.apache.org/job/Curator-3.0/ws/curator-test/target/curator-test-3.0.1-SNAPSHOT.jar>
[INFO] 
[INFO] --- maven-site-plugin:3.4:attach-descriptor (attach-descriptor) @ curator-test ---
[INFO] 
[INFO] --- maven-license-plugin:1.9.0:check (license) @ curator-test ---
[INFO] Checking licenses...
[CHECKSTYLE] No report found for mojo check
[INFO]                                                                         
[INFO] ------------------------------------------------------------------------
[INFO] Building Curator Client 3.0.1-SNAPSHOT
[INFO] ------------------------------------------------------------------------
[INFO] 
[INFO] --- maven-clean-plugin:2.5:clean (default-clean) @ curator-client ---
[INFO] 
[INFO] --- maven-remote-resources-plugin:1.5:process (default) @ curator-client ---
[INFO] 
[INFO] --- maven-resources-plugin:2.7:resources (default-resources) @ curator-client ---
[INFO] Using 'UTF-8' encoding to copy filtered resources.
[INFO] Copying 2 resources to META-INF
[INFO] Copying 3 resources
[INFO] 
[INFO] --- maven-compiler-plugin:3.2:compile (default-compile) @ curator-client ---
[INFO] Changes detected - recompiling the module!
[INFO] Compiling 38 source files to <https://builds.apache.org/job/Curator-3.0/ws/curator-client/target/classes>
[INFO] 
[INFO] >>> clirr-maven-plugin:2.6.1:check (default) > compile @ curator-client
>>>
[INFO] 
[INFO] --- maven-remote-resources-plugin:1.5:process (default) @ curator-client ---
[INFO] 
[INFO] --- maven-resources-plugin:2.7:resources (default-resources) @ curator-client ---
[INFO] Using 'UTF-8' encoding to copy filtered resources.
[INFO] Copying 2 resources to META-INF
[INFO] Copying 3 resources
[INFO] Copying 3 resources
[INFO] 
[INFO] --- maven-compiler-plugin:3.2:compile (default-compile) @ curator-client ---
[INFO] Nothing to compile - all classes are up to date
[WARNING] Failed to getClass for org.codehaus.mojo.clirr.ClirrCheckMojo
[CHECKSTYLE] No report found for mojo check[INFO] 
[INFO] <<< clirr-maven-plugin:2.6.1:check (default) < compile @ curator-client
<<<
[INFO] 
[INFO] --- clirr-maven-plugin:2.6.1:check (default) @ curator-client ---

[INFO] artifact org.apache.curator:curator-client: checking for updates from Nexus
[INFO] artifact org.apache.curator:curator-client: checking for updates from central
[INFO] Comparing to version: 3.0.0
[INFO] Downloading: https://repo.maven.apache.org/maven2/org/apache/curator/curator-client/3.0.0/curator-client-3.0.0.jar
[INFO] Downloaded: https://repo.maven.apache.org/maven2/org/apache/curator/curator-client/3.0.0/curator-client-3.0.0.jar
(78 KB at 659.4 KB/sec)
[INFO] Downloading: https://repo.maven.apache.org/maven2/org/apache/curator/curator-client/3.0.0/curator-client-3.0.0.pom
[INFO] Downloaded: https://repo.maven.apache.org/maven2/org/apache/curator/curator-client/3.0.0/curator-client-3.0.0.pom
(3 KB at 38.4 KB/sec)
[INFO] Succeeded with 0 errors; 0 warnings; and 0 other changes.
[CHECKSTYLE] No report found for mojo check[INFO] 
[INFO] --- maven-bundle-plugin:2.3.7:manifest (bundle-manifest) @ curator-client ---

[INFO] 
[INFO] --- maven-resources-plugin:2.7:testResources (default-testResources) @ curator-client
---
[INFO] Using 'UTF-8' encoding to copy filtered resources.
[INFO] Copying 1 resource
[INFO] Copying 3 resources
[INFO] 
[INFO] --- maven-compiler-plugin:3.2:testCompile (default-testCompile) @ curator-client ---
[INFO] Changes detected - recompiling the module!
[INFO] Compiling 8 source files to <https://builds.apache.org/job/Curator-3.0/ws/curator-client/target/test-classes>
[INFO] <https://builds.apache.org/job/Curator-3.0/ws/curator-client/src/test/java/org/apache/curator/TestEnsurePath.java>:
Some input files use or override a deprecated API.
[INFO] <https://builds.apache.org/job/Curator-3.0/ws/curator-client/src/test/java/org/apache/curator/TestEnsurePath.java>:
Recompile with -Xlint:deprecation for details.
[INFO] 
[INFO] --- maven-surefire-plugin:2.18.1:test (default-test) @ curator-client ---
[INFO] Surefire report directory: <https://builds.apache.org/job/Curator-3.0/ws/curator-client/target/surefire-reports>

-------------------------------------------------------
 T E S T S
-------------------------------------------------------
Running org.apache.curator.TestSessionFailRetryLoop
Tests run: 8, Failures: 0, Errors: 0, Skipped: 0, Time elapsed: 15.932 sec - in org.apache.curator.TestSessionFailRetryLoop
Running org.apache.curator.ensemble.exhibitor.TestExhibitorEnsembleProvider
Tests run: 6, Failures: 0, Errors: 0, Skipped: 0, Time elapsed: 2.506 sec - in org.apache.curator.ensemble.exhibitor.TestExhibitorEnsembleProvider
Running org.apache.curator.utils.TestZKPaths
Tests run: 2, Failures: 0, Errors: 0, Skipped: 0, Time elapsed: 0.437 sec - in org.apache.curator.utils.TestZKPaths
Running org.apache.curator.utils.TestCloseableScheduledExecutorService
Tests run: 2, Failures: 0, Errors: 0, Skipped: 0, Time elapsed: 2.492 sec - in org.apache.curator.utils.TestCloseableScheduledExecutorService
Running org.apache.curator.utils.TestCloseableExecutorService
Tests run: 5, Failures: 0, Errors: 0, Skipped: 0, Time elapsed: 0.557 sec - in org.apache.curator.utils.TestCloseableExecutorService
Running org.apache.curator.TestRetryLoop
Tests run: 8, Failures: 0, Errors: 0, Skipped: 0, Time elapsed: 19.332 sec - in org.apache.curator.TestRetryLoop
Running org.apache.curator.TestEnsurePath
Tests run: 2, Failures: 0, Errors: 0, Skipped: 0, Time elapsed: 0.693 sec - in org.apache.curator.TestEnsurePath

Results :

Tests run: 33, Failures: 0, Errors: 0, Skipped: 0

[JENKINS] Recording test results
log4j:WARN No appenders could be found for logger (org.apache.commons.beanutils.converters.BooleanConverter).
log4j:WARN Please initialize the log4j system properly.
[INFO] 
[INFO] --- maven-bundle-plugin:2.3.7:bundle (default-bundle) @ curator-client ---
[INFO] 
[INFO] --- maven-site-plugin:3.4:attach-descriptor (attach-descriptor) @ curator-client ---
[INFO] 
[INFO] --- maven-license-plugin:1.9.0:check (license) @ curator-client ---
[INFO] Checking licenses...
[CHECKSTYLE] No report found for mojo check
[INFO]                                                                         
[INFO] ------------------------------------------------------------------------
[INFO] Building Curator Framework 3.0.1-SNAPSHOT
[INFO] ------------------------------------------------------------------------
[INFO] 
[INFO] --- maven-clean-plugin:2.5:clean (default-clean) @ curator-framework ---
[INFO] 
[INFO] --- maven-remote-resources-plugin:1.5:process (default) @ curator-framework ---
[INFO] 
[INFO] --- maven-resources-plugin:2.7:resources (default-resources) @ curator-framework ---
[INFO] Using 'UTF-8' encoding to copy filtered resources.
[INFO] Copying 2 resources to META-INF
[INFO] Copying 3 resources
[INFO] 
[INFO] --- maven-compiler-plugin:3.2:compile (default-compile) @ curator-framework ---
[INFO] Changes detected - recompiling the module!
[INFO] Compiling 149 source files to <https://builds.apache.org/job/Curator-3.0/ws/curator-framework/target/classes>
[INFO] <https://builds.apache.org/job/Curator-3.0/ws/curator-framework/src/main/java/org/apache/curator/framework/imps/CuratorTempFrameworkImpl.java>:
Some input files use or override a deprecated API.
[INFO] <https://builds.apache.org/job/Curator-3.0/ws/curator-framework/src/main/java/org/apache/curator/framework/imps/CuratorTempFrameworkImpl.java>:
Recompile with -Xlint:deprecation for details.
[INFO] -------------------------------------------------------------
[ERROR] COMPILATION ERROR : 
[INFO] -------------------------------------------------------------
[ERROR] <https://builds.apache.org/job/Curator-3.0/ws/curator-framework/src/main/java/org/apache/curator/framework/imps/FindAndDeleteProtectedNodeInBackground.java>:[100,46]
constructor CuratorEventImpl in class org.apache.curator.framework.imps.CuratorEventImpl cannot
be applied to given types;
  required: org.apache.curator.framework.imps.CuratorFrameworkImpl,org.apache.curator.framework.api.CuratorEventType,int,java.lang.String,java.lang.String,java.lang.Object,org.apache.zookeeper.data.Stat,byte[],java.util.List<java.lang.String>,org.apache.zookeeper.WatchedEvent,java.util.List<org.apache.zookeeper.data.ACL>,java.util.List<org.apache.curator.framework.api.transaction.CuratorTransactionResult>
  found: org.apache.curator.framework.imps.CuratorFrameworkImpl,org.apache.curator.framework.api.CuratorEventType,int,java.lang.String,<nulltype>,java.lang.Object,org.apache.zookeeper.data.Stat,<nulltype>,java.util.List<java.lang.String>,<nulltype>,<nulltype>
  reason: actual and formal argument lists differ in length
[INFO] 1 error
[INFO] -------------------------------------------------------------
[INFO]                                                                         
[INFO] ------------------------------------------------------------------------
[INFO] Building Curator Recipes 3.0.1-SNAPSHOT
[INFO] ------------------------------------------------------------------------
[INFO] Downloading: http://repository.apache.org/snapshots/org/apache/curator/curator-framework/3.0.1-SNAPSHOT/maven-metadata.xml
[INFO] Downloading: http://repository.apache.org/snapshots/org/apache/curator/curator-framework/3.0.1-SNAPSHOT/curator-framework-3.0.1-SNAPSHOT.jar
[INFO]                                                                         
[INFO] ------------------------------------------------------------------------
[INFO] Building Curator Service Discovery 3.0.1-SNAPSHOT
[INFO] ------------------------------------------------------------------------
[INFO] Downloading: http://repository.apache.org/snapshots/org/apache/curator/curator-recipes/3.0.1-SNAPSHOT/maven-metadata.xml
[INFO] Downloading: http://repository.apache.org/snapshots/org/apache/curator/curator-recipes/3.0.1-SNAPSHOT/curator-recipes-3.0.1-SNAPSHOT.jar
[INFO]                                                                         
[INFO] ------------------------------------------------------------------------
[INFO] Building Curator Examples 3.0.1-SNAPSHOT
[INFO] ------------------------------------------------------------------------
[INFO] Downloading: http://repository.apache.org/snapshots/org/apache/curator/curator-x-discovery/3.0.1-SNAPSHOT/maven-metadata.xml
[INFO] Downloading: http://repository.apache.org/snapshots/org/apache/curator/curator-x-discovery/3.0.1-SNAPSHOT/curator-x-discovery-3.0.1-SNAPSHOT.jar
[INFO]                                                                         
[INFO] ------------------------------------------------------------------------
[INFO] Building Curator Service Discovery Server 3.0.1-SNAPSHOT
[INFO] ------------------------------------------------------------------------
[INFO]                                                                         
[INFO] ------------------------------------------------------------------------
[INFO] Building Curator RPC Proxy 3.0.1-SNAPSHOT
[INFO] ------------------------------------------------------------------------
[INFO] ------------------------------------------------------------------------
[INFO] Reactor Summary:
[INFO] 
[INFO] Apache Curator ..................................... SUCCESS [  4.459 s]
[INFO] Curator Testing .................................... SUCCESS [  6.624 s]
[INFO] Curator Client ..................................... SUCCESS [ 54.086 s]
[INFO] Curator Framework .................................. FAILURE [  1.608 s]
[INFO] Curator Recipes .................................... FAILURE [  0.261 s]
[INFO] Curator Service Discovery .......................... FAILURE [  0.216 s]
[INFO] Curator Examples ................................... FAILURE [  0.164 s]
[INFO] Curator Service Discovery Server ................... FAILURE [  0.227 s]
[INFO] Curator RPC Proxy .................................. FAILURE [  0.751 s]
[INFO] ------------------------------------------------------------------------
[INFO] BUILD FAILURE
[INFO] ------------------------------------------------------------------------
[INFO] Total time: 01:14 min
[INFO] Finished at: 2016-01-11T00:50:53+00:00
[INFO] Final Memory: 39M/437M
[INFO] ------------------------------------------------------------------------
[ERROR] Failed to execute goal org.apache.maven.plugins:maven-compiler-plugin:3.2:compile
(default-compile) on project curator-framework: Compilation failure
[ERROR] <https://builds.apache.org/job/Curator-3.0/ws/curator-framework/src/main/java/org/apache/curator/framework/imps/FindAndDeleteProtectedNodeInBackground.java>:[100,46]
constructor CuratorEventImpl in class org.apache.curator.framework.imps.CuratorEventImpl cannot
be applied to given types;
[ERROR] required: org.apache.curator.framework.imps.CuratorFrameworkImpl,org.apache.curator.framework.api.CuratorEventType,int,java.lang.String,java.lang.String,java.lang.Object,org.apache.zookeeper.data.Stat,byte[],java.util.List<java.lang.String>,org.apache.zookeeper.WatchedEvent,java.util.List<org.apache.zookeeper.data.ACL>,java.util.List<org.apache.curator.framework.api.transaction.CuratorTransactionResult>
[ERROR] found: org.apache.curator.framework.imps.CuratorFrameworkImpl,org.apache.curator.framework.api.CuratorEventType,int,java.lang.String,<nulltype>,java.lang.Object,org.apache.zookeeper.data.Stat,<nulltype>,java.util.List<java.lang.String>,<nulltype>,<nulltype>
[ERROR] reason: actual and formal argument lists differ in length
[ERROR] -> [Help 1]
[ERROR] Failed to execute goal on project curator-recipes: Could not resolve dependencies
for project org.apache.curator:curator-recipes:bundle:3.0.1-SNAPSHOT: Could not find artifact
org.apache.curator:curator-framework:jar:3.0.1-SNAPSHOT in Nexus (http://repository.apache.org/snapshots)
-> [Help 2]
[ERROR] Failed to execute goal on project curator-x-discovery: Could not resolve dependencies
for project org.apache.curator:curator-x-discovery:bundle:3.0.1-SNAPSHOT: The following artifacts
could not be resolved: org.apache.curator:curator-recipes:jar:3.0.1-SNAPSHOT, org.apache.curator:curator-framework:jar:3.0.1-SNAPSHOT:
Could not find artifact org.apache.curator:curator-recipes:jar:3.0.1-SNAPSHOT in Nexus (http://repository.apache.org/snapshots)
-> [Help 2]
[ERROR] Failed to execute goal on project curator-examples: Could not resolve dependencies
for project org.apache.curator:curator-examples:jar:3.0.1-SNAPSHOT: The following artifacts
could not be resolved: org.apache.curator:curator-recipes:jar:3.0.1-SNAPSHOT, org.apache.curator:curator-framework:jar:3.0.1-SNAPSHOT,
org.apache.curator:curator-x-discovery:jar:3.0.1-SNAPSHOT: Failure to find org.apache.curator:curator-recipes:jar:3.0.1-SNAPSHOT
in http://repository.apache.org/snapshots was cached in the local repository, resolution will
not be reattempted until the update interval of Nexus has elapsed or updates are forced ->
[Help 2]
[ERROR] Failed to execute goal on project curator-x-discovery-server: Could not resolve dependencies
for project org.apache.curator:curator-x-discovery-server:bundle:3.0.1-SNAPSHOT: The following
artifacts could not be resolved: org.apache.curator:curator-x-discovery:jar:3.0.1-SNAPSHOT,
org.apache.curator:curator-recipes:jar:3.0.1-SNAPSHOT, org.apache.curator:curator-framework:jar:3.0.1-SNAPSHOT:
Failure to find org.apache.curator:curator-x-discovery:jar:3.0.1-SNAPSHOT in http://repository.apache.org/snapshots
was cached in the local repository, resolution will not be reattempted until the update interval
of Nexus has elapsed or updates are forced -> [Help 2]
[ERROR] Failed to execute goal on project curator-x-rpc: Could not resolve dependencies for
project org.apache.curator:curator-x-rpc:jar:3.0.1-SNAPSHOT: The following artifacts could
not be resolved: org.apache.curator:curator-recipes:jar:3.0.1-SNAPSHOT, org.apache.curator:curator-framework:jar:3.0.1-SNAPSHOT,
org.apache.curator:curator-x-discovery:jar:3.0.1-SNAPSHOT: Failure to find org.apache.curator:curator-recipes:jar:3.0.1-SNAPSHOT
in http://repository.apache.org/snapshots was cached in the local repository, resolution will
not be reattempted until the update interval of Nexus has elapsed or updates are forced ->
[Help 2]
[ERROR] 
[ERROR] To see the full stack trace of the errors, re-run Maven with the -e switch.
[ERROR] Re-run Maven using the -X switch to enable full debug logging.
[ERROR] 
[ERROR] For more information about the errors and possible solutions, please read the following
articles:
[ERROR] [Help 1] http://cwiki.apache.org/confluence/display/MAVEN/MojoFailureException
[ERROR] [Help 2] http://cwiki.apache.org/confluence/display/MAVEN/DependencyResolutionException
[ERROR] 
[ERROR] After correcting the problems, you can resume the build with the command
[ERROR]   mvn <goals> -rf :curator-framework
[INFO] Build failures were ignored.
[JENKINS] Archiving <https://builds.apache.org/job/Curator-3.0/ws/curator-x-rpc/pom.xml>
to org.apache.curator/curator-x-rpc/3.0.1-SNAPSHOT/curator-x-rpc-3.0.1-SNAPSHOT.pom
[JENKINS] Archiving <https://builds.apache.org/job/Curator-3.0/ws/curator-client/pom.xml>
to org.apache.curator/curator-client/3.0.1-SNAPSHOT/curator-client-3.0.1-SNAPSHOT.pom
[JENKINS] Archiving <https://builds.apache.org/job/Curator-3.0/ws/curator-client/target/curator-client-3.0.1-SNAPSHOT.jar>
to org.apache.curator/curator-client/3.0.1-SNAPSHOT/curator-client-3.0.1-SNAPSHOT.jar
[JENKINS] Archiving <https://builds.apache.org/job/Curator-3.0/ws/curator-framework/pom.xml>
to org.apache.curator/curator-framework/3.0.1-SNAPSHOT/curator-framework-3.0.1-SNAPSHOT.pom
[JENKINS] Archiving <https://builds.apache.org/job/Curator-3.0/ws/curator-x-discovery-server/pom.xml>
to org.apache.curator/curator-x-discovery-server/3.0.1-SNAPSHOT/curator-x-discovery-server-3.0.1-SNAPSHOT.pom
[JENKINS] Archiving <https://builds.apache.org/job/Curator-3.0/ws/curator-examples/pom.xml>
to org.apache.curator/curator-examples/3.0.1-SNAPSHOT/curator-examples-3.0.1-SNAPSHOT.pom
[JENKINS] Archiving <https://builds.apache.org/job/Curator-3.0/ws/curator-test/pom.xml>
to org.apache.curator/curator-test/3.0.1-SNAPSHOT/curator-test-3.0.1-SNAPSHOT.pom
[JENKINS] Archiving <https://builds.apache.org/job/Curator-3.0/ws/curator-test/target/curator-test-3.0.1-SNAPSHOT.jar>
to org.apache.curator/curator-test/3.0.1-SNAPSHOT/curator-test-3.0.1-SNAPSHOT.jar
[JENKINS] Archiving <https://builds.apache.org/job/Curator-3.0/ws/curator-recipes/pom.xml>
to org.apache.curator/curator-recipes/3.0.1-SNAPSHOT/curator-recipes-3.0.1-SNAPSHOT.pom
[JENKINS] Archiving <https://builds.apache.org/job/Curator-3.0/ws/pom.xml> to org.apache.curator/apache-curator/3.0.1-SNAPSHOT/apache-curator-3.0.1-SNAPSHOT.pom
[JENKINS] Archiving <https://builds.apache.org/job/Curator-3.0/ws/target/apache-curator-3.0.1-SNAPSHOT-site.xml>
to org.apache.curator/apache-curator/3.0.1-SNAPSHOT/apache-curator-3.0.1-SNAPSHOT-site.xml
Compressed 34.88 KB of artifacts by 91.7% relative to #45
[JENKINS] Archiving <https://builds.apache.org/job/Curator-3.0/ws/curator-x-discovery/pom.xml>
to org.apache.curator/curator-x-discovery/3.0.1-SNAPSHOT/curator-x-discovery-3.0.1-SNAPSHOT.pom
Sending e-mails to: dev@curator.apache.org
Sending e-mails to: dev@curator.apache.org
Sending e-mails to: dev@curator.apache.org
Sending e-mails to: dev@curator.apache.org
Sending e-mails to: dev@curator.apache.org
Sending e-mails to: dev@curator.apache.org
channel stopped

Mime
View raw message