curator-dev mailing list archives

Site index · List index
Message view « Date » · « Thread »
Top « Date » · « Thread »
From Apache Jenkins Server <jenk...@builds.apache.org>
Subject Build failed in Jenkins: Curator-3.0 » Curator RPC Proxy #38
Date Mon, 12 Oct 2015 01:07:12 GMT
See <https://builds.apache.org/job/Curator-3.0/org.apache.curator$curator-x-rpc/38/>

------------------------------------------
[INFO]                                                                         
[INFO] ------------------------------------------------------------------------
[INFO] Building Curator RPC Proxy 3.0.0-SNAPSHOT
[INFO] ------------------------------------------------------------------------
[INFO] 
[INFO] --- maven-clean-plugin:2.5:clean (default-clean) @ curator-x-rpc ---
[INFO] 
[INFO] --- maven-remote-resources-plugin:1.5:process (default) @ curator-x-rpc ---
[INFO] 
[INFO] --- maven-resources-plugin:2.7:resources (default-resources) @ curator-x-rpc ---
[INFO] Using 'UTF-8' encoding to copy filtered resources.
[INFO] Copying 1 resource
[INFO] Copying 1 resource
[INFO] Copying 3 resources
[INFO] 
[INFO] --- maven-compiler-plugin:3.2:compile (default-compile) @ curator-x-rpc ---
[INFO] Changes detected - recompiling the module!
[INFO] Compiling 63 source files to <https://builds.apache.org/job/Curator-3.0/org.apache.curator$curator-x-rpc/ws/target/classes>
[INFO] 
[INFO] >>> clirr-maven-plugin:2.6.1:check (default) > compile @ curator-x-rpc
>>>
[INFO] 
[INFO] --- maven-remote-resources-plugin:1.5:process (default) @ curator-x-rpc ---
[INFO] 
[INFO] --- maven-resources-plugin:2.7:resources (default-resources) @ curator-x-rpc ---
[INFO] Using 'UTF-8' encoding to copy filtered resources.
[INFO] Copying 1 resource
[INFO] Copying 1 resource
[INFO] Copying 3 resources
[INFO] Copying 3 resources
[INFO] 
[INFO] --- maven-compiler-plugin:3.2:compile (default-compile) @ curator-x-rpc ---
[INFO] Nothing to compile - all classes are up to date
[WARNING] Failed to getClass for org.codehaus.mojo.clirr.ClirrCheckMojo
[CHECKSTYLE] No report found for mojo check[INFO] 
[INFO] <<< clirr-maven-plugin:2.6.1:check (default) < compile @ curator-x-rpc
<<<
[INFO] 
[INFO] --- clirr-maven-plugin:2.6.1:check (default) @ curator-x-rpc ---
[INFO] Skipping execution

[CHECKSTYLE] No report found for mojo check[INFO] 
[INFO] --- maven-bundle-plugin:2.3.7:manifest (bundle-manifest) @ curator-x-rpc ---

[INFO] 
[INFO] --- maven-resources-plugin:2.7:testResources (default-testResources) @ curator-x-rpc
---
[INFO] Using 'UTF-8' encoding to copy filtered resources.
[INFO] Copying 4 resources
[INFO] Copying 3 resources
[INFO] 
[INFO] --- maven-compiler-plugin:3.2:testCompile (default-testCompile) @ curator-x-rpc ---
[INFO] Changes detected - recompiling the module!
[INFO] Compiling 52 source files to <https://builds.apache.org/job/Curator-3.0/org.apache.curator$curator-x-rpc/ws/target/test-classes>
[INFO] <https://builds.apache.org/job/Curator-3.0/org.apache.curator$curator-x-rpc/ws/src/test/java/org/apache/curator/generated/CuratorException.java>:
Some input files use unchecked or unsafe operations.
[INFO] <https://builds.apache.org/job/Curator-3.0/org.apache.curator$curator-x-rpc/ws/src/test/java/org/apache/curator/generated/CuratorException.java>:
Recompile with -Xlint:unchecked for details.
[INFO] 
[INFO] --- maven-surefire-plugin:2.18.1:test (default-test) @ curator-x-rpc ---
[INFO] Surefire report directory: <https://builds.apache.org/job/Curator-3.0/org.apache.curator$curator-x-rpc/ws/target/surefire-reports>

-------------------------------------------------------
 T E S T S
-------------------------------------------------------
Running org.apache.curator.x.rpc.TestClient
Tests run: 0, Failures: 0, Errors: 0, Skipped: 0, Time elapsed: 0.321 sec - in org.apache.curator.x.rpc.TestClient
Running org.apache.curator.x.rpc.TestServer
Tests run: 0, Failures: 0, Errors: 0, Skipped: 0, Time elapsed: 0.3 sec - in org.apache.curator.x.rpc.TestServer

Results :

Tests run: 0, Failures: 0, Errors: 0, Skipped: 0

[JENKINS] Recording test results
[INFO] 
[INFO] --- maven-jar-plugin:2.5:jar (default-jar) @ curator-x-rpc ---
[INFO] Building jar: <https://builds.apache.org/job/Curator-3.0/org.apache.curator$curator-x-rpc/ws/target/curator-x-rpc-3.0.0-SNAPSHOT.jar>
[INFO] 
[INFO] --- maven-site-plugin:3.4:attach-descriptor (attach-descriptor) @ curator-x-rpc ---
[INFO] 
[INFO] --- maven-shade-plugin:2.3:shade (default) @ curator-x-rpc ---
[INFO] Including org.apache.curator:curator-recipes:jar:3.0.0-SNAPSHOT in the shaded jar.
[INFO] Including org.apache.curator:curator-framework:jar:3.0.0-SNAPSHOT in the shaded jar.
[INFO] Including org.apache.curator:curator-client:jar:3.0.0-SNAPSHOT in the shaded jar.
[INFO] Including org.apache.curator:curator-x-discovery:jar:3.0.0-SNAPSHOT in the shaded jar.
[INFO] Including org.codehaus.jackson:jackson-mapper-asl:jar:1.9.13 in the shaded jar.
[INFO] Including org.codehaus.jackson:jackson-core-asl:jar:1.9.13 in the shaded jar.
[INFO] Including com.facebook.swift:swift-service:jar:0.12.0 in the shaded jar.
[INFO] Including com.facebook.swift:swift-annotations:jar:0.12.0 in the shaded jar.
[INFO] Including com.facebook.swift:swift-codec:jar:0.12.0 in the shaded jar.
[INFO] Including org.ow2.asm:asm-all:jar:4.1 in the shaded jar.
[INFO] Including com.thoughtworks.paranamer:paranamer:jar:2.5.2 in the shaded jar.
[INFO] Including org.apache.thrift:libthrift:jar:0.9.1 in the shaded jar.
[INFO] Including org.apache.commons:commons-lang3:jar:3.1 in the shaded jar.
[INFO] Including org.apache.httpcomponents:httpclient:jar:4.2.5 in the shaded jar.
[INFO] Including commons-logging:commons-logging:jar:1.1.1 in the shaded jar.
[INFO] Including commons-codec:commons-codec:jar:1.6 in the shaded jar.
[INFO] Including org.apache.httpcomponents:httpcore:jar:4.2.4 in the shaded jar.
[INFO] Including com.google.guava:guava:jar:16.0.1 in the shaded jar.
[INFO] Including com.facebook.nifty:nifty-client:jar:0.12.0 in the shaded jar.
[INFO] Including com.google.inject:guice:jar:3.0 in the shaded jar.
[INFO] Including aopalliance:aopalliance:jar:1.0 in the shaded jar.
[INFO] Including com.facebook.nifty:nifty-core:jar:0.12.0 in the shaded jar.
[INFO] Including javax.inject:javax.inject:jar:1 in the shaded jar.
[INFO] Including com.google.inject.extensions:guice-multibindings:jar:3.0 in the shaded jar.
[INFO] Including io.airlift:configuration:jar:0.83 in the shaded jar.
[INFO] Including javax.validation:validation-api:jar:1.1.0.Final in the shaded jar.
[INFO] Including org.apache.bval:bval-jsr303:jar:0.5 in the shaded jar.
[INFO] Including org.apache.bval:bval-core:jar:0.5 in the shaded jar.
[INFO] Including commons-beanutils:commons-beanutils-core:jar:1.8.3 in the shaded jar.
[INFO] Including cglib:cglib-nodep:jar:2.2.2 in the shaded jar.
[INFO] Including io.airlift:stats:jar:0.83 in the shaded jar.
[INFO] Including io.airlift:units:jar:0.83 in the shaded jar.
[INFO] Including org.slf4j:slf4j-api:jar:1.7.6 in the shaded jar.
[INFO] Including io.netty:netty:jar:3.7.0.Final in the shaded jar.
[INFO] Including com.google.code.findbugs:annotations:jar:2.0.2 in the shaded jar.
[INFO] Including org.weakref:jmxutils:jar:1.14 in the shaded jar.
[INFO] Including io.dropwizard:dropwizard-configuration:jar:0.7.0 in the shaded jar.
[INFO] Including io.dropwizard:dropwizard-jackson:jar:0.7.0 in the shaded jar.
[INFO] Including io.dropwizard:dropwizard-util:jar:0.7.0 in the shaded jar.
[INFO] Including com.fasterxml.jackson.core:jackson-annotations:jar:2.3.0 in the shaded jar.
[INFO] Including com.google.code.findbugs:jsr305:jar:2.0.3 in the shaded jar.
[INFO] Including joda-time:joda-time:jar:2.3 in the shaded jar.
[INFO] Including com.fasterxml.jackson.core:jackson-core:jar:2.3.2 in the shaded jar.
[INFO] Including com.fasterxml.jackson.core:jackson-databind:jar:2.3.2 in the shaded jar.
[INFO] Including com.fasterxml.jackson.datatype:jackson-datatype-guava:jar:2.3.2 in the shaded
jar.
[INFO] Including com.fasterxml.jackson.module:jackson-module-afterburner:jar:2.3.2 in the
shaded jar.
[INFO] Including com.fasterxml.jackson.datatype:jackson-datatype-joda:jar:2.3.2 in the shaded
jar.
[INFO] Including io.dropwizard:dropwizard-validation:jar:0.7.0 in the shaded jar.
[INFO] Including org.hibernate:hibernate-validator:jar:5.0.2.Final in the shaded jar.
[INFO] Including org.jboss.logging:jboss-logging:jar:3.1.1.GA in the shaded jar.
[INFO] Including com.fasterxml:classmate:jar:1.0.0 in the shaded jar.
[INFO] Including org.glassfish.web:javax.el:jar:2.2.6 in the shaded jar.
[INFO] Including javax.el:javax.el-api:jar:2.2.5 in the shaded jar.
[INFO] Including com.fasterxml.jackson.dataformat:jackson-dataformat-yaml:jar:2.3.2 in the
shaded jar.
[INFO] Including commons-lang:commons-lang:jar:2.6 in the shaded jar.
[INFO] Including io.dropwizard:dropwizard-logging:jar:0.7.0 in the shaded jar.
[INFO] Including com.codahale.metrics:metrics-logback:jar:3.0.1 in the shaded jar.
[INFO] Including com.codahale.metrics:metrics-core:jar:3.0.1 in the shaded jar.
[INFO] Including org.slf4j:jul-to-slf4j:jar:1.7.6 in the shaded jar.
[INFO] Including ch.qos.logback:logback-core:jar:1.1.1 in the shaded jar.
[INFO] Including ch.qos.logback:logback-classic:jar:1.1.1 in the shaded jar.
[INFO] Including org.slf4j:log4j-over-slf4j:jar:1.7.6 in the shaded jar.
[INFO] Including org.eclipse.jetty:jetty-util:jar:9.0.7.v20131107 in the shaded jar.
[INFO] Including org.apache.zookeeper:zookeeper:jar:3.5.1-alpha in the shaded jar.
[INFO] Including commons-cli:commons-cli:jar:1.2 in the shaded jar.
[INFO] Including net.java.dev.javacc:javacc:jar:5.0 in the shaded jar.
[INFO] ------------------------------------------------------------------------
[INFO] Reactor Summary:
[INFO] 
[INFO] Apache Curator ..................................... SUCCESS [  3.715 s]
[INFO] Curator Testing .................................... SUCCESS [  4.224 s]
[INFO] Curator Client ..................................... SUCCESS [ 52.842 s]
[INFO] Curator Framework .................................. SUCCESS [55:12 min]
[INFO] Curator Recipes .................................... SUCCESS [  02:49 h]
[INFO] Curator Service Discovery .......................... FAILURE [  9.297 s]
[INFO] Curator Examples ................................... SUCCESS [  2.305 s]
[INFO] Curator Service Discovery Server ................... FAILURE [  8.903 s]
[INFO] Curator RPC Proxy .................................. FAILURE [  8.324 s]
[INFO] ------------------------------------------------------------------------
[INFO] BUILD FAILURE
[INFO] ------------------------------------------------------------------------
[INFO] Total time: 03:46 h
[INFO] Finished at: 2015-10-12T01:03:50+00:00
[INFO] Final Memory: 42M/390M
[INFO] ------------------------------------------------------------------------
Waiting for Jenkins to finish collecting data
[ERROR] Failed to execute goal org.apache.maven.plugins:maven-surefire-plugin:2.18.1:test
(default-test) on project curator-x-discovery: ExecutionException: java.lang.RuntimeException:
The forked VM terminated without properly saying goodbye. VM crash or System.exit called?
[ERROR] Command was /bin/sh -c cd /home/jenkins/jenkins-slave/workspace/Curator-3.0/curator-x-discovery
&& /home/jenkins/tools/java/jdk1.7.0_25-32/jre/bin/java -jar /home/jenkins/jenkins-slave/workspace/Curator-3.0/curator-x-discovery/target/surefire/surefirebooter7420102245668054369.jar
/home/jenkins/jenkins-slave/workspace/Curator-3.0/curator-x-discovery/target/surefire/surefire8570335655325014813tmp
/home/jenkins/jenkins-slave/workspace/Curator-3.0/curator-x-discovery/target/surefire/surefire_731064280834291903500tmp
[ERROR] -> [Help 1]
[ERROR] Failed to execute goal org.apache.maven.plugins:maven-surefire-plugin:2.18.1:test
(default-test) on project curator-x-discovery-server: ExecutionException: java.lang.RuntimeException:
The forked VM terminated without properly saying goodbye. VM crash or System.exit called?
[ERROR] Command was /bin/sh -c cd /home/jenkins/jenkins-slave/workspace/Curator-3.0/curator-x-discovery-server
&& /home/jenkins/tools/java/jdk1.7.0_25-32/jre/bin/java -jar /home/jenkins/jenkins-slave/workspace/Curator-3.0/curator-x-discovery-server/target/surefire/surefirebooter8774002761582576790.jar
/home/jenkins/jenkins-slave/workspace/Curator-3.0/curator-x-discovery-server/target/surefire/surefire6024408753506163644tmp
/home/jenkins/jenkins-slave/workspace/Curator-3.0/curator-x-discovery-server/target/surefire/surefire_794508893552207718351tmp
[ERROR] -> [Help 1]
[ERROR] Failed to execute goal org.apache.maven.plugins:maven-shade-plugin:2.3:shade (default)
on project curator-x-rpc: Error creating shaded jar: /home/jenkins/jenkins-slave/workspace/Curator-3.0/curator-x-discovery/target/classes
(Is a directory) -> [Help 2]
[ERROR] 
[ERROR] To see the full stack trace of the errors, re-run Maven with the -e switch.
[ERROR] Re-run Maven using the -X switch to enable full debug logging.
[ERROR] 
[ERROR] For more information about the errors and possible solutions, please read the following
articles:
[ERROR] [Help 1] http://cwiki.apache.org/confluence/display/MAVEN/MojoFailureException
[ERROR] [Help 2] http://cwiki.apache.org/confluence/display/MAVEN/MojoExecutionException
[ERROR] 
[ERROR] After correcting the problems, you can resume the build with the command
[ERROR]   mvn <goals> -rf :curator-x-discovery
[INFO] Build failures were ignored.

Mime
View raw message