curator-dev mailing list archives

Site index · List index
Message view « Date » · « Thread »
Top « Date » · « Thread »
From "Jordan Zimmerman (JIRA)" <j...@apache.org>
Subject [jira] [Updated] (CURATOR-260) Fix tests in CURATOR-3.0
Date Tue, 08 Sep 2015 03:02:45 GMT

     [ https://issues.apache.org/jira/browse/CURATOR-260?page=com.atlassian.jira.plugin.system.issuetabpanels:all-tabpanel
]

Jordan Zimmerman updated CURATOR-260:
-------------------------------------
    Description: 
{panel:title=TestSessionFailRetryLoop fails intermittently}
Tests run: 8, Failures: 1, Errors: 0, Skipped: 0, Time elapsed: 10.748 sec <<< FAILURE!
- in org.apache.curator.TestSessionFailRetryLoop
testBasic(org.apache.curator.TestSessionFailRetryLoop)  Time elapsed: 0.182 sec  <<<
FAILURE!
java.lang.AssertionError: null
	at org.testng.Assert.fail(Assert.java:94)
	at org.testng.Assert.fail(Assert.java:101)
	at org.apache.curator.TestSessionFailRetryLoop.testBasic(TestSessionFailRetryLoop.java:216)
{panel}

{panel:title=testKillSession}
testKillSession(org.apache.curator.framework.imps.TestEnabledSessionExpiredState)  Time elapsed:
0.097 sec  <<< FAILURE!
java.lang.AssertionError: expected [SUSPENDED] but found [LOST]
	at org.testng.Assert.fail(Assert.java:94)
	at org.testng.Assert.failNotEquals(Assert.java:494)
	at org.testng.Assert.assertEquals(Assert.java:123)
	at org.testng.Assert.assertEquals(Assert.java:165)
	at org.apache.curator.framework.imps.TestEnabledSessionExpiredState.testKillSession(TestEnabledSessionExpiredState.java:127)
{panel}

{panel:title=TestFramework.teardown}
Tests run: 173, Failures: 1, Errors: 0, Skipped: 171, Time elapsed: 2.676 sec <<<
FAILURE! - in org.apache.curator.framework.imps.TestFramework
teardown(org.apache.curator.framework.imps.TestFramework)  Time elapsed: 0.023 sec  <<<
FAILURE!
java.lang.NullPointerException: null
	at org.apache.zookeeper.server.ZooKeeperServerMain.shutdown(ZooKeeperServerMain.java:147)
	at org.apache.curator.test.TestingZooKeeperMain.close(TestingZooKeeperMain.java:122)
	at org.apache.curator.test.TestingZooKeeperServer.stop(TestingZooKeeperServer.java:110)
	at org.apache.curator.test.TestingZooKeeperServer.close(TestingZooKeeperServer.java:122)
	at org.apache.curator.test.TestingServer.close(TestingServer.java:183)
	at org.apache.curator.test.BaseClassForTests.teardown(BaseClassForTests.java:140)
	at org.apache.curator.framework.imps.TestFramework.teardown(TestFramework.java:71)
{panel}


  was:
{panel:title=TestSessionFailRetryLoop fails intermittently}
Tests run: 8, Failures: 1, Errors: 0, Skipped: 0, Time elapsed: 10.748 sec <<< FAILURE!
- in org.apache.curator.TestSessionFailRetryLoop
testBasic(org.apache.curator.TestSessionFailRetryLoop)  Time elapsed: 0.182 sec  <<<
FAILURE!
java.lang.AssertionError: null
	at org.testng.Assert.fail(Assert.java:94)
	at org.testng.Assert.fail(Assert.java:101)
	at org.apache.curator.TestSessionFailRetryLoop.testBasic(TestSessionFailRetryLoop.java:216)
{panel}

{panel:title=testKillSession}
testKillSession(org.apache.curator.framework.imps.TestEnabledSessionExpiredState)  Time elapsed:
0.097 sec  <<< FAILURE!
java.lang.AssertionError: expected [SUSPENDED] but found [LOST]
	at org.testng.Assert.fail(Assert.java:94)
	at org.testng.Assert.failNotEquals(Assert.java:494)
	at org.testng.Assert.assertEquals(Assert.java:123)
	at org.testng.Assert.assertEquals(Assert.java:165)
	at org.apache.curator.framework.imps.TestEnabledSessionExpiredState.testKillSession(TestEnabledSessionExpiredState.java:127)
{panel}


> Fix tests in CURATOR-3.0
> ------------------------
>
>                 Key: CURATOR-260
>                 URL: https://issues.apache.org/jira/browse/CURATOR-260
>             Project: Apache Curator
>          Issue Type: Bug
>          Components: Tests
>    Affects Versions: 3.0.0
>            Reporter: Jordan Zimmerman
>            Assignee: Jordan Zimmerman
>             Fix For: 3.0.0
>
>
> {panel:title=TestSessionFailRetryLoop fails intermittently}
> Tests run: 8, Failures: 1, Errors: 0, Skipped: 0, Time elapsed: 10.748 sec <<<
FAILURE! - in org.apache.curator.TestSessionFailRetryLoop
> testBasic(org.apache.curator.TestSessionFailRetryLoop)  Time elapsed: 0.182 sec  <<<
FAILURE!
> java.lang.AssertionError: null
> 	at org.testng.Assert.fail(Assert.java:94)
> 	at org.testng.Assert.fail(Assert.java:101)
> 	at org.apache.curator.TestSessionFailRetryLoop.testBasic(TestSessionFailRetryLoop.java:216)
> {panel}
> {panel:title=testKillSession}
> testKillSession(org.apache.curator.framework.imps.TestEnabledSessionExpiredState)  Time
elapsed: 0.097 sec  <<< FAILURE!
> java.lang.AssertionError: expected [SUSPENDED] but found [LOST]
> 	at org.testng.Assert.fail(Assert.java:94)
> 	at org.testng.Assert.failNotEquals(Assert.java:494)
> 	at org.testng.Assert.assertEquals(Assert.java:123)
> 	at org.testng.Assert.assertEquals(Assert.java:165)
> 	at org.apache.curator.framework.imps.TestEnabledSessionExpiredState.testKillSession(TestEnabledSessionExpiredState.java:127)
> {panel}
> {panel:title=TestFramework.teardown}
> Tests run: 173, Failures: 1, Errors: 0, Skipped: 171, Time elapsed: 2.676 sec <<<
FAILURE! - in org.apache.curator.framework.imps.TestFramework
> teardown(org.apache.curator.framework.imps.TestFramework)  Time elapsed: 0.023 sec  <<<
FAILURE!
> java.lang.NullPointerException: null
> 	at org.apache.zookeeper.server.ZooKeeperServerMain.shutdown(ZooKeeperServerMain.java:147)
> 	at org.apache.curator.test.TestingZooKeeperMain.close(TestingZooKeeperMain.java:122)
> 	at org.apache.curator.test.TestingZooKeeperServer.stop(TestingZooKeeperServer.java:110)
> 	at org.apache.curator.test.TestingZooKeeperServer.close(TestingZooKeeperServer.java:122)
> 	at org.apache.curator.test.TestingServer.close(TestingServer.java:183)
> 	at org.apache.curator.test.BaseClassForTests.teardown(BaseClassForTests.java:140)
> 	at org.apache.curator.framework.imps.TestFramework.teardown(TestFramework.java:71)
> {panel}



--
This message was sent by Atlassian JIRA
(v6.3.4#6332)

Mime
View raw message