curator-dev mailing list archives

Site index · List index
Message view « Date » · « Thread »
Top « Date » · « Thread »
From "Jordan Zimmerman (JIRA)" <j...@apache.org>
Subject [jira] [Created] (CURATOR-260) TestSessionFailRetryLoop fails intermittently after CURATOR-253
Date Sun, 06 Sep 2015 20:32:45 GMT
Jordan Zimmerman created CURATOR-260:
----------------------------------------

             Summary: TestSessionFailRetryLoop fails intermittently after CURATOR-253
                 Key: CURATOR-260
                 URL: https://issues.apache.org/jira/browse/CURATOR-260
             Project: Apache Curator
          Issue Type: Bug
          Components: Tests
    Affects Versions: 3.0.0
            Reporter: Jordan Zimmerman
            Assignee: Jordan Zimmerman
             Fix For: 3.0.0


Tests run: 8, Failures: 1, Errors: 0, Skipped: 0, Time elapsed: 10.748 sec <<< FAILURE!
- in org.apache.curator.TestSessionFailRetryLoop
testBasic(org.apache.curator.TestSessionFailRetryLoop)  Time elapsed: 0.182 sec  <<<
FAILURE!
java.lang.AssertionError: null
	at org.testng.Assert.fail(Assert.java:94)
	at org.testng.Assert.fail(Assert.java:101)
	at org.apache.curator.TestSessionFailRetryLoop.testBasic(TestSessionFailRetryLoop.java:216)




--
This message was sent by Atlassian JIRA
(v6.3.4#6332)

Mime
View raw message