curator-dev mailing list archives

Site index · List index
Message view « Date » · « Thread »
Top « Date » · « Thread »
From Apache Jenkins Server <jenk...@builds.apache.org>
Subject Build failed in Jenkins: Curator-3.0 #15
Date Tue, 08 Sep 2015 21:37:11 GMT
See <https://builds.apache.org/job/Curator-3.0/15/changes>

Changes:

[randgalt] licenses

[randgalt] Use forSessionSleep after session killed

[randgalt] sleep a bit so that session can actually expire

------------------------------------------
[...truncated 617 lines...]
[INFO] --- maven-resources-plugin:2.6:testResources (default-testResources) @ curator-x-discovery
---
[INFO] Using 'UTF-8' encoding to copy filtered resources.
[INFO] Copying 1 resource
[INFO] Copying 3 resources
[INFO] 
[INFO] --- maven-compiler-plugin:3.1:testCompile (default-testCompile) @ curator-x-discovery
---
[INFO] Changes detected - recompiling the module!
[INFO] Compiling 10 source files to <https://builds.apache.org/job/Curator-3.0/ws/curator-x-discovery/target/test-classes>
[WARNING] <https://builds.apache.org/job/Curator-3.0/ws/curator-x-discovery/src/test/java/org/apache/curator/x/discovery/details/TestServiceDiscovery.java>:
<https://builds.apache.org/job/Curator-3.0/ws/curator-x-discovery/src/test/java/org/apache/curator/x/discovery/details/TestServiceDiscovery.java>
uses or overrides a deprecated API.
[WARNING] <https://builds.apache.org/job/Curator-3.0/ws/curator-x-discovery/src/test/java/org/apache/curator/x/discovery/details/TestServiceDiscovery.java>:
Recompile with -Xlint:deprecation for details.
[INFO] 
[INFO] --- maven-surefire-plugin:2.17:test (default-test) @ curator-x-discovery ---
[INFO] Surefire report directory: <https://builds.apache.org/job/Curator-3.0/ws/curator-x-discovery/target/surefire-reports>

-------------------------------------------------------
 T E S T S
-------------------------------------------------------

-------------------------------------------------------
 T E S T S
-------------------------------------------------------
Running org.apache.curator.x.discovery.TestJsonInstanceSerializer
Tests run: 6, Failures: 0, Errors: 0, Skipped: 0, Time elapsed: 0.86 sec - in org.apache.curator.x.discovery.TestJsonInstanceSerializer
Running org.apache.curator.x.discovery.TestUriSpec
Tests run: 4, Failures: 0, Errors: 0, Skipped: 0, Time elapsed: 0.429 sec - in org.apache.curator.x.discovery.TestUriSpec
Running org.apache.curator.x.discovery.details.TestServiceDiscoveryBuilder
Tests run: 4, Failures: 0, Errors: 0, Skipped: 0, Time elapsed: 4.995 sec - in org.apache.curator.x.discovery.details.TestServiceDiscoveryBuilder
Running org.apache.curator.x.discovery.details.TestDownInstanceManager
#
# A fatal error has been detected by the Java Runtime Environment:
#
#  SIGSEGV (0xb) at pc=0xaec1852c, pid=4743, tid=4136565568
#
# JRE version: 7.0_25-b15
# Java VM: Java HotSpot(TM) Server VM (23.25-b01 mixed mode linux-x86 )
# Problematic frame:
java: malloc.c:2372: sysmalloc: Assertion `(old_top == (((mbinptr) (((char *) &((av)->bins[((1)
- 1) * 2])) - __builtin_offsetof (struct malloc_chunk, fd)))) && old_size == 0) ||
((unsigned long) (old_size) >= (unsigned long)((((__builtin_offsetof (struct malloc_chunk,
fd_nextsize))+((2 *(sizeof(size_t))) - 1)) & ~((2 *(sizeof(size_t))) - 1))) &&
((old_top)->size & 0x1) && ((unsigned long) old_end & pagemask) == 0)'
failed.
Aborted
# C  [libnet.so+0x352c]
Running org.apache.curator.x.discovery.details.TestWatchedInstances
#
# A fatal error has been detected by the Java Runtime Environment:
#
#  SIGSEGV (0xb) at pc=0xae76d52c, pid=4770, tid=4137093952
#
# JRE version: 7.0_25-b15
# Java VM: Java HotSpot(TM) Server VM (23.25-b01 mixed mode linux-x86 )
# Problematic frame:
# C  [libnet.so+0x352c]  _init+0x620
#
# Failed to write core dump. Core dumps have been disabled. To enable core dumping, try "ulimit
-c unlimited" before starting Java again
#
# An error report file with more information is saved as:
# <https://builds.apache.org/job/Curator-3.0/ws/curator-x-discovery/hs_err_pid4770.log>
#
# If you would like to submit a bug report, please visit:
#   http://bugreport.sun.com/bugreport/crash.jsp
# The crash happened outside the Java Virtual Machine in native code.
# See problematic frame for where to report the bug.
#
Aborted
Running org.apache.curator.x.discovery.details.TestServiceDiscovery
#
# A fatal error has been detected by the Java Runtime Environment:
#
#  SIGSEGV (0xb) at pc=0xaec1c52c, pid=4810, tid=4136651584
#
# JRE version: 7.0_25-b15
# Java VM: Java HotSpot(TM) Server VM (23.25-b01 mixed mode linux-x86 )
# Problematic frame:
# C  [libnet.so+0x352c]  _init+0x620
#
# Failed to write core dump. Core dumps have been disabled. To enable core dumping, try "ulimit
-c unlimited" before starting Java again
#
# An error report file with more information is saved as:
# <https://builds.apache.org/job/Curator-3.0/ws/curator-x-discovery/hs_err_pid4810.log>
#
# If you would like to submit a bug report, please visit:
#   http://bugreport.sun.com/bugreport/crash.jsp
# The crash happened outside the Java Virtual Machine in native code.
# See problematic frame for where to report the bug.
#
Aborted
Running org.apache.curator.x.discovery.TestServiceCache
#
# A fatal error has been detected by the Java Runtime Environment:
#
#  SIGSEGV (0xb) at pc=0xaec1c52c, pid=4850, tid=4136651584
#
# JRE version: 7.0_25-b15
# Java VM: Java HotSpot(TM) Server VM (23.25-b01 mixed mode linux-x86 )
# Problematic frame:
# C  [libnet.so+0x352c]  _init+0x620
#
# Failed to write core dump. Core dumps have been disabled. To enable core dumping, try "ulimit
-c unlimited" before starting Java again
#
# An error report file with more information is saved as:
# <https://builds.apache.org/job/Curator-3.0/ws/curator-x-discovery/hs_err_pid4850.log>
#
# If you would like to submit a bug report, please visit:
#   http://bugreport.sun.com/bugreport/crash.jsp
# The crash happened outside the Java Virtual Machine in native code.
# See problematic frame for where to report the bug.
#
Aborted
Running org.apache.curator.x.discovery.TestLocalIpFilter
#
# A fatal error has been detected by the Java Runtime Environment:
#
#  SIGSEGV (0xb) at pc=0xaea0f52c, pid=4912, tid=4136315712
#
# JRE version: 7.0_25-b15
# Java VM: Java HotSpot(TM) Server VM (23.25-b01 mixed mode linux-x86 )
# Problematic frame:
# C  [libnet.so+0x352c]  _init+0x620
#
# Failed to write core dump. Core dumps have been disabled. To enable core dumping, try "ulimit
-c unlimited" before starting Java again
#
# An error report file with more information is saved as:
# <https://builds.apache.org/job/Curator-3.0/ws/curator-x-discovery/hs_err_pid4912.log>
#
# If you would like to submit a bug report, please visit:
#   http://bugreport.sun.com/bugreport/crash.jsp
# The crash happened outside the Java Virtual Machine in native code.
# See problematic frame for where to report the bug.
#
Aborted
Running org.apache.curator.x.discovery.TestStrategies
#
# A fatal error has been detected by the Java Runtime Environment:
#
#  SIGSEGV (0xb) at pc=0xaea0452c, pid=4940, tid=4136278848
#
# JRE version: 7.0_25-b15
# Java VM: Java HotSpot(TM) Server VM (23.25-b01 mixed mode linux-x86 )
# Problematic frame:
java: malloc.c:2372: sysmalloc: Assertion `(old_top == (((mbinptr) (((char *) &((av)->bins[((1)
- 1) * 2])) - __builtin_offsetof (struct malloc_chunk, fd)))) && old_size == 0) ||
((unsigned long) (old_size) >= (unsigned long)((((__builtin_offsetof (struct malloc_chunk,
fd_nextsize))+((2 *(sizeof(size_t))) - 1)) & ~((2 *(sizeof(size_t))) - 1))) &&
((old_top)->size & 0x1) && ((unsigned long) old_end & pagemask) == 0)'
failed.
Aborted
# C  [libnet.so+0x352c]

Results :

Tests run: 14, Failures: 0, Errors: 0, Skipped: 0

[JENKINS] Recording test results
[INFO] ------------------------------------------------------------------------
[INFO] Reactor Summary:
[INFO] 
[INFO] Apache Curator ..................................... SUCCESS [  4.325 s]
[INFO] Curator Testing .................................... SUCCESS [  5.164 s]
[INFO] Curator Client ..................................... SUCCESS [01:12 min]
[INFO] Curator Framework .................................. SUCCESS [34:25 min]
[INFO] Curator Recipes .................................... SUCCESS [  02:03 h]
[INFO] Curator Service Discovery .......................... FAILURE [ 16.296 s]
[INFO] Curator Examples ................................... SKIPPED
[INFO] Curator Service Discovery Server ................... SKIPPED
[INFO] Curator RPC Proxy .................................. SKIPPED
[INFO] ------------------------------------------------------------------------
[INFO] BUILD FAILURE
[INFO] ------------------------------------------------------------------------
[INFO] Total time: 02:39 h
[INFO] Finished at: 2015-09-08T21:34:17+00:00
[INFO] Final Memory: 35M/540M
[INFO] ------------------------------------------------------------------------
[ERROR] Failed to execute goal org.apache.maven.plugins:maven-surefire-plugin:2.17:test (default-test)
on project curator-x-discovery: ExecutionException: java.lang.RuntimeException: The forked
VM terminated without properly saying goodbye. VM crash or System.exit called?
[ERROR] Command was /bin/sh -c cd <https://builds.apache.org/job/Curator-3.0/ws/curator-x-discovery>
&& /home/jenkins/tools/java/jdk1.7.0_25-32/jre/bin/java -jar <https://builds.apache.org/job/Curator-3.0/ws/curator-x-discovery/target/surefire/surefirebooter7599082002673473731.jar>
<https://builds.apache.org/job/Curator-3.0/ws/curator-x-discovery/target/surefire/surefire2868872354217433944tmp>
<https://builds.apache.org/job/Curator-3.0/ws/curator-x-discovery/target/surefire/surefire_733829180715475175672tmp>
[ERROR] -> [Help 1]
[ERROR] 
[ERROR] To see the full stack trace of the errors, re-run Maven with the -e switch.
[ERROR] Re-run Maven using the -X switch to enable full debug logging.
[ERROR] 
[ERROR] For more information about the errors and possible solutions, please read the following
articles:
[ERROR] [Help 1] http://cwiki.apache.org/confluence/display/MAVEN/MojoFailureException
[ERROR] 
[ERROR] After correcting the problems, you can resume the build with the command
[ERROR]   mvn <goals> -rf :curator-x-discovery
[JENKINS] Archiving <https://builds.apache.org/job/Curator-3.0/ws/curator-x-rpc/pom.xml>
to org.apache.curator/curator-x-rpc/3.0.0-SNAPSHOT/curator-x-rpc-3.0.0-SNAPSHOT.pom
Sending artifact delta relative to Curator-3.0 » Curator RPC Proxy #9
Archived 1 artifacts
Archive block size is 32768
Received 0 blocks and 7300 bytes
Compression is 0.0%
Took 0.2 sec
[JENKINS] Archiving <https://builds.apache.org/job/Curator-3.0/ws/curator-client/pom.xml>
to org.apache.curator/curator-client/3.0.0-SNAPSHOT/curator-client-3.0.0-SNAPSHOT.pom
[JENKINS] Archiving <https://builds.apache.org/job/Curator-3.0/ws/curator-client/target/curator-client-3.0.0-SNAPSHOT.jar>
to org.apache.curator/curator-client/3.0.0-SNAPSHOT/curator-client-3.0.0-SNAPSHOT.jar
Sending artifact delta relative to Curator-3.0 » Curator Client #9
Archived 2 artifacts
Archive block size is 32768
Received 0 blocks and 83413 bytes
Compression is 0.0%
Took 50 ms
[JENKINS] Archiving <https://builds.apache.org/job/Curator-3.0/ws/curator-framework/pom.xml>
to org.apache.curator/curator-framework/3.0.0-SNAPSHOT/curator-framework-3.0.0-SNAPSHOT.pom
[JENKINS] Archiving <https://builds.apache.org/job/Curator-3.0/ws/curator-framework/target/curator-framework-3.0.0-SNAPSHOT.jar>
to org.apache.curator/curator-framework/3.0.0-SNAPSHOT/curator-framework-3.0.0-SNAPSHOT.jar
Sending artifact delta relative to Curator-3.0 » Curator Framework #9
Archived 2 artifacts
Archive block size is 32768
Received 0 blocks and 276351 bytes
Compression is 0.0%
Took 94 ms
[JENKINS] Archiving <https://builds.apache.org/job/Curator-3.0/ws/curator-x-discovery-server/pom.xml>
to org.apache.curator/curator-x-discovery-server/3.0.0-SNAPSHOT/curator-x-discovery-server-3.0.0-SNAPSHOT.pom
Sending artifact delta relative to Curator-3.0 » Curator Service Discovery Server #9
Archived 1 artifacts
Archive block size is 32768
Received 0 blocks and 4377 bytes
Compression is 0.0%
Took 24 ms
[JENKINS] Archiving <https://builds.apache.org/job/Curator-3.0/ws/curator-examples/pom.xml>
to org.apache.curator/curator-examples/3.0.0-SNAPSHOT/curator-examples-3.0.0-SNAPSHOT.pom
Sending artifact delta relative to Curator-3.0 » Curator Examples #9
Archived 1 artifacts
Archive block size is 32768
Received 0 blocks and 2223 bytes
Compression is 0.0%
Took 26 ms
[JENKINS] Archiving <https://builds.apache.org/job/Curator-3.0/ws/curator-test/pom.xml>
to org.apache.curator/curator-test/3.0.0-SNAPSHOT/curator-test-3.0.0-SNAPSHOT.pom
[JENKINS] Archiving <https://builds.apache.org/job/Curator-3.0/ws/curator-test/target/curator-test-3.0.0-SNAPSHOT.jar>
to org.apache.curator/curator-test/3.0.0-SNAPSHOT/curator-test-3.0.0-SNAPSHOT.jar
Sending artifact delta relative to Curator-3.0 » Curator Testing #14
Archived 2 artifacts
Archive block size is 32768
Received 0 blocks and 45551 bytes
Compression is 0.0%
Took 32 ms
[JENKINS] Archiving <https://builds.apache.org/job/Curator-3.0/ws/curator-recipes/pom.xml>
to org.apache.curator/curator-recipes/3.0.0-SNAPSHOT/curator-recipes-3.0.0-SNAPSHOT.pom
[JENKINS] Archiving <https://builds.apache.org/job/Curator-3.0/ws/curator-recipes/target/curator-recipes-3.0.0-SNAPSHOT.jar>
to org.apache.curator/curator-recipes/3.0.0-SNAPSHOT/curator-recipes-3.0.0-SNAPSHOT.jar
Sending artifact delta relative to Curator-3.0 » Curator Recipes #9
Archived 2 artifacts
Archive block size is 32768
Received 0 blocks and 279908 bytes
Compression is 0.0%
Took 0.1 sec
[JENKINS] Archiving <https://builds.apache.org/job/Curator-3.0/ws/pom.xml> to org.apache.curator/apache-curator/3.0.0-SNAPSHOT/apache-curator-3.0.0-SNAPSHOT.pom
[JENKINS] Archiving <https://builds.apache.org/job/Curator-3.0/ws/target/apache-curator-3.0.0-SNAPSHOT-site.xml>
to org.apache.curator/apache-curator/3.0.0-SNAPSHOT/apache-curator-3.0.0-SNAPSHOT-site.xml
Sending artifact delta relative to Curator-3.0 » Apache Curator #14
Archived 2 artifacts
Archive block size is 32768
Received 1 blocks and 3298 bytes
Compression is 90.9%
Took 27 ms
[JENKINS] Archiving <https://builds.apache.org/job/Curator-3.0/ws/curator-x-discovery/pom.xml>
to org.apache.curator/curator-x-discovery/3.0.0-SNAPSHOT/curator-x-discovery-3.0.0-SNAPSHOT.pom
Sending artifact delta relative to Curator-3.0 » Curator Service Discovery #9
Archived 1 artifacts
Archive block size is 32768
Received 0 blocks and 2753 bytes
Compression is 0.0%
Took 25 ms
Sending e-mails to: dev@curator.apache.org
Sending e-mails to: dev@curator.apache.org
Sending e-mails to: dev@curator.apache.org
Sending e-mails to: dev@curator.apache.org
channel stopped

Mime
View raw message