curator-dev mailing list archives

Site index · List index
Message view « Date » · « Thread »
Top « Date » · « Thread »
From Apache Jenkins Server <jenk...@builds.apache.org>
Subject Build failed in Jenkins: Curator-3.0 #21
Date Wed, 09 Sep 2015 16:00:52 GMT
See <https://builds.apache.org/job/Curator-3.0/21/changes>

Changes:

[randgalt] More work on making tests more reliable. Also, for CURATOR-257, removed the enigmatic
thread sleep in TestingZooKeeperMain.blockUntilStarted() in favor or more rigorous checks
for the testing servers starting

------------------------------------------
[...truncated 577 lines...]
[ERROR] 7012: org.apache.curator.x.discovery.ServiceCacheBuilder: Method 'public org.apache.curator.x.discovery.ServiceCacheBuilder
executorService(org.apache.curator.utils.CloseableExecutorService)' has been added to an interface
[INFO] Succeeded with 2 errors; 0 warnings; and 0 other changes.
[CHECKSTYLE] No report found for mojo check[INFO] 
[INFO] --- maven-bundle-plugin:2.3.7:manifest (bundle-manifest) @ curator-x-discovery ---

[INFO] 
[INFO] --- maven-resources-plugin:2.6:testResources (default-testResources) @ curator-x-discovery
---
[INFO] Using 'UTF-8' encoding to copy filtered resources.
[INFO] Copying 1 resource
[INFO] Copying 3 resources
[INFO] 
[INFO] --- maven-compiler-plugin:3.1:testCompile (default-testCompile) @ curator-x-discovery
---
[INFO] Changes detected - recompiling the module!
[INFO] Compiling 10 source files to <https://builds.apache.org/job/Curator-3.0/ws/curator-x-discovery/target/test-classes>
[WARNING] <https://builds.apache.org/job/Curator-3.0/ws/curator-x-discovery/src/test/java/org/apache/curator/x/discovery/details/TestServiceDiscovery.java>:
<https://builds.apache.org/job/Curator-3.0/ws/curator-x-discovery/src/test/java/org/apache/curator/x/discovery/details/TestServiceDiscovery.java>
uses or overrides a deprecated API.
[WARNING] <https://builds.apache.org/job/Curator-3.0/ws/curator-x-discovery/src/test/java/org/apache/curator/x/discovery/details/TestServiceDiscovery.java>:
Recompile with -Xlint:deprecation for details.
[INFO] 
[INFO] --- maven-surefire-plugin:2.18.1:test (default-test) @ curator-x-discovery ---
[INFO] Surefire report directory: <https://builds.apache.org/job/Curator-3.0/ws/curator-x-discovery/target/surefire-reports>

-------------------------------------------------------
 T E S T S
-------------------------------------------------------
Running org.apache.curator.x.discovery.TestJsonInstanceSerializer
Tests run: 6, Failures: 0, Errors: 0, Skipped: 0, Time elapsed: 0.873 sec - in org.apache.curator.x.discovery.TestJsonInstanceSerializer
Running org.apache.curator.x.discovery.TestUriSpec
Tests run: 4, Failures: 0, Errors: 0, Skipped: 0, Time elapsed: 0.437 sec - in org.apache.curator.x.discovery.TestUriSpec
Running org.apache.curator.x.discovery.details.TestServiceDiscoveryBuilder
Tests run: 4, Failures: 0, Errors: 0, Skipped: 0, Time elapsed: 1.015 sec - in org.apache.curator.x.discovery.details.TestServiceDiscoveryBuilder
Running org.apache.curator.x.discovery.details.TestDownInstanceManager
#
# A fatal error has been detected by the Java Runtime Environment:
#
SUREFIRE-859: #  SIGSEGV (0xb) at pc=0xae76d52c, pid=14204, tid=4137081664
#
# JRE version: 7.0_25-b15
# Java VM: Java HotSpot(TM) Server VM (23.25-b01 mixed mode linux-x86 )
# Problematic frame:
SUREFIRE-859: java: malloc.c:2372: sysmalloc: Assertion `(old_top == (((mbinptr) (((char *)
&((av)->bins[((1) - 1) * 2])) - __builtin_offsetof (struct malloc_chunk, fd)))) &&
old_size == 0) || ((unsigned long) (old_size) >= (unsigned long)((((__builtin_offsetof
(struct malloc_chunk, fd_nextsize))+((2 *(sizeof(size_t))) - 1)) & ~((2 *(sizeof(size_t)))
- 1))) && ((old_top)->size & 0x1) && ((unsigned long) old_end &
pagemask) == 0)' failed.
Aborted
# C  [libnet.so+0x352c]
Running org.apache.curator.x.discovery.details.TestWatchedInstances
#
# A fatal error has been detected by the Java Runtime Environment:
#
SUREFIRE-859: #  SIGSEGV (0xb) at pc=0xaec1c52c, pid=14231, tid=4136651584
#
# JRE version: 7.0_25-b15
# Java VM: Java HotSpot(TM) Server VM (23.25-b01 mixed mode linux-x86 )
# Problematic frame:
# C  [libnet.so+0x352c]  _init+0x620
#
SUREFIRE-859: # Failed to write core dump. Core dumps have been disabled. To enable core dumping,
try "ulimit -c unlimited" before starting Java again
#
# An error report file with more information is saved as:
# <https://builds.apache.org/job/Curator-3.0/ws/curator-x-discovery/hs_err_pid14231.log>
#
SUREFIRE-859: # If you would like to submit a bug report, please visit:
#   http://bugreport.sun.com/bugreport/crash.jsp
# The crash happened outside the Java Virtual Machine in native code.
# See problematic frame for where to report the bug.
#
Aborted
Running org.apache.curator.x.discovery.details.TestServiceDiscovery
#
# A fatal error has been detected by the Java Runtime Environment:
#
SUREFIRE-859: #  SIGSEGV (0xb) at pc=0xaea1252c, pid=14271, tid=4136418112
#
# JRE version: 7.0_25-b15
# Java VM: Java HotSpot(TM) Server VM (23.25-b01 mixed mode linux-x86 )
# Problematic frame:
# C  [libnet.so+0x352c]  _init+0x620
#
SUREFIRE-859: # Failed to write core dump. Core dumps have been disabled. To enable core dumping,
try "ulimit -c unlimited" before starting Java again
#
# An error report file with more information is saved as:
# <https://builds.apache.org/job/Curator-3.0/ws/curator-x-discovery/hs_err_pid14271.log>
#
SUREFIRE-859: # If you would like to submit a bug report, please visit:
#   http://bugreport.sun.com/bugreport/crash.jsp
# The crash happened outside the Java Virtual Machine in native code.
# See problematic frame for where to report the bug.
#
Aborted
Running org.apache.curator.x.discovery.TestServiceCache
#
# A fatal error has been detected by the Java Runtime Environment:
#
SUREFIRE-859: #  SIGSEGV (0xb) at pc=0xaea1c52c, pid=14311, tid=4136790848
#
# JRE version: 7.0_25-b15
# Java VM: Java HotSpot(TM) Server VM (23.25-b01 mixed mode linux-x86 )
# Problematic frame:
# C  [libnet.so+0x352c]  _init+0x620
#
SUREFIRE-859: # Failed to write core dump. Core dumps have been disabled. To enable core dumping,
try "ulimit -c unlimited" before starting Java again
#
# An error report file with more information is saved as:
# <https://builds.apache.org/job/Curator-3.0/ws/curator-x-discovery/hs_err_pid14311.log>
#
SUREFIRE-859: # If you would like to submit a bug report, please visit:
#   http://bugreport.sun.com/bugreport/crash.jsp
# The crash happened outside the Java Virtual Machine in native code.
# See problematic frame for where to report the bug.
#
Aborted
Running org.apache.curator.x.discovery.TestLocalIpFilter
#
# A fatal error has been detected by the Java Runtime Environment:
#
SUREFIRE-859: #  SIGSEGV (0xb) at pc=0xaee0652c, pid=14373, tid=4136659776
#
# JRE version: 7.0_25-b15
# Java VM: Java HotSpot(TM) Server VM (23.25-b01 mixed mode linux-x86 )
# Problematic frame:
# C  [libnet.so+0x352c]  _init+0x620
#
SUREFIRE-859: # Failed to write core dump. Core dumps have been disabled. To enable core dumping,
try "ulimit -c unlimited" before starting Java again
#
# An error report file with more information is saved as:
# <https://builds.apache.org/job/Curator-3.0/ws/curator-x-discovery/hs_err_pid14373.log>
#
SUREFIRE-859: # If you would like to submit a bug report, please visit:
#   http://bugreport.sun.com/bugreport/crash.jsp
# The crash happened outside the Java Virtual Machine in native code.
# See problematic frame for where to report the bug.
#
Aborted
Running org.apache.curator.x.discovery.TestStrategies
#
# A fatal error has been detected by the Java Runtime Environment:
#
SUREFIRE-859: #  SIGSEGV (0xb) at pc=0xae80952c, pid=14400, tid=4136115008
#
# JRE version: 7.0_25-b15
# Java VM: Java HotSpot(TM) Server VM (23.25-b01 mixed mode linux-x86 )
# Problematic frame:
SUREFIRE-859: java: malloc.c:2372: sysmalloc: Assertion `(old_top == (((mbinptr) (((char *)
&((av)->bins[((1) - 1) * 2])) - __builtin_offsetof (struct malloc_chunk, fd)))) &&
old_size == 0) || ((unsigned long) (old_size) >= (unsigned long)((((__builtin_offsetof
(struct malloc_chunk, fd_nextsize))+((2 *(sizeof(size_t))) - 1)) & ~((2 *(sizeof(size_t)))
- 1))) && ((old_top)->size & 0x1) && ((unsigned long) old_end &
pagemask) == 0)' failed.
Aborted
# C  [libnet.so+0x352c]

Results :

Tests run: 14, Failures: 0, Errors: 0, Skipped: 0

[JENKINS] Recording test results
[INFO] ------------------------------------------------------------------------
[INFO] Reactor Summary:
[INFO] 
[INFO] Apache Curator ..................................... SUCCESS [  4.573 s]
[INFO] Curator Testing .................................... SUCCESS [  4.339 s]
[INFO] Curator Client ..................................... SUCCESS [ 54.003 s]
[INFO] Curator Framework .................................. SUCCESS [30:32 min]
[INFO] Curator Recipes .................................... SUCCESS [  01:56 h]
[INFO] Curator Service Discovery .......................... FAILURE [  9.507 s]
[INFO] Curator Examples ................................... SKIPPED
[INFO] Curator Service Discovery Server ................... SKIPPED
[INFO] Curator RPC Proxy .................................. SKIPPED
[INFO] ------------------------------------------------------------------------
[INFO] BUILD FAILURE
[INFO] ------------------------------------------------------------------------
[INFO] Total time: 02:28 h
[INFO] Finished at: 2015-09-09T15:57:56+00:00
[INFO] Final Memory: 27M/356M
[INFO] ------------------------------------------------------------------------
[ERROR] Failed to execute goal org.apache.maven.plugins:maven-surefire-plugin:2.18.1:test
(default-test) on project curator-x-discovery: ExecutionException: java.lang.RuntimeException:
The forked VM terminated without properly saying goodbye. VM crash or System.exit called?
[ERROR] Command was /bin/sh -c cd <https://builds.apache.org/job/Curator-3.0/ws/curator-x-discovery>
&& /home/jenkins/tools/java/jdk1.7.0_25-32/jre/bin/java -jar <https://builds.apache.org/job/Curator-3.0/ws/curator-x-discovery/target/surefire/surefirebooter6659258536677463380.jar>
<https://builds.apache.org/job/Curator-3.0/ws/curator-x-discovery/target/surefire/surefire1422034927361539621tmp>
<https://builds.apache.org/job/Curator-3.0/ws/curator-x-discovery/target/surefire/surefire_738427805843089817243tmp>
[ERROR] -> [Help 1]
[ERROR] 
[ERROR] To see the full stack trace of the errors, re-run Maven with the -e switch.
[ERROR] Re-run Maven using the -X switch to enable full debug logging.
[ERROR] 
[ERROR] For more information about the errors and possible solutions, please read the following
articles:
[ERROR] [Help 1] http://cwiki.apache.org/confluence/display/MAVEN/MojoFailureException
[ERROR] 
[ERROR] After correcting the problems, you can resume the build with the command
[ERROR]   mvn <goals> -rf :curator-x-discovery
[JENKINS] Archiving <https://builds.apache.org/job/Curator-3.0/ws/curator-x-rpc/pom.xml>
to org.apache.curator/curator-x-rpc/3.0.0-SNAPSHOT/curator-x-rpc-3.0.0-SNAPSHOT.pom
Sending artifact delta relative to Curator-3.0 » Curator RPC Proxy #9
Archived 1 artifacts
Archive block size is 32768
Received 0 blocks and 7300 bytes
Compression is 0.0%
Took 0.26 sec
[JENKINS] Archiving <https://builds.apache.org/job/Curator-3.0/ws/curator-client/pom.xml>
to org.apache.curator/curator-client/3.0.0-SNAPSHOT/curator-client-3.0.0-SNAPSHOT.pom
[JENKINS] Archiving <https://builds.apache.org/job/Curator-3.0/ws/curator-client/target/curator-client-3.0.0-SNAPSHOT.jar>
to org.apache.curator/curator-client/3.0.0-SNAPSHOT/curator-client-3.0.0-SNAPSHOT.jar
Sending artifact delta relative to Curator-3.0 » Curator Client #20
Archived 2 artifacts
Archive block size is 32768
Received 0 blocks and 83413 bytes
Compression is 0.0%
Took 0.12 sec
[JENKINS] Archiving <https://builds.apache.org/job/Curator-3.0/ws/curator-framework/pom.xml>
to org.apache.curator/curator-framework/3.0.0-SNAPSHOT/curator-framework-3.0.0-SNAPSHOT.pom
[JENKINS] Archiving <https://builds.apache.org/job/Curator-3.0/ws/curator-framework/target/curator-framework-3.0.0-SNAPSHOT.jar>
to org.apache.curator/curator-framework/3.0.0-SNAPSHOT/curator-framework-3.0.0-SNAPSHOT.jar
Sending artifact delta relative to Curator-3.0 » Curator Framework #20
Archived 2 artifacts
Archive block size is 32768
Received 0 blocks and 276346 bytes
Compression is 0.0%
Took 0.18 sec
[JENKINS] Archiving <https://builds.apache.org/job/Curator-3.0/ws/curator-x-discovery-server/pom.xml>
to org.apache.curator/curator-x-discovery-server/3.0.0-SNAPSHOT/curator-x-discovery-server-3.0.0-SNAPSHOT.pom
Sending artifact delta relative to Curator-3.0 » Curator Service Discovery Server #9
Archived 1 artifacts
Archive block size is 32768
Received 0 blocks and 4377 bytes
Compression is 0.0%
Took 61 ms
[JENKINS] Archiving <https://builds.apache.org/job/Curator-3.0/ws/curator-examples/pom.xml>
to org.apache.curator/curator-examples/3.0.0-SNAPSHOT/curator-examples-3.0.0-SNAPSHOT.pom
Sending artifact delta relative to Curator-3.0 » Curator Examples #9
Archived 1 artifacts
Archive block size is 32768
Received 0 blocks and 2223 bytes
Compression is 0.0%
Took 50 ms
[JENKINS] Archiving <https://builds.apache.org/job/Curator-3.0/ws/curator-test/pom.xml>
to org.apache.curator/curator-test/3.0.0-SNAPSHOT/curator-test-3.0.0-SNAPSHOT.pom
[JENKINS] Archiving <https://builds.apache.org/job/Curator-3.0/ws/curator-test/target/curator-test-3.0.0-SNAPSHOT.jar>
to org.apache.curator/curator-test/3.0.0-SNAPSHOT/curator-test-3.0.0-SNAPSHOT.jar
Sending artifact delta relative to Curator-3.0 » Curator Testing #20
Archived 2 artifacts
Archive block size is 32768
Received 0 blocks and 46058 bytes
Compression is 0.0%
Took 63 ms
[JENKINS] Archiving <https://builds.apache.org/job/Curator-3.0/ws/curator-recipes/pom.xml>
to org.apache.curator/curator-recipes/3.0.0-SNAPSHOT/curator-recipes-3.0.0-SNAPSHOT.pom
[JENKINS] Archiving <https://builds.apache.org/job/Curator-3.0/ws/curator-recipes/target/curator-recipes-3.0.0-SNAPSHOT.jar>
to org.apache.curator/curator-recipes/3.0.0-SNAPSHOT/curator-recipes-3.0.0-SNAPSHOT.jar
Sending artifact delta relative to Curator-3.0 » Curator Recipes #20
Archived 2 artifacts
Archive block size is 32768
Received 0 blocks and 280278 bytes
Compression is 0.0%
Took 0.14 sec
[JENKINS] Archiving <https://builds.apache.org/job/Curator-3.0/ws/pom.xml> to org.apache.curator/apache-curator/3.0.0-SNAPSHOT/apache-curator-3.0.0-SNAPSHOT.pom
[JENKINS] Archiving <https://builds.apache.org/job/Curator-3.0/ws/target/apache-curator-3.0.0-SNAPSHOT-site.xml>
to org.apache.curator/apache-curator/3.0.0-SNAPSHOT/apache-curator-3.0.0-SNAPSHOT-site.xml
Sending artifact delta relative to Curator-3.0 » Apache Curator #20
Archived 2 artifacts
Archive block size is 32768
Received 0 blocks and 36331 bytes
Compression is 0.0%
Took 79 ms
[JENKINS] Archiving <https://builds.apache.org/job/Curator-3.0/ws/curator-x-discovery/pom.xml>
to org.apache.curator/curator-x-discovery/3.0.0-SNAPSHOT/curator-x-discovery-3.0.0-SNAPSHOT.pom
Sending artifact delta relative to Curator-3.0 » Curator Service Discovery #9
Archived 1 artifacts
Archive block size is 32768
Received 0 blocks and 2753 bytes
Compression is 0.0%
Took 47 ms
Sending e-mails to: dev@curator.apache.org
Sending e-mails to: dev@curator.apache.org
channel stopped

Mime
View raw message