curator-dev mailing list archives

Site index · List index
Message view « Date » · « Thread »
Top « Date » · « Thread »
From Mike Drob <mad...@cloudera.com>
Subject Re: Build failed in Jenkins: Curator-3.0 #4
Date Tue, 25 Aug 2015 18:24:24 GMT
Apologies for the noise here. When I initially configured the Curator-3.0
job, I missed that it needed to be Java 7, so we're ending up with a few
failed builds because of that.

On Tue, Aug 25, 2015 at 1:19 PM, Apache Jenkins Server <
jenkins@builds.apache.org> wrote:

> See <https://builds.apache.org/job/Curator-3.0/4/>
>
> ------------------------------------------
> [...truncated 1113 lines...]
> [INFO] Downloaded:
> https://repo.maven.apache.org/maven2/org/codehaus/woodstox/wstx-asl/3.2.6/wstx-asl-3.2.6.jar
> (509 KB at 7585.0 KB/sec)
> [INFO] Downloaded:
> https://repo.maven.apache.org/maven2/org/codehaus/plexus/plexus-utils/2.0.5/plexus-utils-2.0.5.jar
> (218 KB at 3113.4 KB/sec)
> [INFO] Downloaded:
> https://repo.maven.apache.org/maven2/com/google/code/google-collections/google-collect/snapshot-20080530/google-collect-snapshot-20080530.jar
> (490 KB at 5695.8 KB/sec)
> [INFO] Checking licenses...
> [CHECKSTYLE] No report found for mojo check
> [INFO]
> [INFO]
> ------------------------------------------------------------------------
> [INFO] Building Curator Testing 3.0.0-SNAPSHOT
> [INFO]
> ------------------------------------------------------------------------
> [INFO] Downloading:
> https://repo.maven.apache.org/maven2/org/apache/maven/plugins/maven-resources-plugin/2.6/maven-resources-plugin-2.6.pom
> [INFO] Downloaded:
> https://repo.maven.apache.org/maven2/org/apache/maven/plugins/maven-resources-plugin/2.6/maven-resources-plugin-2.6.pom
> (8 KB at 609.6 KB/sec)
> [INFO] Downloading:
> https://repo.maven.apache.org/maven2/org/apache/maven/plugins/maven-plugins/23/maven-plugins-23.pom
> [INFO] Downloaded:
> https://repo.maven.apache.org/maven2/org/apache/maven/plugins/maven-plugins/23/maven-plugins-23.pom
> (9 KB at 898.2 KB/sec)
> [INFO] Downloading:
> https://repo.maven.apache.org/maven2/org/apache/maven/plugins/maven-resources-plugin/2.6/maven-resources-plugin-2.6.jar
> [INFO] Downloaded:
> https://repo.maven.apache.org/maven2/org/apache/maven/plugins/maven-resources-plugin/2.6/maven-resources-plugin-2.6.jar
> (29 KB at 2620.6 KB/sec)
> [INFO] Downloading:
> https://repo.maven.apache.org/maven2/org/apache/maven/plugins/maven-compiler-plugin/3.1/maven-compiler-plugin-3.1.pom
> [INFO] Downloaded:
> https://repo.maven.apache.org/maven2/org/apache/maven/plugins/maven-compiler-plugin/3.1/maven-compiler-plugin-3.1.pom
> (10 KB at 1246.3 KB/sec)
> [INFO] Downloading:
> https://repo.maven.apache.org/maven2/org/apache/maven/plugins/maven-compiler-plugin/3.1/maven-compiler-plugin-3.1.jar
> [INFO] Downloaded:
> https://repo.maven.apache.org/maven2/org/apache/maven/plugins/maven-compiler-plugin/3.1/maven-compiler-plugin-3.1.jar
> (42 KB at 4660.3 KB/sec)
> [INFO] Downloading:
> https://repo.maven.apache.org/maven2/org/apache/maven/plugins/maven-surefire-plugin/2.17/maven-surefire-plugin-2.17.pom
> [INFO] Downloaded:
> https://repo.maven.apache.org/maven2/org/apache/maven/plugins/maven-surefire-plugin/2.17/maven-surefire-plugin-2.17.pom
> (5 KB at 488.4 KB/sec)
> [INFO] Downloading:
> https://repo.maven.apache.org/maven2/org/apache/maven/surefire/surefire/2.17/surefire-2.17.pom
> [INFO] Downloaded:
> https://repo.maven.apache.org/maven2/org/apache/maven/surefire/surefire/2.17/surefire-2.17.pom
> (17 KB at 1207.2 KB/sec)
> [INFO] Downloading:
> https://repo.maven.apache.org/maven2/org/apache/maven/plugins/maven-surefire-plugin/2.17/maven-surefire-plugin-2.17.jar
> [INFO] Downloaded:
> https://repo.maven.apache.org/maven2/org/apache/maven/plugins/maven-surefire-plugin/2.17/maven-surefire-plugin-2.17.jar
> (34 KB at 3039.0 KB/sec)
> [INFO] Downloading:
> https://repo.maven.apache.org/maven2/org/apache/maven/plugins/maven-jar-plugin/2.5/maven-jar-plugin-2.5.pom
> [INFO] Downloaded:
> https://repo.maven.apache.org/maven2/org/apache/maven/plugins/maven-jar-plugin/2.5/maven-jar-plugin-2.5.pom
> (8 KB at 514.1 KB/sec)
> [INFO] Downloading:
> https://repo.maven.apache.org/maven2/org/apache/maven/plugins/maven-jar-plugin/2.5/maven-jar-plugin-2.5.jar
> [INFO] Downloaded:
> https://repo.maven.apache.org/maven2/org/apache/maven/plugins/maven-jar-plugin/2.5/maven-jar-plugin-2.5.jar
> (25 KB at 2429.3 KB/sec)
> [INFO] Downloading:
> https://repo.maven.apache.org/maven2/org/apache/zookeeper/zookeeper/3.5.0-alpha/zookeeper-3.5.0-alpha.pom
> [INFO] Downloaded:
> https://repo.maven.apache.org/maven2/org/apache/zookeeper/zookeeper/3.5.0-alpha/zookeeper-3.5.0-alpha.pom
> (5 KB at 333.5 KB/sec)
> [INFO] Downloading:
> https://repo.maven.apache.org/maven2/org/slf4j/slf4j-api/1.7.6/slf4j-api-1.7.6.pom
> [INFO] Downloaded:
> https://repo.maven.apache.org/maven2/org/slf4j/slf4j-api/1.7.6/slf4j-api-1.7.6.pom
> (3 KB at 328.2 KB/sec)
> [INFO] Downloading:
> https://repo.maven.apache.org/maven2/org/slf4j/slf4j-parent/1.7.6/slf4j-parent-1.7.6.pom
> [INFO] Downloaded:
> https://repo.maven.apache.org/maven2/org/slf4j/slf4j-parent/1.7.6/slf4j-parent-1.7.6.pom
> (12 KB at 1162.8 KB/sec)
> [INFO] Downloading:
> https://repo.maven.apache.org/maven2/log4j/log4j/1.2.16/log4j-1.2.16.pom
> [INFO] Downloaded:
> https://repo.maven.apache.org/maven2/log4j/log4j/1.2.16/log4j-1.2.16.pom
> (20 KB at 1045.4 KB/sec)
> [INFO] Downloading:
> https://repo.maven.apache.org/maven2/io/netty/netty/3.7.0.Final/netty-3.7.0.Final.pom
> [INFO] Downloaded:
> https://repo.maven.apache.org/maven2/io/netty/netty/3.7.0.Final/netty-3.7.0.Final.pom
> (26 KB at 1968.4 KB/sec)
> [INFO] Downloading:
> https://repo.maven.apache.org/maven2/org/sonatype/oss/oss-parent/7/oss-parent-7.pom
> [INFO] Downloaded:
> https://repo.maven.apache.org/maven2/org/sonatype/oss/oss-parent/7/oss-parent-7.pom
> (5 KB at 673.0 KB/sec)
> [INFO] Downloading:
> https://repo.maven.apache.org/maven2/net/java/dev/javacc/javacc/5.0/javacc-5.0.pom
> [INFO] Downloaded:
> https://repo.maven.apache.org/maven2/net/java/dev/javacc/javacc/5.0/javacc-5.0.pom
> (3 KB at 202.8 KB/sec)
> [INFO] Downloading:
> https://repo.maven.apache.org/maven2/org/javassist/javassist/3.18.1-GA/javassist-3.18.1-GA.pom
> [INFO] Downloaded:
> https://repo.maven.apache.org/maven2/org/javassist/javassist/3.18.1-GA/javassist-3.18.1-GA.pom
> (10 KB at 1033.2 KB/sec)
> [INFO] Downloading:
> https://repo.maven.apache.org/maven2/org/apache/commons/commons-math/2.2/commons-math-2.2.pom
> [INFO] Downloaded:
> https://repo.maven.apache.org/maven2/org/apache/commons/commons-math/2.2/commons-math-2.2.pom
> (11 KB at 1091.8 KB/sec)
> [INFO] Downloading:
> https://repo.maven.apache.org/maven2/org/apache/commons/commons-parent/18/commons-parent-18.pom
> [INFO] Downloaded:
> https://repo.maven.apache.org/maven2/org/apache/commons/commons-parent/18/commons-parent-18.pom
> (33 KB at 2517.6 KB/sec)
> [INFO] Downloading:
> https://repo.maven.apache.org/maven2/com/google/guava/guava/16.0.1/guava-16.0.1.pom
> [INFO] Downloaded:
> https://repo.maven.apache.org/maven2/com/google/guava/guava/16.0.1/guava-16.0.1.pom
> (6 KB at 496.6 KB/sec)
> [INFO] Downloading:
> https://repo.maven.apache.org/maven2/com/google/guava/guava-parent/16.0.1/guava-parent-16.0.1.pom
> [INFO] Downloaded:
> https://repo.maven.apache.org/maven2/com/google/guava/guava-parent/16.0.1/guava-parent-16.0.1.pom
> (8 KB at 796.0 KB/sec)
> [INFO] Downloading:
> https://repo.maven.apache.org/maven2/org/testng/testng/6.8.8/testng-6.8.8.pom
> [INFO] Downloaded:
> https://repo.maven.apache.org/maven2/org/testng/testng/6.8.8/testng-6.8.8.pom
> (8 KB at 231.1 KB/sec)
> [INFO] Downloading:
> https://repo.maven.apache.org/maven2/org/sonatype/oss/oss-parent/3/oss-parent-3.pom
> [INFO] Downloaded:
> https://repo.maven.apache.org/maven2/org/sonatype/oss/oss-parent/3/oss-parent-3.pom
> (4 KB at 409.1 KB/sec)
> [INFO] Downloading:
> https://repo.maven.apache.org/maven2/org/beanshell/bsh/2.0b4/bsh-2.0b4.pom
> [INFO] Downloaded:
> https://repo.maven.apache.org/maven2/org/beanshell/bsh/2.0b4/bsh-2.0b4.pom
> (2 KB at 145.9 KB/sec)
> [INFO] Downloading:
> https://repo.maven.apache.org/maven2/org/beanshell/beanshell/2.0b4/beanshell-2.0b4.pom
> [INFO] Downloaded:
> https://repo.maven.apache.org/maven2/org/beanshell/beanshell/2.0b4/beanshell-2.0b4.pom
> (2 KB at 153.2 KB/sec)
> [INFO] Downloading:
> https://repo.maven.apache.org/maven2/com/beust/jcommander/1.27/jcommander-1.27.pom
> [INFO] Downloaded:
> https://repo.maven.apache.org/maven2/com/beust/jcommander/1.27/jcommander-1.27.pom
> (8 KB at 780.2 KB/sec)
> [INFO] Downloading:
> https://repo.maven.apache.org/maven2/org/slf4j/slf4j-log4j12/1.7.6/slf4j-log4j12-1.7.6.pom
> [INFO] Downloaded:
> https://repo.maven.apache.org/maven2/org/slf4j/slf4j-log4j12/1.7.6/slf4j-log4j12-1.7.6.pom
> (2 KB at 142.0 KB/sec)
> [INFO] Downloading:
> https://repo.maven.apache.org/maven2/log4j/log4j/1.2.17/log4j-1.2.17.pom
> [INFO] Downloaded:
> https://repo.maven.apache.org/maven2/log4j/log4j/1.2.17/log4j-1.2.17.pom
> (22 KB at 1930.5 KB/sec)
> [INFO] Downloading:
> https://repo.maven.apache.org/maven2/org/apache/zookeeper/zookeeper/3.5.0-alpha/zookeeper-3.5.0-alpha.jar
> [INFO] Downloading:
> https://repo.maven.apache.org/maven2/org/slf4j/slf4j-api/1.7.6/slf4j-api-1.7.6.jar
> [INFO] Downloading:
> https://repo.maven.apache.org/maven2/log4j/log4j/1.2.16/log4j-1.2.16.jar
> [INFO] Downloading:
> https://repo.maven.apache.org/maven2/io/netty/netty/3.7.0.Final/netty-3.7.0.Final.jar
> [INFO] Downloading:
> https://repo.maven.apache.org/maven2/net/java/dev/javacc/javacc/5.0/javacc-5.0.jar
> [INFO] Downloaded:
> https://repo.maven.apache.org/maven2/org/slf4j/slf4j-api/1.7.6/slf4j-api-1.7.6.jar
> (29 KB at 1751.0 KB/sec)
> [INFO] Downloading:
> https://repo.maven.apache.org/maven2/org/javassist/javassist/3.18.1-GA/javassist-3.18.1-GA.jar
> [INFO] Downloaded:
> https://repo.maven.apache.org/maven2/log4j/log4j/1.2.16/log4j-1.2.16.jar
> (471 KB at 10222.8 KB/sec)
> [INFO] Downloading:
> https://repo.maven.apache.org/maven2/org/apache/commons/commons-math/2.2/commons-math-2.2.jar
> [INFO] Downloaded:
> https://repo.maven.apache.org/maven2/net/java/dev/javacc/javacc/5.0/javacc-5.0.jar
> (292 KB at 6338.5 KB/sec)
> [INFO] Downloading:
> https://repo.maven.apache.org/maven2/com/google/guava/guava/16.0.1/guava-16.0.1.jar
> [INFO] Downloaded:
> https://repo.maven.apache.org/maven2/org/javassist/javassist/3.18.1-GA/javassist-3.18.1-GA.jar
> (698 KB at 7419.7 KB/sec)
> [INFO] Downloading:
> https://repo.maven.apache.org/maven2/org/testng/testng/6.8.8/testng-6.8.8.jar
> [INFO] Downloaded:
> https://repo.maven.apache.org/maven2/io/netty/netty/3.7.0.Final/netty-3.7.0.Final.jar
> (1181 KB at 9672.4 KB/sec)
> [INFO] Downloading:
> https://repo.maven.apache.org/maven2/org/beanshell/bsh/2.0b4/bsh-2.0b4.jar
> [INFO] Downloaded:
> https://repo.maven.apache.org/maven2/org/apache/zookeeper/zookeeper/3.5.0-alpha/zookeeper-3.5.0-alpha.jar
> (931 KB at 6889.4 KB/sec)
> [INFO] Downloading:
> https://repo.maven.apache.org/maven2/com/beust/jcommander/1.27/jcommander-1.27.jar
> [INFO] Downloaded:
> https://repo.maven.apache.org/maven2/org/apache/commons/commons-math/2.2/commons-math-2.2.jar
> (966 KB at 7204.1 KB/sec)
> [INFO] Downloading:
> https://repo.maven.apache.org/maven2/org/slf4j/slf4j-log4j12/1.7.6/slf4j-log4j12-1.7.6.jar
> [INFO] Downloaded:
> https://repo.maven.apache.org/maven2/org/beanshell/bsh/2.0b4/bsh-2.0b4.jar
> (276 KB at 1937.3 KB/sec)
> [INFO] Downloaded:
> https://repo.maven.apache.org/maven2/com/beust/jcommander/1.27/jcommander-1.27.jar
> (55 KB at 377.0 KB/sec)
> [INFO] Downloaded:
> https://repo.maven.apache.org/maven2/org/slf4j/slf4j-log4j12/1.7.6/slf4j-log4j12-1.7.6.jar
> (9 KB at 58.1 KB/sec)
> [INFO] Downloaded:
> https://repo.maven.apache.org/maven2/org/testng/testng/6.8.8/testng-6.8.8.jar
> (817 KB at 5170.1 KB/sec)
> [INFO] Downloaded:
> https://repo.maven.apache.org/maven2/com/google/guava/guava/16.0.1/guava-16.0.1.jar
> (2176 KB at 11157.9 KB/sec)
> [INFO]
> [INFO] --- maven-clean-plugin:2.5:clean (default-clean) @ curator-test ---
> [INFO]
> [INFO] --- maven-remote-resources-plugin:1.5:process (default) @
> curator-test ---
> [INFO]
> [INFO] --- maven-resources-plugin:2.6:resources (default-resources) @
> curator-test ---
> [INFO] Using 'UTF-8' encoding to copy filtered resources.
> [INFO] Copying 2 resources to META-INF
> [INFO] Copying 3 resources
> [INFO]
> [INFO] --- maven-compiler-plugin:3.1:compile (default-compile) @
> curator-test ---
> [INFO] Downloading:
> https://repo.maven.apache.org/maven2/org/apache/maven/maven-plugin-api/2.0.9/maven-plugin-api-2.0.9.pom
> [INFO] Downloaded:
> https://repo.maven.apache.org/maven2/org/apache/maven/maven-plugin-api/2.0.9/maven-plugin-api-2.0.9.pom
> (2 KB at 208.4 KB/sec)
> [INFO] Downloading:
> https://repo.maven.apache.org/maven2/org/apache/maven/maven/2.0.9/maven-2.0.9.pom
> [INFO] Downloaded:
> https://repo.maven.apache.org/maven2/org/apache/maven/maven/2.0.9/maven-2.0.9.pom
> (19 KB at 2308.0 KB/sec)
> [INFO] Downloading:
> https://repo.maven.apache.org/maven2/org/apache/maven/maven-artifact/2.0.9/maven-artifact-2.0.9.pom
> [INFO] Downloaded:
> https://repo.maven.apache.org/maven2/org/apache/maven/maven-artifact/2.0.9/maven-artifact-2.0.9.pom
> (2 KB at 225.9 KB/sec)
> [INFO] Downloading:
> https://repo.maven.apache.org/maven2/org/codehaus/plexus/plexus-utils/1.5.1/plexus-utils-1.5.1.pom
> [INFO] Downloaded:
> https://repo.maven.apache.org/maven2/org/codehaus/plexus/plexus-utils/1.5.1/plexus-utils-1.5.1.pom
> (3 KB at 224.2 KB/sec)
> [INFO] Downloading:
> https://repo.maven.apache.org/maven2/org/apache/maven/maven-core/2.0.9/maven-core-2.0.9.pom
> [INFO] Downloaded:
> https://repo.maven.apache.org/maven2/org/apache/maven/maven-core/2.0.9/maven-core-2.0.9.pom
> (8 KB at 844.7 KB/sec)
> [INFO] Downloading:
> https://repo.maven.apache.org/maven2/org/apache/maven/maven-settings/2.0.9/maven-settings-2.0.9.pom
> [INFO] Downloaded:
> https://repo.maven.apache.org/maven2/org/apache/maven/maven-settings/2.0.9/maven-settings-2.0.9.pom
> (3 KB at 251.2 KB/sec)
> [INFO] Downloading:
> https://repo.maven.apache.org/maven2/org/apache/maven/maven-model/2.0.9/maven-model-2.0.9.pom
> [INFO] Downloaded:
> https://repo.maven.apache.org/maven2/org/apache/maven/maven-model/2.0.9/maven-model-2.0.9.pom
> (4 KB at 438.1 KB/sec)
> [INFO] Downloading:
> https://repo.maven.apache.org/maven2/org/apache/maven/maven-plugin-parameter-documenter/2.0.9/maven-plugin-parameter-documenter-2.0.9.pom
> [INFO] Downloaded:
> https://repo.maven.apache.org/maven2/org/apache/maven/maven-plugin-parameter-documenter/2.0.9/maven-plugin-parameter-documenter-2.0.9.pom
> (2 KB at 239.7 KB/sec)
> [INFO] Downloading:
> https://repo.maven.apache.org/maven2/org/apache/maven/maven-profile/2.0.9/maven-profile-2.0.9.pom
> [INFO] Downloaded:
> https://repo.maven.apache.org/maven2/org/apache/maven/maven-profile/2.0.9/maven-profile-2.0.9.pom
> (3 KB at 286.0 KB/sec)
> [INFO] Downloading:
> https://repo.maven.apache.org/maven2/org/apache/maven/maven-repository-metadata/2.0.9/maven-repository-metadata-2.0.9.pom
> [INFO] Downloaded:
> https://repo.maven.apache.org/maven2/org/apache/maven/maven-repository-metadata/2.0.9/maven-repository-metadata-2.0.9.pom
> (2 KB at 232.1 KB/sec)
> [INFO] Downloading:
> https://repo.maven.apache.org/maven2/org/apache/maven/maven-error-diagnostics/2.0.9/maven-error-diagnostics-2.0.9.pom
> [INFO] Downloaded:
> https://repo.maven.apache.org/maven2/org/apache/maven/maven-error-diagnostics/2.0.9/maven-error-diagnostics-2.0.9.pom
> (2 KB at 89.6 KB/sec)
> [INFO] Downloading:
> https://repo.maven.apache.org/maven2/org/apache/maven/maven-project/2.0.9/maven-project-2.0.9.pom
> [INFO] Downloaded:
> https://repo.maven.apache.org/maven2/org/apache/maven/maven-project/2.0.9/maven-project-2.0.9.pom
> (3 KB at 50.9 KB/sec)
> [INFO] Downloading:
> https://repo.maven.apache.org/maven2/org/apache/maven/maven-artifact-manager/2.0.9/maven-artifact-manager-2.0.9.pom
> [INFO] Downloaded:
> https://repo.maven.apache.org/maven2/org/apache/maven/maven-artifact-manager/2.0.9/maven-artifact-manager-2.0.9.pom
> (3 KB at 146.5 KB/sec)
> [INFO] Downloading:
> https://repo.maven.apache.org/maven2/org/apache/maven/maven-plugin-registry/2.0.9/maven-plugin-registry-2.0.9.pom
> [INFO] Downloaded:
> https://repo.maven.apache.org/maven2/org/apache/maven/maven-plugin-registry/2.0.9/maven-plugin-registry-2.0.9.pom
> (2 KB at 213.9 KB/sec)
> [INFO] Downloading:
> https://repo.maven.apache.org/maven2/org/apache/maven/maven-plugin-descriptor/2.0.9/maven-plugin-descriptor-2.0.9.pom
> [INFO] Downloaded:
> https://repo.maven.apache.org/maven2/org/apache/maven/maven-plugin-descriptor/2.0.9/maven-plugin-descriptor-2.0.9.pom
> (3 KB at 253.3 KB/sec)
> [INFO] Downloading:
> https://repo.maven.apache.org/maven2/org/apache/maven/maven-monitor/2.0.9/maven-monitor-2.0.9.pom
> [INFO] Downloaded:
> https://repo.maven.apache.org/maven2/org/apache/maven/maven-monitor/2.0.9/maven-monitor-2.0.9.pom
> (2 KB at 179.3 KB/sec)
> [INFO] Downloading:
> https://repo.maven.apache.org/maven2/org/apache/maven/maven-toolchain/1.0/maven-toolchain-1.0.pom
> [INFO] Downloaded:
> https://repo.maven.apache.org/maven2/org/apache/maven/maven-toolchain/1.0/maven-toolchain-1.0.pom
> (4 KB at 416.7 KB/sec)
> [INFO] Downloading:
> https://repo.maven.apache.org/maven2/org/apache/maven/shared/maven-shared-utils/0.1/maven-shared-utils-0.1.pom
> [INFO] Downloaded:
> https://repo.maven.apache.org/maven2/org/apache/maven/shared/maven-shared-utils/0.1/maven-shared-utils-0.1.pom
> (4 KB at 494.0 KB/sec)
> [INFO] Downloading:
> https://repo.maven.apache.org/maven2/org/apache/maven/shared/maven-shared-incremental/1.1/maven-shared-incremental-1.1.pom
> [INFO] Downloaded:
> https://repo.maven.apache.org/maven2/org/apache/maven/shared/maven-shared-incremental/1.1/maven-shared-incremental-1.1.pom
> (5 KB at 661.6 KB/sec)
> [INFO] Downloading:
> https://repo.maven.apache.org/maven2/org/apache/maven/shared/maven-shared-components/19/maven-shared-components-19.pom
> [INFO] Downloaded:
> https://repo.maven.apache.org/maven2/org/apache/maven/shared/maven-shared-components/19/maven-shared-components-19.pom
> (7 KB at 776.2 KB/sec)
> [INFO] Downloading:
> https://repo.maven.apache.org/maven2/org/codehaus/plexus/plexus-compiler-api/2.2/plexus-compiler-api-2.2.pom
> [INFO] Downloaded:
> https://repo.maven.apache.org/maven2/org/codehaus/plexus/plexus-compiler-api/2.2/plexus-compiler-api-2.2.pom
> (865 B at 140.8 KB/sec)
> [INFO] Downloading:
> https://repo.maven.apache.org/maven2/org/codehaus/plexus/plexus-compiler/2.2/plexus-compiler-2.2.pom
> [INFO] Downloaded:
> https://repo.maven.apache.org/maven2/org/codehaus/plexus/plexus-compiler/2.2/plexus-compiler-2.2.pom
> (4 KB at 504.2 KB/sec)
> [INFO] Downloading:
> https://repo.maven.apache.org/maven2/org/codehaus/plexus/plexus-components/1.3.1/plexus-components-1.3.1.pom
> [INFO] Downloaded:
> https://repo.maven.apache.org/maven2/org/codehaus/plexus/plexus-components/1.3.1/plexus-components-1.3.1.pom
> (3 KB at 427.5 KB/sec)
> [INFO] Downloading:
> https://repo.maven.apache.org/maven2/org/codehaus/plexus/plexus-utils/3.0.8/plexus-utils-3.0.8.pom
> [INFO] Downloaded:
> https://repo.maven.apache.org/maven2/org/codehaus/plexus/plexus-utils/3.0.8/plexus-utils-3.0.8.pom
> (4 KB at 438.3 KB/sec)
> [INFO] Downloading:
> https://repo.maven.apache.org/maven2/org/codehaus/plexus/plexus-compiler-manager/2.2/plexus-compiler-manager-2.2.pom
> [INFO] Downloaded:
> https://repo.maven.apache.org/maven2/org/codehaus/plexus/plexus-compiler-manager/2.2/plexus-compiler-manager-2.2.pom
> (690 B at 96.3 KB/sec)
> [INFO] Downloading:
> https://repo.maven.apache.org/maven2/org/codehaus/plexus/plexus-compiler-javac/2.2/plexus-compiler-javac-2.2.pom
> [INFO] Downloaded:
> https://repo.maven.apache.org/maven2/org/codehaus/plexus/plexus-compiler-javac/2.2/plexus-compiler-javac-2.2.pom
> (769 B at 107.3 KB/sec)
> [INFO] Downloading:
> https://repo.maven.apache.org/maven2/org/codehaus/plexus/plexus-compilers/2.2/plexus-compilers-2.2.pom
> [INFO] Downloaded:
> https://repo.maven.apache.org/maven2/org/codehaus/plexus/plexus-compilers/2.2/plexus-compilers-2.2.pom
> (2 KB at 202.0 KB/sec)
> [INFO] Downloading:
> https://repo.maven.apache.org/maven2/org/codehaus/plexus/plexus-utils/1.5.1/plexus-utils-1.5.1.jar
> [INFO] Downloading:
> https://repo.maven.apache.org/maven2/org/apache/maven/shared/maven-shared-utils/0.1/maven-shared-utils-0.1.jar
> [INFO] Downloading:
> https://repo.maven.apache.org/maven2/org/apache/maven/shared/maven-shared-incremental/1.1/maven-shared-incremental-1.1.jar
> [INFO] Downloading:
> https://repo.maven.apache.org/maven2/org/codehaus/plexus/plexus-compiler-api/2.2/plexus-compiler-api-2.2.jar
> [INFO] Downloading:
> https://repo.maven.apache.org/maven2/org/codehaus/plexus/plexus-compiler-manager/2.2/plexus-compiler-manager-2.2.jar
> [INFO] Downloaded:
> https://repo.maven.apache.org/maven2/org/apache/maven/shared/maven-shared-incremental/1.1/maven-shared-incremental-1.1.jar
> (14 KB at 1322.1 KB/sec)
> [INFO] Downloading:
> https://repo.maven.apache.org/maven2/org/codehaus/plexus/plexus-compiler-javac/2.2/plexus-compiler-javac-2.2.jar
> [INFO] Downloaded:
> https://repo.maven.apache.org/maven2/org/codehaus/plexus/plexus-compiler-api/2.2/plexus-compiler-api-2.2.jar
> (25 KB at 1877.3 KB/sec)
> [INFO] Downloading:
> https://repo.maven.apache.org/maven2/com/google/collections/google-collections/1.0/google-collections-1.0.jar
> [INFO] Downloaded:
> https://repo.maven.apache.org/maven2/org/codehaus/plexus/plexus-compiler-manager/2.2/plexus-compiler-manager-2.2.jar
> (5 KB at 342.6 KB/sec)
> [INFO] Downloading:
> https://repo.maven.apache.org/maven2/junit/junit/3.8.2/junit-3.8.2.jar
> [INFO] Downloaded:
> https://repo.maven.apache.org/maven2/org/apache/maven/shared/maven-shared-utils/0.1/maven-shared-utils-0.1.jar
> (151 KB at 6859.0 KB/sec)
> [INFO] Downloaded:
> https://repo.maven.apache.org/maven2/org/codehaus/plexus/plexus-compiler-javac/2.2/plexus-compiler-javac-2.2.jar
> (19 KB at 882.2 KB/sec)
> [INFO] Downloaded:
> https://repo.maven.apache.org/maven2/org/codehaus/plexus/plexus-utils/1.5.1/plexus-utils-1.5.1.jar
> (206 KB at 8572.6 KB/sec)
> [INFO] Downloaded:
> https://repo.maven.apache.org/maven2/junit/junit/3.8.2/junit-3.8.2.jar
> (118 KB at 3927.1 KB/sec)
> [INFO] Downloaded:
> https://repo.maven.apache.org/maven2/com/google/collections/google-collections/1.0/google-collections-1.0.jar
> (625 KB at 11153.6 KB/sec)
> [INFO] Changes detected - recompiling the module!
> [INFO] Compiling 17 source files to <
> https://builds.apache.org/job/Curator-3.0/ws/curator-test/target/classes>
> [INFO]
> ------------------------------------------------------------------------
> [INFO] Reactor Summary:
> [INFO]
> [INFO] Apache Curator ..................................... SUCCESS [
> 11.883 s]
> [INFO] Curator Testing .................................... FAILURE [
> 2.342 s]
> [INFO] Curator Client ..................................... SKIPPED
> [INFO] Curator Framework .................................. SKIPPED
> [INFO] Curator Recipes .................................... SKIPPED
> [INFO] Curator Service Discovery .......................... SKIPPED
> [INFO] Curator Examples ................................... SKIPPED
> [INFO] Curator Service Discovery Server ................... SKIPPED
> [INFO] Curator RPC Proxy .................................. SKIPPED
> [INFO]
> ------------------------------------------------------------------------
> [INFO] BUILD FAILURE
> [INFO]
> ------------------------------------------------------------------------
> [INFO] Total time: 22.814 s
> [INFO] Finished at: 2015-08-25T18:20:52+00:00
> [INFO] Final Memory: 22M/244M
> [INFO]
> ------------------------------------------------------------------------
> [ERROR] Failed to execute goal
> org.apache.maven.plugins:maven-compiler-plugin:3.1:compile
> (default-compile) on project curator-test: Fatal error compiling: invalid
> target release: 1.7 -> [Help 1]
> [ERROR]
> [ERROR] To see the full stack trace of the errors, re-run Maven with the
> -e switch.
> [ERROR] Re-run Maven using the -X switch to enable full debug logging.
> [ERROR]
> [ERROR] For more information about the errors and possible solutions,
> please read the following articles:
> [ERROR] [Help 1]
> http://cwiki.apache.org/confluence/display/MAVEN/MojoExecutionException
> [ERROR]
> [ERROR] After correcting the problems, you can resume the build with the
> command
> [ERROR]   mvn <goals> -rf :curator-test
> [JENKINS] Archiving <
> https://builds.apache.org/job/Curator-3.0/ws/curator-x-rpc/pom.xml> to
> org.apache.curator/curator-x-rpc/3.0.0-SNAPSHOT/curator-x-rpc-3.0.0-SNAPSHOT.pom
> Sending artifact delta relative to Curator-3.0 » Curator RPC Proxy #1
> Archived 1 artifacts
> Archive block size is 32768
> Received 0 blocks and 7132 bytes
> Compression is 0.0%
> Took 2.8 sec
> [JENKINS] Archiving <
> https://builds.apache.org/job/Curator-3.0/ws/curator-client/pom.xml> to
> org.apache.curator/curator-client/3.0.0-SNAPSHOT/curator-client-3.0.0-SNAPSHOT.pom
> No artifacts from Curator-3.0 » Curator Client #2 to compare, so
> performing full copy of artifacts
> [JENKINS] Archiving <
> https://builds.apache.org/job/Curator-3.0/ws/curator-framework/pom.xml>
> to
> org.apache.curator/curator-framework/3.0.0-SNAPSHOT/curator-framework-3.0.0-SNAPSHOT.pom
> No artifacts from Curator-3.0 » Curator Framework #2 to compare, so
> performing full copy of artifacts
> [JENKINS] Archiving <
> https://builds.apache.org/job/Curator-3.0/ws/curator-x-discovery-server/pom.xml>
> to
> org.apache.curator/curator-x-discovery-server/3.0.0-SNAPSHOT/curator-x-discovery-server-3.0.0-SNAPSHOT.pom
> Sending artifact delta relative to Curator-3.0 » Curator Service Discovery
> Server #1
> Archived 1 artifacts
> Archive block size is 32768
> Received 0 blocks and 4209 bytes
> Compression is 0.0%
> Took 0.15 sec
> [JENKINS] Archiving <
> https://builds.apache.org/job/Curator-3.0/ws/curator-examples/pom.xml> to
> org.apache.curator/curator-examples/3.0.0-SNAPSHOT/curator-examples-3.0.0-SNAPSHOT.pom
> Sending artifact delta relative to Curator-3.0 » Curator Examples #1
> Archived 1 artifacts
> Archive block size is 32768
> Received 0 blocks and 2223 bytes
> Compression is 0.0%
> Took 0.16 sec
> [JENKINS] Archiving <
> https://builds.apache.org/job/Curator-3.0/ws/curator-test/pom.xml> to
> org.apache.curator/curator-test/3.0.0-SNAPSHOT/curator-test-3.0.0-SNAPSHOT.pom
> No artifacts from Curator-3.0 » Curator Testing #2 to compare, so
> performing full copy of artifacts
> [JENKINS] Archiving <
> https://builds.apache.org/job/Curator-3.0/ws/curator-recipes/pom.xml> to
> org.apache.curator/curator-recipes/3.0.0-SNAPSHOT/curator-recipes-3.0.0-SNAPSHOT.pom
> Sending artifact delta relative to Curator-3.0 » Curator Recipes #1
> Archived 1 artifacts
> Archive block size is 32768
> Received 0 blocks and 2810 bytes
> Compression is 0.0%
> Took 0.15 sec
> [JENKINS] Archiving <https://builds.apache.org/job/Curator-3.0/ws/pom.xml>
> to
> org.apache.curator/apache-curator/3.0.0-SNAPSHOT/apache-curator-3.0.0-SNAPSHOT.pom
> [JENKINS] Archiving <
> https://builds.apache.org/job/Curator-3.0/ws/target/apache-curator-3.0.0-SNAPSHOT-site.xml>
> to
> org.apache.curator/apache-curator/3.0.0-SNAPSHOT/apache-curator-3.0.0-SNAPSHOT-site.xml
> No artifacts from Curator-3.0 » Apache Curator #2 to compare, so
> performing full copy of artifacts
> [JENKINS] Archiving <
> https://builds.apache.org/job/Curator-3.0/ws/curator-x-discovery/pom.xml>
> to
> org.apache.curator/curator-x-discovery/3.0.0-SNAPSHOT/curator-x-discovery-3.0.0-SNAPSHOT.pom
> Sending artifact delta relative to Curator-3.0 » Curator Service Discovery
> #1
> Archived 1 artifacts
> Archive block size is 32768
> Received 0 blocks and 2585 bytes
> Compression is 0.0%
> Took 0.15 sec
> Sending e-mails to: dev@curator.apache.org
> channel stopped
>

Mime
  • Unnamed multipart/alternative (inline, None, 0 bytes)
View raw message