curator-dev mailing list archives

Site index · List index
Message view « Date » · « Thread »
Top « Date » · « Thread »
From Apache Jenkins Server <jenk...@builds.apache.org>
Subject Build failed in Jenkins: Curator #935
Date Sat, 09 May 2015 15:19:16 GMT
See <https://builds.apache.org/job/Curator/935/changes>

Changes:

[randgalt] [maven-release-plugin] prepare release apache-curator-2.8.0

[randgalt] [maven-release-plugin] prepare for next development iteration

[randgalt] Don't show RPC report

------------------------------------------
[...truncated 231 lines...]
[INFO] 
[INFO] --- maven-surefire-plugin:2.17:test (default-test) @ curator-client ---
[INFO] Surefire report directory: <https://builds.apache.org/job/Curator/ws/curator-client/target/surefire-reports>

-------------------------------------------------------
 T E S T S
-------------------------------------------------------

-------------------------------------------------------
 T E S T S
-------------------------------------------------------
Running org.apache.curator.utils.TestZKPaths
Tests run: 2, Failures: 0, Errors: 0, Skipped: 0, Time elapsed: 0.313 sec - in org.apache.curator.utils.TestZKPaths
Running org.apache.curator.utils.TestCloseableExecutorService
Tests run: 5, Failures: 0, Errors: 0, Skipped: 0, Time elapsed: 0.45 sec - in org.apache.curator.utils.TestCloseableExecutorService
Running org.apache.curator.utils.TestCloseableScheduledExecutorService
Tests run: 2, Failures: 0, Errors: 0, Skipped: 0, Time elapsed: 2.422 sec - in org.apache.curator.utils.TestCloseableScheduledExecutorService
Running org.apache.curator.TestSessionFailRetryLoop
Tests run: 4, Failures: 0, Errors: 0, Skipped: 0, Time elapsed: 11.619 sec - in org.apache.curator.TestSessionFailRetryLoop
Running org.apache.curator.TestEnsurePath
Tests run: 2, Failures: 0, Errors: 0, Skipped: 0, Time elapsed: 0.599 sec - in org.apache.curator.TestEnsurePath
Running org.apache.curator.TestRetryLoop
Tests run: 3, Failures: 0, Errors: 0, Skipped: 0, Time elapsed: 13.142 sec - in org.apache.curator.TestRetryLoop
Running org.apache.curator.ensemble.exhibitor.TestExhibitorEnsembleProvider
Tests run: 3, Failures: 0, Errors: 0, Skipped: 0, Time elapsed: 6.709 sec - in org.apache.curator.ensemble.exhibitor.TestExhibitorEnsembleProvider

Results :

Tests run: 21, Failures: 0, Errors: 0, Skipped: 0

[JENKINS] Recording test results
log4j:WARN No appenders could be found for logger (org.apache.commons.beanutils.converters.BooleanConverter).
log4j:WARN Please initialize the log4j system properly.
[INFO] 
[INFO] --- maven-bundle-plugin:2.3.7:bundle (default-bundle) @ curator-client ---
[INFO] 
[INFO] --- maven-site-plugin:3.4:attach-descriptor (attach-descriptor) @ curator-client ---
[INFO] 
[INFO] --- maven-license-plugin:1.9.0:check (license) @ curator-client ---
[INFO] Checking licenses...
[CHECKSTYLE] No report found for mojo check[INFO] 
[INFO] --- maven-install-plugin:2.5.2:install (default-install) @ curator-client ---
[INFO] Installing <https://builds.apache.org/job/Curator/ws/curator-client/target/curator-client-2.8.1-SNAPSHOT.jar>
to /home/jenkins/jenkins-slave/maven-repositories/1/org/apache/curator/curator-client/2.8.1-SNAPSHOT/curator-client-2.8.1-SNAPSHOT.jar
[INFO] Installing <https://builds.apache.org/job/Curator/ws/curator-client/pom.xml>
to /home/jenkins/jenkins-slave/maven-repositories/1/org/apache/curator/curator-client/2.8.1-SNAPSHOT/curator-client-2.8.1-SNAPSHOT.pom

[INFO] 
[INFO] --- maven-bundle-plugin:2.3.7:install (default-install) @ curator-client ---
[INFO] Installing org/apache/curator/curator-client/2.8.1-SNAPSHOT/curator-client-2.8.1-SNAPSHOT.jar
[INFO] Writing OBR metadata
[INFO]                                                                         
[INFO] ------------------------------------------------------------------------
[INFO] Building Curator Framework 2.8.1-SNAPSHOT
[INFO] ------------------------------------------------------------------------
[INFO] 
[INFO] --- maven-clean-plugin:2.5:clean (default-clean) @ curator-framework ---
[INFO] 
[INFO] --- maven-remote-resources-plugin:1.5:process (default) @ curator-framework ---
[INFO] 
[INFO] --- maven-resources-plugin:2.6:resources (default-resources) @ curator-framework ---
[INFO] Using 'UTF-8' encoding to copy filtered resources.
[INFO] Copying 2 resources to META-INF
[INFO] Copying 3 resources
[INFO] 
[INFO] --- maven-compiler-plugin:3.1:compile (default-compile) @ curator-framework ---
[INFO] Changes detected - recompiling the module!
[INFO] Compiling 97 source files to <https://builds.apache.org/job/Curator/ws/curator-framework/target/classes>
[WARNING] Note: Some input files use or override a deprecated API.
[WARNING] Note: Recompile with -Xlint:deprecation for details.
[INFO] 
[INFO] --- maven-remote-resources-plugin:1.5:process (default) @ curator-framework ---
[INFO] 
[INFO] --- maven-resources-plugin:2.6:resources (default-resources) @ curator-framework ---
[INFO] Using 'UTF-8' encoding to copy filtered resources.
[INFO] Copying 2 resources to META-INF
[INFO] Copying 3 resources
[INFO] Copying 3 resources
[INFO] 
[INFO] --- maven-compiler-plugin:3.1:compile (default-compile) @ curator-framework ---
[INFO] Nothing to compile - all classes are up to date
[WARNING] Failed to getClass for org.codehaus.mojo.clirr.ClirrCheckMojo
[CHECKSTYLE] No report found for mojo check[INFO] 
[INFO] --- clirr-maven-plugin:2.6.1:check (default) @ curator-framework ---
[INFO] artifact org.apache.curator:curator-framework: checking for updates from Nexus

[INFO] artifact org.apache.curator:curator-framework: checking for updates from central
[INFO] Comparing to version: 2.7.1
Downloading: http://repo.maven.apache.org/maven2/org/apache/curator/curator-framework/2.7.1/curator-framework-2.7.1.jar
Downloaded: http://repo.maven.apache.org/maven2/org/apache/curator/curator-framework/2.7.1/curator-framework-2.7.1.jar
(182 KB at 645.1 KB/sec)
Downloading: http://repo.maven.apache.org/maven2/org/apache/curator/curator-framework/2.7.1/curator-framework-2.7.1.pom
Downloaded: http://repo.maven.apache.org/maven2/org/apache/curator/curator-framework/2.7.1/curator-framework-2.7.1.pom
(3 KB at 28.6 KB/sec)
[INFO] Succeeded with 0 errors; 0 warnings; and 0 other changes.
[CHECKSTYLE] No report found for mojo check[INFO] 
[INFO] --- maven-bundle-plugin:2.3.7:manifest (bundle-manifest) @ curator-framework ---

[INFO] 
[INFO] --- maven-resources-plugin:2.6:testResources (default-testResources) @ curator-framework
---
[INFO] Using 'UTF-8' encoding to copy filtered resources.
[INFO] Copying 1 resource
[INFO] Copying 3 resources
[INFO] 
[INFO] --- maven-compiler-plugin:3.1:testCompile (default-testCompile) @ curator-framework
---
[INFO] Changes detected - recompiling the module!
[INFO] Compiling 15 source files to <https://builds.apache.org/job/Curator/ws/curator-framework/target/test-classes>
[INFO] 
[INFO] --- maven-surefire-plugin:2.17:test (default-test) @ curator-framework ---
[INFO] Surefire report directory: <https://builds.apache.org/job/Curator/ws/curator-framework/target/surefire-reports>

-------------------------------------------------------
 T E S T S
-------------------------------------------------------

-------------------------------------------------------
 T E S T S
-------------------------------------------------------
Running org.apache.curator.framework.imps.TestTransactions
Tests run: 3, Failures: 0, Errors: 0, Skipped: 0, Time elapsed: 4.902 sec - in org.apache.curator.framework.imps.TestTransactions
Running org.apache.curator.framework.imps.TestCompression
Tests run: 3, Failures: 0, Errors: 0, Skipped: 0, Time elapsed: 4.886 sec - in org.apache.curator.framework.imps.TestCompression
Running org.apache.curator.framework.imps.TestFailedDeleteManager
Tests run: 6, Failures: 0, Errors: 0, Skipped: 0, Time elapsed: 322.942 sec - in org.apache.curator.framework.imps.TestFailedDeleteManager
Running org.apache.curator.framework.imps.TestWithCluster
Tests run: 2, Failures: 0, Errors: 0, Skipped: 0, Time elapsed: 181.878 sec - in org.apache.curator.framework.imps.TestWithCluster
Running org.apache.curator.framework.imps.TestBlockUntilConnected
Tests run: 5, Failures: 0, Errors: 0, Skipped: 0, Time elapsed: 31.973 sec - in org.apache.curator.framework.imps.TestBlockUntilConnected
Running org.apache.curator.framework.imps.TestReadOnly
Tests run: 2, Failures: 0, Errors: 0, Skipped: 0, Time elapsed: 65.79 sec - in org.apache.curator.framework.imps.TestReadOnly
Running org.apache.curator.framework.imps.TestCompressionInTransaction
Tests run: 4, Failures: 0, Errors: 0, Skipped: 0, Time elapsed: 5.9 sec - in org.apache.curator.framework.imps.TestCompressionInTransaction
Running org.apache.curator.framework.imps.TestTempFramework
Tests run: 2, Failures: 0, Errors: 0, Skipped: 0, Time elapsed: 5.946 sec - in org.apache.curator.framework.imps.TestTempFramework
Running org.apache.curator.framework.imps.TestFramework
Running org.apache.curator.framework.imps.TestNamespaceFacade
Tests run: 8, Failures: 0, Errors: 0, Skipped: 0, Time elapsed: 10.082 sec - in org.apache.curator.framework.imps.TestNamespaceFacade
Running org.apache.curator.framework.imps.TestNeverConnected
Tests run: 1, Failures: 0, Errors: 0, Skipped: 0, Time elapsed: 3.622 sec - in org.apache.curator.framework.imps.TestNeverConnected
Running org.apache.curator.framework.imps.TestFrameworkBackground
Tests run: 5, Failures: 0, Errors: 0, Skipped: 0, Time elapsed: 29.929 sec - in org.apache.curator.framework.imps.TestFrameworkBackground
Running org.apache.curator.framework.imps.TestFrameworkEdges
Tests run: 13, Failures: 0, Errors: 0, Skipped: 0, Time elapsed: 146.099 sec - in org.apache.curator.framework.imps.TestFrameworkEdges
Running org.apache.curator.framework.imps.TestMultiClient
Tests run: 1, Failures: 0, Errors: 0, Skipped: 0, Time elapsed: 1.824 sec - in org.apache.curator.framework.imps.TestMultiClient
Running org.apache.curator.framework.imps.TestWatcherIdentity
Tests run: 4, Failures: 0, Errors: 0, Skipped: 0, Time elapsed: 36.032 sec - in org.apache.curator.framework.imps.TestWatcherIdentity

Results :

Tests run: 59, Failures: 0, Errors: 0, Skipped: 0

[JENKINS] Recording test results
[INFO] ------------------------------------------------------------------------
[INFO] Reactor Summary:
[INFO] 
[INFO] Apache Curator .................................... SUCCESS [5.414s]
[INFO] Curator Testing ................................... SUCCESS [4.431s]
[INFO] Curator Client .................................... SUCCESS [47.434s]
[INFO] Curator Framework ................................. FAILURE [14:20.527s]
[INFO] Curator Recipes ................................... SKIPPED
[INFO] Curator Service Discovery ......................... SKIPPED
[INFO] Curator Examples .................................. SKIPPED
[INFO] Curator Service Discovery Server .................. SKIPPED
[INFO] Curator RPC Proxy ................................. SKIPPED
[INFO] ------------------------------------------------------------------------
[INFO] BUILD FAILURE
[INFO] ------------------------------------------------------------------------
[INFO] Total time: 15:20.623s
[INFO] Finished at: Sat May 09 15:19:12 UTC 2015
[INFO] Final Memory: 30M/669M
[INFO] ------------------------------------------------------------------------
Waiting for Jenkins to finish collecting data[ERROR] Failed to execute goal org.apache.maven.plugins:maven-surefire-plugin:2.17:test
(default-test) on project curator-framework: ExecutionException: java.lang.RuntimeException:
The forked VM terminated without properly saying goodbye. VM crash or System.exit called?
[ERROR] Command was /bin/sh -c cd <https://builds.apache.org/job/Curator/ws/curator-framework>
&& /home/jenkins/tools/java/jdk1.6.0_45-32/jre/bin/java -jar <https://builds.apache.org/job/Curator/ws/curator-framework/target/surefire/surefirebooter8802011528764252912.jar>
<https://builds.apache.org/job/Curator/ws/curator-framework/target/surefire/surefire213471169243108831tmp>
<https://builds.apache.org/job/Curator/ws/curator-framework/target/surefire/surefire_157628101877124342632tmp>
[ERROR] -> [Help 1]
[ERROR] 
[ERROR] To see the full stack trace of the errors, re-run Maven with the -e switch.
[ERROR] Re-run Maven using the -X switch to enable full debug logging.
[ERROR] 
[ERROR] For more information about the errors and possible solutions, please read the following
articles:
[ERROR] [Help 1] http://cwiki.apache.org/confluence/display/MAVEN/MojoFailureException
[ERROR] 
[ERROR] After correcting the problems, you can resume the build with the command
[ERROR]   mvn <goals> -rf :curator-framework

[JENKINS] Archiving <https://builds.apache.org/job/Curator/ws/curator-x-rpc/pom.xml>
to org.apache.curator/curator-x-rpc/2.8.1-SNAPSHOT/curator-x-rpc-2.8.1-SNAPSHOT.pom
Sending artifact delta relative to Curator » Curator RPC Proxy #934
Archived 1 artifacts
Archive block size is 32768
Received 0 blocks and 6970 bytes
Compression is 0.0%
Took 0.8 sec
[JENKINS] Archiving <https://builds.apache.org/job/Curator/ws/curator-client/pom.xml>
to org.apache.curator/curator-client/2.8.1-SNAPSHOT/curator-client-2.8.1-SNAPSHOT.pom
[JENKINS] Archiving <https://builds.apache.org/job/Curator/ws/curator-client/target/curator-client-2.8.1-SNAPSHOT.jar>
to org.apache.curator/curator-client/2.8.1-SNAPSHOT/curator-client-2.8.1-SNAPSHOT.jar
Sending artifact delta relative to Curator » Curator Client #934
Archived 2 artifacts
Archive block size is 32768
Received 0 blocks and 72133 bytes
Compression is 0.0%
Took 75 ms
[JENKINS] Archiving <https://builds.apache.org/job/Curator/ws/curator-framework/pom.xml>
to org.apache.curator/curator-framework/2.8.1-SNAPSHOT/curator-framework-2.8.1-SNAPSHOT.pom
Sending artifact delta relative to Curator » Curator Framework #934
Archived 1 artifacts
Archive block size is 32768
Received 0 blocks and 2283 bytes
Compression is 0.0%
Took 32 ms
[JENKINS] Archiving <https://builds.apache.org/job/Curator/ws/curator-x-discovery-server/pom.xml>
to org.apache.curator/curator-x-discovery-server/2.8.1-SNAPSHOT/curator-x-discovery-server-2.8.1-SNAPSHOT.pom
Sending artifact delta relative to Curator » Curator Service Discovery Server #934
Archived 1 artifacts
Archive block size is 32768
Received 0 blocks and 4047 bytes
Compression is 0.0%
Took 30 ms
[JENKINS] Archiving <https://builds.apache.org/job/Curator/ws/curator-examples/pom.xml>
to org.apache.curator/curator-examples/2.8.1-SNAPSHOT/curator-examples-2.8.1-SNAPSHOT.pom
Sending artifact delta relative to Curator » Curator Examples #934
Archived 1 artifacts
Archive block size is 32768
Received 0 blocks and 2055 bytes
Compression is 0.0%
Took 31 ms
[JENKINS] Archiving <https://builds.apache.org/job/Curator/ws/curator-test/pom.xml>
to org.apache.curator/curator-test/2.8.1-SNAPSHOT/curator-test-2.8.1-SNAPSHOT.pom
[JENKINS] Archiving <https://builds.apache.org/job/Curator/ws/curator-test/target/curator-test-2.8.1-SNAPSHOT.jar>
to org.apache.curator/curator-test/2.8.1-SNAPSHOT/curator-test-2.8.1-SNAPSHOT.jar
Sending artifact delta relative to Curator » Curator Testing #934
Archived 2 artifacts
Archive block size is 32768
Received 0 blocks and 42261 bytes
Compression is 0.0%
Took 34 ms
[JENKINS] Archiving <https://builds.apache.org/job/Curator/ws/curator-recipes/pom.xml>
to org.apache.curator/curator-recipes/2.8.1-SNAPSHOT/curator-recipes-2.8.1-SNAPSHOT.pom
Sending artifact delta relative to Curator » Curator Recipes #934
Archived 1 artifacts
Archive block size is 32768
Received 0 blocks and 2480 bytes
Compression is 0.0%
Took 50 ms
[JENKINS] Archiving <https://builds.apache.org/job/Curator/ws/pom.xml> to org.apache.curator/apache-curator/2.8.1-SNAPSHOT/apache-curator-2.8.1-SNAPSHOT.pom
[JENKINS] Archiving <https://builds.apache.org/job/Curator/ws/target/apache-curator-2.8.1-SNAPSHOT-site.xml>
to org.apache.curator/apache-curator/2.8.1-SNAPSHOT/apache-curator-2.8.1-SNAPSHOT-site.xml
Sending artifact delta relative to Curator » Apache Curator #934
Archived 2 artifacts
Archive block size is 32768
Received 0 blocks and 36349 bytes
Compression is 0.0%
Took 48 ms
[JENKINS] Archiving <https://builds.apache.org/job/Curator/ws/curator-x-discovery/pom.xml>
to org.apache.curator/curator-x-discovery/2.8.1-SNAPSHOT/curator-x-discovery-2.8.1-SNAPSHOT.pom
Sending artifact delta relative to Curator » Curator Service Discovery #934
Archived 1 artifacts
Archive block size is 32768
Received 0 blocks and 2423 bytes
Compression is 0.0%
Took 28 ms
Sending e-mails to: dev@curator.apache.org
channel stopped

Mime
View raw message