curator-dev mailing list archives

Site index · List index
Message view « Date » · « Thread »
Top « Date » · « Thread »
From Apache Jenkins Server <jenk...@builds.apache.org>
Subject Build failed in Jenkins: Curator » Curator Recipes #930
Date Wed, 22 Apr 2015 01:21:51 GMT
See <https://builds.apache.org/job/Curator/org.apache.curator$curator-recipes/930/changes>

Changes:

[cameron] CURATOR-154 - Modified the handling for creating the ephemeral node so

------------------------------------------
[INFO]                                                                         
[INFO] ------------------------------------------------------------------------
[INFO] Building Curator Recipes 2.7.2-SNAPSHOT
[INFO] ------------------------------------------------------------------------
[INFO] 
[INFO] --- maven-clean-plugin:2.5:clean (default-clean) @ curator-recipes ---
[INFO] 
[INFO] --- maven-remote-resources-plugin:1.5:process (default) @ curator-recipes ---
[INFO] 
[INFO] --- maven-resources-plugin:2.6:resources (default-resources) @ curator-recipes ---
[INFO] Using 'UTF-8' encoding to copy filtered resources.
[INFO] Copying 2 resources to META-INF
[INFO] Copying 3 resources
[INFO] 
[INFO] --- maven-compiler-plugin:3.1:compile (default-compile) @ curator-recipes ---
[INFO] Changes detected - recompiling the module!
[INFO] Compiling 81 source files to <https://builds.apache.org/job/Curator/org.apache.curator$curator-recipes/ws/target/classes>
[INFO] 
[INFO] --- maven-bundle-plugin:2.3.7:manifest (bundle-manifest) @ curator-recipes ---
[INFO] 
[INFO] --- maven-resources-plugin:2.6:testResources (default-testResources) @ curator-recipes
---
[INFO] Using 'UTF-8' encoding to copy filtered resources.
[INFO] Copying 1 resource
[INFO] Copying 3 resources
[INFO] 
[INFO] --- maven-compiler-plugin:3.1:testCompile (default-testCompile) @ curator-recipes ---
[INFO] Changes detected - recompiling the module!
[INFO] Compiling 47 source files to <https://builds.apache.org/job/Curator/org.apache.curator$curator-recipes/ws/target/test-classes>
[WARNING] Note: Some input files use or override a deprecated API.
[WARNING] Note: Recompile with -Xlint:deprecation for details.
[INFO] 
[INFO] --- maven-surefire-plugin:2.17:test (default-test) @ curator-recipes ---
[INFO] Surefire report directory: <https://builds.apache.org/job/Curator/org.apache.curator$curator-recipes/ws/target/surefire-reports>

-------------------------------------------------------
 T E S T S
-------------------------------------------------------

-------------------------------------------------------
 T E S T S
-------------------------------------------------------
Running org.apache.curator.framework.client.TestResetConnectionWithBackgroundFailure
Tests run: 1, Failures: 0, Errors: 0, Skipped: 0, Time elapsed: 209.067 sec - in org.apache.curator.framework.client.TestResetConnectionWithBackgroundFailure
Running org.apache.curator.framework.client.TestBackgroundStates
Tests run: 3, Failures: 2, Errors: 0, Skipped: 0, Time elapsed: 552.455 sec <<< FAILURE!
- in org.apache.curator.framework.client.TestBackgroundStates
testListenersReconnectedIsOK(org.apache.curator.framework.client.TestBackgroundStates)  Time
elapsed: 222.305 sec  <<< FAILURE!
java.lang.AssertionError: expected [true] but found [false]
	at org.testng.Assert.fail(Assert.java:94)
	at org.testng.Assert.failNotEquals(Assert.java:494)
	at org.testng.Assert.assertTrue(Assert.java:42)
	at org.testng.Assert.assertTrue(Assert.java:52)
	at org.apache.curator.framework.client.TestBackgroundStates.testListenersReconnectedIsOK(TestBackgroundStates.java:86)

testListenersReconnectedIsOK(org.apache.curator.framework.client.TestBackgroundStates)  Time
elapsed: 222.671 sec  <<< FAILURE!
java.lang.AssertionError: expected [true] but found [false]
	at org.testng.Assert.fail(Assert.java:94)
	at org.testng.Assert.failNotEquals(Assert.java:494)
	at org.testng.Assert.assertTrue(Assert.java:42)
	at org.testng.Assert.assertTrue(Assert.java:52)
	at org.apache.curator.framework.client.TestBackgroundStates.testListenersReconnectedIsOK(TestBackgroundStates.java:86)

Running org.apache.curator.framework.recipes.atomic.TestCachedAtomicCounter
Tests run: 2, Failures: 0, Errors: 0, Skipped: 0, Time elapsed: 4.555 sec - in org.apache.curator.framework.recipes.atomic.TestCachedAtomicCounter
Running org.apache.curator.framework.recipes.atomic.TestDistributedAtomicLong
Tests run: 6, Failures: 0, Errors: 0, Skipped: 0, Time elapsed: 10.001 sec - in org.apache.curator.framework.recipes.atomic.TestDistributedAtomicLong
Running org.apache.curator.framework.recipes.leader.TestLeaderLatchCluster
Tests run: 1, Failures: 0, Errors: 0, Skipped: 0, Time elapsed: 16.855 sec - in org.apache.curator.framework.recipes.leader.TestLeaderLatchCluster
Running org.apache.curator.framework.recipes.leader.TestLeaderSelectorEdges
Tests run: 3, Failures: 0, Errors: 0, Skipped: 0, Time elapsed: 45.996 sec - in org.apache.curator.framework.recipes.leader.TestLeaderSelectorEdges
Running org.apache.curator.framework.recipes.leader.TestLeaderSelectorWithExecutor
Tests run: 1, Failures: 0, Errors: 0, Skipped: 0, Time elapsed: 6.751 sec - in org.apache.curator.framework.recipes.leader.TestLeaderSelectorWithExecutor
Running org.apache.curator.framework.recipes.leader.TestLeaderSelectorCluster
Tests run: 2, Failures: 0, Errors: 0, Skipped: 0, Time elapsed: 17.138 sec - in org.apache.curator.framework.recipes.leader.TestLeaderSelectorCluster
Running org.apache.curator.framework.recipes.leader.TestLeaderLatch
Tests run: 13, Failures: 0, Errors: 0, Skipped: 0, Time elapsed: 132.81 sec - in org.apache.curator.framework.recipes.leader.TestLeaderLatch
Running org.apache.curator.framework.recipes.leader.TestLeaderSelectorParticipants
Tests run: 2, Failures: 0, Errors: 0, Skipped: 0, Time elapsed: 4.984 sec - in org.apache.curator.framework.recipes.leader.TestLeaderSelectorParticipants
Running org.apache.curator.framework.recipes.leader.TestLeaderSelector
Tests run: 10, Failures: 0, Errors: 0, Skipped: 0, Time elapsed: 160.227 sec - in org.apache.curator.framework.recipes.leader.TestLeaderSelector
Running org.apache.curator.framework.recipes.shared.TestSharedCount
Tests run: 4, Failures: 0, Errors: 0, Skipped: 0, Time elapsed: 17.039 sec - in org.apache.curator.framework.recipes.shared.TestSharedCount
Running org.apache.curator.framework.recipes.cache.TestNodeCache
Tests run: 4, Failures: 0, Errors: 0, Skipped: 0, Time elapsed: 13.066 sec - in org.apache.curator.framework.recipes.cache.TestNodeCache
Running org.apache.curator.framework.recipes.cache.TestTreeCacheRandomTree
Tests run: 2, Failures: 0, Errors: 0, Skipped: 0, Time elapsed: 18.041 sec - in org.apache.curator.framework.recipes.cache.TestTreeCacheRandomTree
Running org.apache.curator.framework.recipes.cache.TestPathChildrenCacheInCluster
Tests run: 1, Failures: 0, Errors: 0, Skipped: 0, Time elapsed: 3.849 sec - in org.apache.curator.framework.recipes.cache.TestPathChildrenCacheInCluster
Running org.apache.curator.framework.recipes.cache.TestPathChildrenCache
Tests run: 18, Failures: 0, Errors: 0, Skipped: 0, Time elapsed: 39.34 sec - in org.apache.curator.framework.recipes.cache.TestPathChildrenCache
Running org.apache.curator.framework.recipes.cache.TestTreeCache
Tests run: 21, Failures: 0, Errors: 0, Skipped: 0, Time elapsed: 147.846 sec - in org.apache.curator.framework.recipes.cache.TestTreeCache
Running org.apache.curator.framework.recipes.locks.TestLockCleanlinessWithFaults
Tests run: 1, Failures: 0, Errors: 0, Skipped: 0, Time elapsed: 2.962 sec - in org.apache.curator.framework.recipes.locks.TestLockCleanlinessWithFaults
Running org.apache.curator.framework.recipes.locks.TestInterProcessSemaphore
Killed
Running org.apache.curator.framework.recipes.locks.TestLockACLs
Tests run: 1, Failures: 0, Errors: 0, Skipped: 0, Time elapsed: 2.875 sec - in org.apache.curator.framework.recipes.locks.TestLockACLs
Running org.apache.curator.framework.recipes.locks.TestChildReaper
Killed
Running org.apache.curator.framework.recipes.locks.TestInterProcessMutexBase
Tests run: 0, Failures: 0, Errors: 0, Skipped: 0, Time elapsed: 0.277 sec - in org.apache.curator.framework.recipes.locks.TestInterProcessMutexBase
Running org.apache.curator.framework.recipes.locks.TestInterProcessMultiMutex
Tests run: 9, Failures: 0, Errors: 0, Skipped: 0, Time elapsed: 39.622 sec - in org.apache.curator.framework.recipes.locks.TestInterProcessMultiMutex
Running org.apache.curator.framework.recipes.locks.TestInterProcessReadWriteLock
Tests run: 6, Failures: 0, Errors: 0, Skipped: 0, Time elapsed: 20.701 sec - in org.apache.curator.framework.recipes.locks.TestInterProcessReadWriteLock
Running org.apache.curator.framework.recipes.locks.TestInterProcessSemaphoreCluster
Tests run: 2, Failures: 0, Errors: 0, Skipped: 0, Time elapsed: 472.686 sec - in org.apache.curator.framework.recipes.locks.TestInterProcessSemaphoreCluster
Running org.apache.curator.framework.recipes.locks.TestReaper
Tests run: 16, Failures: 0, Errors: 0, Skipped: 0, Time elapsed: 203.501 sec - in org.apache.curator.framework.recipes.locks.TestReaper
Running org.apache.curator.framework.recipes.locks.TestInterProcessSemaphoreMutex
Tests run: 5, Failures: 0, Errors: 0, Skipped: 0, Time elapsed: 38.341 sec - in org.apache.curator.framework.recipes.locks.TestInterProcessSemaphoreMutex
Running org.apache.curator.framework.recipes.locks.TestInterProcessMutex
Tests run: 9, Failures: 0, Errors: 0, Skipped: 0, Time elapsed: 41.113 sec - in org.apache.curator.framework.recipes.locks.TestInterProcessMutex
Running org.apache.curator.framework.recipes.barriers.TestDistributedBarrier
Tests run: 4, Failures: 0, Errors: 0, Skipped: 0, Time elapsed: 11.529 sec - in org.apache.curator.framework.recipes.barriers.TestDistributedBarrier
Running org.apache.curator.framework.recipes.barriers.TestDistributedDoubleBarrier
Tests run: 3, Failures: 0, Errors: 0, Skipped: 0, Time elapsed: 6.962 sec - in org.apache.curator.framework.recipes.barriers.TestDistributedDoubleBarrier
Running org.apache.curator.framework.recipes.queue.TestDistributedPriorityQueue
Tests run: 4, Failures: 0, Errors: 0, Skipped: 0, Time elapsed: 20.355 sec - in org.apache.curator.framework.recipes.queue.TestDistributedPriorityQueue
Running org.apache.curator.framework.recipes.queue.TestQueueSharder
Tests run: 3, Failures: 0, Errors: 0, Skipped: 0, Time elapsed: 135.26 sec - in org.apache.curator.framework.recipes.queue.TestQueueSharder
Running org.apache.curator.framework.recipes.queue.TestSimpleDistributedQueue
Tests run: 13, Failures: 0, Errors: 0, Skipped: 0, Time elapsed: 31.582 sec - in org.apache.curator.framework.recipes.queue.TestSimpleDistributedQueue
Running org.apache.curator.framework.recipes.queue.TestDistributedQueue
Tests run: 11, Failures: 0, Errors: 0, Skipped: 0, Time elapsed: 230.529 sec - in org.apache.curator.framework.recipes.queue.TestDistributedQueue
Running org.apache.curator.framework.recipes.queue.TestDistributedDelayQueue
Tests run: 4, Failures: 0, Errors: 0, Skipped: 0, Time elapsed: 15.011 sec - in org.apache.curator.framework.recipes.queue.TestDistributedDelayQueue
Running org.apache.curator.framework.recipes.queue.TestQueueItem
Tests run: 0, Failures: 0, Errors: 0, Skipped: 0, Time elapsed: 0.235 sec - in org.apache.curator.framework.recipes.queue.TestQueueItem
Running org.apache.curator.framework.recipes.queue.TestBoundedDistributedQueue
Tests run: 2, Failures: 0, Errors: 0, Skipped: 0, Time elapsed: 54.871 sec - in org.apache.curator.framework.recipes.queue.TestBoundedDistributedQueue
Running org.apache.curator.framework.recipes.queue.TestDistributedIdQueue
Tests run: 2, Failures: 0, Errors: 0, Skipped: 0, Time elapsed: 5.014 sec - in org.apache.curator.framework.recipes.queue.TestDistributedIdQueue
Running org.apache.curator.framework.recipes.nodes.TestPersistentEphemeralNode
Tests run: 19, Failures: 0, Errors: 0, Skipped: 0, Time elapsed: 81.043 sec - in org.apache.curator.framework.recipes.nodes.TestPersistentEphemeralNode
Running org.apache.curator.framework.recipes.nodes.TestPersistentEphemeralNodeListener
Tests run: 2, Failures: 2, Errors: 0, Skipped: 0, Time elapsed: 453.188 sec <<< FAILURE!
- in org.apache.curator.framework.recipes.nodes.TestPersistentEphemeralNodeListener
testListenersReconnectedIsOK(org.apache.curator.framework.recipes.nodes.TestPersistentEphemeralNodeListener)
 Time elapsed: 223.034 sec  <<< FAILURE!
java.lang.AssertionError: expected [true] but found [false]
	at org.testng.Assert.fail(Assert.java:94)
	at org.testng.Assert.failNotEquals(Assert.java:494)
	at org.testng.Assert.assertTrue(Assert.java:42)
	at org.testng.Assert.assertTrue(Assert.java:52)
	at org.apache.curator.framework.recipes.nodes.TestPersistentEphemeralNodeListener.testListenersReconnectedIsOK(TestPersistentEphemeralNodeListener.java:82)

testListenersReconnectedIsOK(org.apache.curator.framework.recipes.nodes.TestPersistentEphemeralNodeListener)
 Time elapsed: 222.529 sec  <<< FAILURE!
java.lang.AssertionError: expected [true] but found [false]
	at org.testng.Assert.fail(Assert.java:94)
	at org.testng.Assert.failNotEquals(Assert.java:494)
	at org.testng.Assert.assertTrue(Assert.java:42)
	at org.testng.Assert.assertTrue(Assert.java:52)
	at org.apache.curator.framework.recipes.nodes.TestPersistentEphemeralNodeListener.testListenersReconnectedIsOK(TestPersistentEphemeralNodeListener.java:82)


Results :

Failed tests: 
  TestBackgroundStates.testListenersReconnectedIsOK:86 expected [true] but found [false]
  TestBackgroundStates.testListenersReconnectedIsOK:86 expected [true] but found [false]
  TestPersistentEphemeralNodeListener.testListenersReconnectedIsOK:82 expected [true] but
found [false]
  TestPersistentEphemeralNodeListener.testListenersReconnectedIsOK:82 expected [true] but
found [false]

Tests run: 210, Failures: 4, Errors: 0, Skipped: 0

[JENKINS] Recording test results

Mime
View raw message