curator-dev mailing list archives

Site index · List index
Message view « Date » · « Thread »
Top « Date » · « Thread »
From Apache Jenkins Server <jenk...@builds.apache.org>
Subject Build failed in Jenkins: Curator #898
Date Thu, 02 Oct 2014 20:04:53 GMT
See <https://builds.apache.org/job/Curator/898/changes>

Changes:

[randgalt] Added APIs for getting/setting shared values with versions for better utility

------------------------------------------
[...truncated 1006 lines...]

testPostInitializedForEmpty(org.apache.curator.framework.recipes.cache.TestPathChildrenCache)
 Time elapsed: 0.007 sec  <<< FAILURE!
java.lang.NoClassDefFoundError: Could not initialize class org.apache.curator.framework.recipes.cache.PathChildrenCache
	at org.apache.curator.framework.recipes.cache.TestPathChildrenCache.testPostInitializedForEmpty(TestPathChildrenCache.java:78)

testRebuildAgainstOtherProcesses(org.apache.curator.framework.recipes.cache.TestPathChildrenCache)
 Time elapsed: 0.016 sec  <<< FAILURE!
java.lang.NoClassDefFoundError: Could not initialize class org.apache.curator.framework.recipes.cache.PathChildrenCache
	at org.apache.curator.framework.recipes.cache.TestPathChildrenCache.testRebuildAgainstOtherProcesses(TestPathChildrenCache.java:489)

testRebuildAgainstOtherProcesses(org.apache.curator.framework.recipes.cache.TestPathChildrenCache)
 Time elapsed: 0.017 sec  <<< FAILURE!
java.lang.NoClassDefFoundError: Could not initialize class org.apache.curator.framework.recipes.cache.PathChildrenCache
	at org.apache.curator.framework.recipes.cache.TestPathChildrenCache.testRebuildAgainstOtherProcesses(TestPathChildrenCache.java:489)

testRebuildNode(org.apache.curator.framework.recipes.cache.TestPathChildrenCache)  Time elapsed:
0.02 sec  <<< FAILURE!
java.lang.NoClassDefFoundError: org.apache.curator.framework.recipes.cache.PathChildrenCache
	at org.apache.curator.framework.recipes.cache.TestPathChildrenCache.testRebuildNode(TestPathChildrenCache.java:775)

testRebuildNode(org.apache.curator.framework.recipes.cache.TestPathChildrenCache)  Time elapsed:
0.016 sec  <<< FAILURE!
java.lang.NoClassDefFoundError: org.apache.curator.framework.recipes.cache.PathChildrenCache
	at org.apache.curator.framework.recipes.cache.TestPathChildrenCache.testRebuildNode(TestPathChildrenCache.java:775)

testUpdateWhenNotCachingData(org.apache.curator.framework.recipes.cache.TestPathChildrenCache)
 Time elapsed: 0.011 sec  <<< FAILURE!
java.lang.NoClassDefFoundError: Could not initialize class org.apache.curator.framework.recipes.cache.PathChildrenCache
	at org.apache.curator.framework.recipes.cache.TestPathChildrenCache.testUpdateWhenNotCachingData(TestPathChildrenCache.java:338)

testUpdateWhenNotCachingData(org.apache.curator.framework.recipes.cache.TestPathChildrenCache)
 Time elapsed: 0.01 sec  <<< FAILURE!
java.lang.NoClassDefFoundError: Could not initialize class org.apache.curator.framework.recipes.cache.PathChildrenCache
	at org.apache.curator.framework.recipes.cache.TestPathChildrenCache.testUpdateWhenNotCachingData(TestPathChildrenCache.java:338)

Running org.apache.curator.framework.recipes.cache.TestPathChildrenCacheInCluster
Tests run: 1, Failures: 1, Errors: 0, Skipped: 0, Time elapsed: 4.006 sec <<< FAILURE!
- in org.apache.curator.framework.recipes.cache.TestPathChildrenCacheInCluster
testServerLoss(org.apache.curator.framework.recipes.cache.TestPathChildrenCacheInCluster)
 Time elapsed: 3.713 sec  <<< FAILURE!
java.lang.ExceptionInInitializerError: null
	at org.apache.curator.utils.PathUtils.validatePath(PathUtils.java:48)
	at org.apache.curator.framework.recipes.cache.ChildData.<init>(ChildData.java:34)
	at org.apache.curator.framework.recipes.cache.PathChildrenCache.<clinit>(PathChildrenCache.java:91)
	at org.apache.curator.framework.recipes.cache.TestPathChildrenCacheInCluster.testServerLoss(TestPathChildrenCacheInCluster.java:52)

Running org.apache.curator.framework.recipes.cache.TestTreeCacheRandomTree
Tests run: 1, Failures: 0, Errors: 0, Skipped: 0, Time elapsed: 10.681 sec - in org.apache.curator.framework.recipes.cache.TestTreeCacheRandomTree
Running org.apache.curator.framework.client.TestBackgroundStates
Tests run: 2, Failures: 0, Errors: 0, Skipped: 0, Time elapsed: 136.434 sec - in org.apache.curator.framework.client.TestBackgroundStates
Running org.apache.curator.framework.client.TestResetConnectionWithBackgroundFailure
Tests run: 1, Failures: 0, Errors: 0, Skipped: 0, Time elapsed: 209.425 sec - in org.apache.curator.framework.client.TestResetConnectionWithBackgroundFailure

Results :

Failed tests: 
  TestDistributedQueue.testFlush:708 » IllegalArgument Path cannot be null
  TestDistributedQueue.testFlush:708 » IllegalArgument Path cannot be null
  TestDistributedQueue.testMultiPutterSingleGetter:669 » IllegalArgument Path ca...
  TestDistributedQueue.testMultiPutterSingleGetter:669 » IllegalArgument Path ca...
  TestDistributedQueue.testNoDuplicateProcessing:344 » IllegalArgument Path cann...
  TestDistributedQueue.testNoDuplicateProcessing:344 » IllegalArgument Path cann...
  TestDistributedQueue.testPutListener:226 » IllegalArgument Path cannot be null
  TestDistributedQueue.testPutListener:226 » IllegalArgument Path cannot be null
  TestDistributedQueue.testPutMulti:624 » IllegalArgument Path cannot be null
  TestDistributedQueue.testPutMulti:624 » IllegalArgument Path cannot be null
  TestDistributedQueue.testSafetyWithCrash:449 » IllegalArgument Path cannot be ...
  TestDistributedQueue.testSafetyWithCrash:449 » IllegalArgument Path cannot be ...
  TestDistributedQueue.testSimple:768 » IllegalArgument Path cannot be null
  TestDistributedQueue.testSimple:768 » IllegalArgument Path cannot be null
  TestDistributedIdQueue.testOrdering:97 » IllegalArgument Path cannot be null
  TestDistributedIdQueue.testOrdering:97 » IllegalArgument Path cannot be null
  TestDistributedDelayQueue.testBasic:83 » IllegalArgument Path cannot be null
  TestDistributedDelayQueue.testBasic:83 » IllegalArgument Path cannot be null
  TestDistributedDelayQueue.testLateAddition:52 » IllegalArgument Path cannot be...
  TestDistributedDelayQueue.testLateAddition:52 » IllegalArgument Path cannot be...
  TestDistributedDelayQueue.testSimple:112 » IllegalArgument Path cannot be null
  TestDistributedDelayQueue.testSimple:112 » IllegalArgument Path cannot be null
  TestDistributedDelayQueue.testSorting:151 » IllegalArgument Path cannot be nul...
  TestDistributedDelayQueue.testSorting:151 » IllegalArgument Path cannot be nul...
  TestQueueSharder.testDistribution:93 » IllegalState Already closed or has not ...
  TestQueueSharder.testDistribution:93 » IllegalState Already closed or has not ...
  TestQueueSharder.testSharderWatchSync:129 » IllegalState Already closed or has...
  TestQueueSharder.testSharderWatchSync:129 » IllegalState Already closed or has...
  TestQueueSharder.testSimpleDistributedQueue:186 » IllegalState Already closed ...
  TestQueueSharder.testSimpleDistributedQueue:186 » IllegalState Already closed ...
  TestDistributedPriorityQueue.testAdditions:150 » IllegalArgument Path cannot b...
  TestDistributedPriorityQueue.testAdditions:150 » IllegalArgument Path cannot b...
  TestDistributedPriorityQueue.testMinItemsBeforeRefresh:53 » IllegalArgument Pa...
  TestDistributedPriorityQueue.testMinItemsBeforeRefresh:53 » IllegalArgument Pa...
  TestDistributedPriorityQueue.testSimple:195 » IllegalArgument Path cannot be n...
  TestDistributedPriorityQueue.testSimple:195 » IllegalArgument Path cannot be n...
  TestDistributedPriorityQueue.testSortingWhileTaking:101 » IllegalArgument Path...
  TestDistributedPriorityQueue.testSortingWhileTaking:101 » IllegalArgument Path...
  TestBoundedDistributedQueue.testSimple:221 » IllegalArgument Path cannot be nu...
  TestBoundedDistributedQueue.testSimple:221 » IllegalArgument Path cannot be nu...
  TestPersistentEphemeralNode.testNullPath » Test 
Expected exception java.lang....
  TestPersistentEphemeralNode.testNullPath » Test 
Expected exception java.lang....
  TestPathChildrenCache.testAsyncInitialPopulation:195 ExceptionInInitializer
  TestPathChildrenCache.testAsyncInitialPopulation:195 NoClassDefFound Could not...
  TestPathChildrenCache.testBasics:858 NoClassDefFound Could not initialize clas...
  TestPathChildrenCache.testBasics:858 NoClassDefFound Could not initialize clas...
  TestPathChildrenCache.testBasicsOnTwoCachesWithSameExecutor:905 NoClassDefFound
  TestPathChildrenCache.testBasicsOnTwoCachesWithSameExecutor:905 NoClassDefFound
  TestPathChildrenCache.testChildrenInitialized:234 NoClassDefFound Could not in...
  TestPathChildrenCache.testChildrenInitialized:234 NoClassDefFound Could not in...
  TestPathChildrenCache.testChildrenInitializedNormal:288 NoClassDefFound Could ...
  TestPathChildrenCache.testChildrenInitializedNormal:288 NoClassDefFound Could ...
  TestPathChildrenCache.testClientClosedDuringRefreshErrorMessage:165 NoClassDefFound
  TestPathChildrenCache.testClientClosedDuringRefreshErrorMessage:165 NoClassDefFound
  TestPathChildrenCache.testDeleteNodeAfterCloseDoesntCallExecutor:974 NoClassDefFound
  TestPathChildrenCache.testDeleteNodeAfterCloseDoesntCallExecutor:974 NoClassDefFound
  TestPathChildrenCache.testDeleteThenCreate:426 NoClassDefFound Could not initi...
  TestPathChildrenCache.testDeleteThenCreate:426 NoClassDefFound Could not initi...
  TestPathChildrenCache.testEnsurePath:380 NoClassDefFound Could not initialize ...
  TestPathChildrenCache.testEnsurePath:380 NoClassDefFound Could not initialize ...
  TestPathChildrenCache.testInterruptedOperationOnShutdown:1011 NoClassDefFound ...
  TestPathChildrenCache.testInterruptedOperationOnShutdown:1011 NoClassDefFound ...
  TestPathChildrenCache.testIssue27:587 NoClassDefFound Could not initialize cla...
  TestPathChildrenCache.testIssue27:587 NoClassDefFound Could not initialize cla...
  TestPathChildrenCache.testIssue27Alt:644 NoClassDefFound Could not initialize ...
  TestPathChildrenCache.testIssue27Alt:644 NoClassDefFound Could not initialize ...
  TestPathChildrenCache.testKilledSession:689 NoClassDefFound Could not initiali...
  TestPathChildrenCache.testKilledSession:689 NoClassDefFound Could not initiali...
  TestPathChildrenCache.testModes:749->internalTestMode:807 NoClassDefFound Coul...
  TestPathChildrenCache.testModes:749->internalTestMode:807 NoClassDefFound Coul...
  TestPathChildrenCache.testPostInitializedForEmpty:78 NoClassDefFound Could not...
  TestPathChildrenCache.testPostInitializedForEmpty:78 NoClassDefFound Could not...
  TestPathChildrenCache.testRebuildAgainstOtherProcesses:489 NoClassDefFound Cou...
  TestPathChildrenCache.testRebuildAgainstOtherProcesses:489 NoClassDefFound Cou...
  TestPathChildrenCache.testRebuildNode:775 NoClassDefFound org.apache.curator.f...
  TestPathChildrenCache.testRebuildNode:775 NoClassDefFound org.apache.curator.f...
  TestPathChildrenCache.testUpdateWhenNotCachingData:338 NoClassDefFound Could n...
  TestPathChildrenCache.testUpdateWhenNotCachingData:338 NoClassDefFound Could n...
  TestPathChildrenCacheInCluster.testServerLoss:52 ExceptionInInitializer

Tests run: 245, Failures: 79, Errors: 0, Skipped: 0

[ERROR] There are test failures.

Please refer to <https://builds.apache.org/job/Curator/ws/curator-recipes/target/surefire-reports>
for the individual test results.
[JENKINS] Recording test results
[INFO] 
[INFO] --- maven-bundle-plugin:2.3.7:bundle (default-bundle) @ curator-recipes ---
[INFO] 
[INFO] --- maven-site-plugin:3.3:attach-descriptor (attach-descriptor) @ curator-recipes ---
[INFO] 
[INFO] --- maven-license-plugin:1.9.0:check (license) @ curator-recipes ---
[INFO] Checking licenses...
[INFO] Missing header in: <https://builds.apache.org/job/Curator/ws/curator-recipes/src/main/java/org/apache/curator/framework/recipes/shared/VersionedValue.java>
[CHECKSTYLE] No report found for mojo check
[INFO] ------------------------------------------------------------------------
[INFO] Reactor Summary:
[INFO] 
[INFO] Apache Curator .................................... SUCCESS [30.746s]
[INFO] Curator Testing ................................... SUCCESS [5.924s]
[INFO] Curator Client .................................... SUCCESS [50.708s]
[INFO] Curator Framework ................................. SUCCESS [14:44.994s]
[INFO] Curator Recipes ................................... FAILURE [46:53.705s]
[INFO] Curator Service Discovery ......................... SKIPPED
[INFO] Curator Examples .................................. SKIPPED
[INFO] Curator Service Discovery Server .................. SKIPPED
[INFO] Curator RPC Proxy ................................. SKIPPED
[INFO] ------------------------------------------------------------------------
[INFO] BUILD FAILURE
[INFO] ------------------------------------------------------------------------
[INFO] Total time: 1:03:11.466s
[INFO] Finished at: Thu Oct 02 20:04:38 UTC 2014
[INFO] Final Memory: 20M/78M
[INFO] ------------------------------------------------------------------------
Waiting for Jenkins to finish collecting data[ERROR] Failed to execute goal com.mycila.maven-license-plugin:maven-license-plugin:1.9.0:check
(license) on project curator-recipes: Some files do not have the expected license header ->
[Help 1]
[ERROR] 
[ERROR] To see the full stack trace of the errors, re-run Maven with the -e switch.
[ERROR] Re-run Maven using the -X switch to enable full debug logging.
[ERROR] 
[ERROR] For more information about the errors and possible solutions, please read the following
articles:
[ERROR] [Help 1] http://cwiki.apache.org/confluence/display/MAVEN/MojoExecutionException
[ERROR] 
[ERROR] After correcting the problems, you can resume the build with the command
[ERROR]   mvn <goals> -rf :curator-recipes

[JENKINS] Archiving <https://builds.apache.org/job/Curator/ws/curator-x-rpc/pom.xml>
to org.apache.curator/curator-x-rpc/2.6.1-SNAPSHOT/curator-x-rpc-2.6.1-SNAPSHOT.pom
Sending artifact delta relative to Curator » Curator RPC Proxy #896
Archived 1 artifacts
Archive block size is 32768
Received 0 blocks and 5833 bytes
Compression is 0.0%
Took 0.42 sec
[JENKINS] Archiving <https://builds.apache.org/job/Curator/ws/curator-client/pom.xml>
to org.apache.curator/curator-client/2.6.1-SNAPSHOT/curator-client-2.6.1-SNAPSHOT.pom
[JENKINS] Archiving <https://builds.apache.org/job/Curator/ws/curator-client/target/curator-client-2.6.1-SNAPSHOT.jar>
to org.apache.curator/curator-client/2.6.1-SNAPSHOT/curator-client-2.6.1-SNAPSHOT.jar
Sending artifact delta relative to Curator » Curator Client #896
Archived 2 artifacts
Archive block size is 32768
Received 0 blocks and 71709 bytes
Compression is 0.0%
Took 67 ms
[JENKINS] Archiving <https://builds.apache.org/job/Curator/ws/curator-framework/pom.xml>
to org.apache.curator/curator-framework/2.6.1-SNAPSHOT/curator-framework-2.6.1-SNAPSHOT.pom
[JENKINS] Archiving <https://builds.apache.org/job/Curator/ws/curator-framework/target/curator-framework-2.6.1-SNAPSHOT.jar>
to org.apache.curator/curator-framework/2.6.1-SNAPSHOT/curator-framework-2.6.1-SNAPSHOT.jar
Sending artifact delta relative to Curator » Curator Framework #896
Archived 2 artifacts
Archive block size is 32768
Received 0 blocks and 188735 bytes
Compression is 0.0%
Took 2.2 sec
[JENKINS] Archiving <https://builds.apache.org/job/Curator/ws/curator-x-discovery-server/pom.xml>
to org.apache.curator/curator-x-discovery-server/2.6.1-SNAPSHOT/curator-x-discovery-server-2.6.1-SNAPSHOT.pom
Sending artifact delta relative to Curator » Curator Service Discovery Server #896
Archived 1 artifacts
Archive block size is 32768
Received 0 blocks and 4047 bytes
Compression is 0.0%
Took 60 ms
[JENKINS] Archiving <https://builds.apache.org/job/Curator/ws/curator-examples/pom.xml>
to org.apache.curator/curator-examples/2.6.1-SNAPSHOT/curator-examples-2.6.1-SNAPSHOT.pom
Sending artifact delta relative to Curator » Curator Examples #896
Archived 1 artifacts
Archive block size is 32768
Received 0 blocks and 2055 bytes
Compression is 0.0%
Took 41 ms
[JENKINS] Archiving <https://builds.apache.org/job/Curator/ws/curator-test/pom.xml>
to org.apache.curator/curator-test/2.6.1-SNAPSHOT/curator-test-2.6.1-SNAPSHOT.pom
[JENKINS] Archiving <https://builds.apache.org/job/Curator/ws/curator-test/target/curator-test-2.6.1-SNAPSHOT.jar>
to org.apache.curator/curator-test/2.6.1-SNAPSHOT/curator-test-2.6.1-SNAPSHOT.jar
Sending artifact delta relative to Curator » Curator Testing #896
Archived 2 artifacts
Archive block size is 32768
Received 0 blocks and 41777 bytes
Compression is 0.0%
Took 38 ms
[JENKINS] Archiving <https://builds.apache.org/job/Curator/ws/curator-recipes/pom.xml>
to org.apache.curator/curator-recipes/2.6.1-SNAPSHOT/curator-recipes-2.6.1-SNAPSHOT.pom
[JENKINS] Archiving <https://builds.apache.org/job/Curator/ws/curator-recipes/target/curator-recipes-2.6.1-SNAPSHOT.jar>
to org.apache.curator/curator-recipes/2.6.1-SNAPSHOT/curator-recipes-2.6.1-SNAPSHOT.jar
Sending artifact delta relative to Curator » Curator Recipes #896
Archived 2 artifacts
Archive block size is 32768
Received 0 blocks and 270858 bytes
Compression is 0.0%
Took 0.11 sec
[JENKINS] Archiving <https://builds.apache.org/job/Curator/ws/pom.xml> to org.apache.curator/apache-curator/2.6.1-SNAPSHOT/apache-curator-2.6.1-SNAPSHOT.pom
[JENKINS] Archiving <https://builds.apache.org/job/Curator/ws/target/apache-curator-2.6.1-SNAPSHOT-site.xml>
to org.apache.curator/apache-curator/2.6.1-SNAPSHOT/apache-curator-2.6.1-SNAPSHOT-site.xml
Sending artifact delta relative to Curator » Apache Curator #896
Archived 2 artifacts
Archive block size is 32768
Received 1 blocks and 4282 bytes
Compression is 88.4%
Took 33 ms
[JENKINS] Archiving <https://builds.apache.org/job/Curator/ws/curator-x-discovery/pom.xml>
to org.apache.curator/curator-x-discovery/2.6.1-SNAPSHOT/curator-x-discovery-2.6.1-SNAPSHOT.pom
Sending artifact delta relative to Curator » Curator Service Discovery #896
Archived 1 artifacts
Archive block size is 32768
Received 0 blocks and 2423 bytes
Compression is 0.0%
Took 43 ms
Sending e-mails to: dev@curator.apache.org
Sending e-mails to: dev@curator.apache.org
Sending e-mails to: dev@curator.apache.org
Sending e-mails to: dev@curator.apache.org
Sending e-mails to: dev@curator.apache.org
channel stopped

Mime
View raw message