curator-dev mailing list archives

Site index · List index
Message view « Date » · « Thread »
Top « Date » · « Thread »
From Apache Jenkins Server <jenk...@builds.apache.org>
Subject Build failed in Jenkins: Curator » Curator Recipes #898
Date Thu, 02 Oct 2014 20:04:52 GMT
See <https://builds.apache.org/job/Curator/org.apache.curator$curator-recipes/898/changes>

Changes:

[randgalt] Added APIs for getting/setting shared values with versions for better utility

------------------------------------------
[...truncated 481 lines...]
java.lang.NoClassDefFoundError: Could not initialize class org.apache.curator.framework.recipes.cache.PathChildrenCache
	at org.apache.curator.framework.recipes.cache.TestPathChildrenCache.testBasics(TestPathChildrenCache.java:858)

testBasicsOnTwoCachesWithSameExecutor(org.apache.curator.framework.recipes.cache.TestPathChildrenCache)
 Time elapsed: 0.01 sec  <<< FAILURE!
java.lang.NoClassDefFoundError: Could not initialize class org.apache.curator.framework.recipes.cache.PathChildrenCache
	at org.apache.curator.framework.recipes.cache.TestPathChildrenCache.testBasicsOnTwoCachesWithSameExecutor(TestPathChildrenCache.java:905)

testBasicsOnTwoCachesWithSameExecutor(org.apache.curator.framework.recipes.cache.TestPathChildrenCache)
 Time elapsed: 0.011 sec  <<< FAILURE!
java.lang.NoClassDefFoundError: Could not initialize class org.apache.curator.framework.recipes.cache.PathChildrenCache
	at org.apache.curator.framework.recipes.cache.TestPathChildrenCache.testBasicsOnTwoCachesWithSameExecutor(TestPathChildrenCache.java:905)

testChildrenInitialized(org.apache.curator.framework.recipes.cache.TestPathChildrenCache)
 Time elapsed: 0.011 sec  <<< FAILURE!
java.lang.NoClassDefFoundError: Could not initialize class org.apache.curator.framework.recipes.cache.PathChildrenCache
	at org.apache.curator.framework.recipes.cache.TestPathChildrenCache.testChildrenInitialized(TestPathChildrenCache.java:234)

testChildrenInitialized(org.apache.curator.framework.recipes.cache.TestPathChildrenCache)
 Time elapsed: 0.014 sec  <<< FAILURE!
java.lang.NoClassDefFoundError: Could not initialize class org.apache.curator.framework.recipes.cache.PathChildrenCache
	at org.apache.curator.framework.recipes.cache.TestPathChildrenCache.testChildrenInitialized(TestPathChildrenCache.java:234)

testChildrenInitializedNormal(org.apache.curator.framework.recipes.cache.TestPathChildrenCache)
 Time elapsed: 0.011 sec  <<< FAILURE!
java.lang.NoClassDefFoundError: Could not initialize class org.apache.curator.framework.recipes.cache.PathChildrenCache
	at org.apache.curator.framework.recipes.cache.TestPathChildrenCache.testChildrenInitializedNormal(TestPathChildrenCache.java:288)

testChildrenInitializedNormal(org.apache.curator.framework.recipes.cache.TestPathChildrenCache)
 Time elapsed: 0.011 sec  <<< FAILURE!
java.lang.NoClassDefFoundError: Could not initialize class org.apache.curator.framework.recipes.cache.PathChildrenCache
	at org.apache.curator.framework.recipes.cache.TestPathChildrenCache.testChildrenInitializedNormal(TestPathChildrenCache.java:288)

testClientClosedDuringRefreshErrorMessage(org.apache.curator.framework.recipes.cache.TestPathChildrenCache)
 Time elapsed: 0.033 sec  <<< FAILURE!
java.lang.NoClassDefFoundError: Could not initialize class org.apache.curator.framework.recipes.cache.PathChildrenCache
	at org.apache.curator.framework.recipes.cache.TestPathChildrenCache.testClientClosedDuringRefreshErrorMessage(TestPathChildrenCache.java:165)

testClientClosedDuringRefreshErrorMessage(org.apache.curator.framework.recipes.cache.TestPathChildrenCache)
 Time elapsed: 0.015 sec  <<< FAILURE!
java.lang.NoClassDefFoundError: Could not initialize class org.apache.curator.framework.recipes.cache.PathChildrenCache
	at org.apache.curator.framework.recipes.cache.TestPathChildrenCache.testClientClosedDuringRefreshErrorMessage(TestPathChildrenCache.java:165)

testDeleteNodeAfterCloseDoesntCallExecutor(org.apache.curator.framework.recipes.cache.TestPathChildrenCache)
 Time elapsed: 0.011 sec  <<< FAILURE!
java.lang.NoClassDefFoundError: Could not initialize class org.apache.curator.framework.recipes.cache.PathChildrenCache
	at org.apache.curator.framework.recipes.cache.TestPathChildrenCache.testDeleteNodeAfterCloseDoesntCallExecutor(TestPathChildrenCache.java:974)

testDeleteNodeAfterCloseDoesntCallExecutor(org.apache.curator.framework.recipes.cache.TestPathChildrenCache)
 Time elapsed: 0.013 sec  <<< FAILURE!
java.lang.NoClassDefFoundError: Could not initialize class org.apache.curator.framework.recipes.cache.PathChildrenCache
	at org.apache.curator.framework.recipes.cache.TestPathChildrenCache.testDeleteNodeAfterCloseDoesntCallExecutor(TestPathChildrenCache.java:974)

testDeleteThenCreate(org.apache.curator.framework.recipes.cache.TestPathChildrenCache)  Time
elapsed: 0.014 sec  <<< FAILURE!
java.lang.NoClassDefFoundError: Could not initialize class org.apache.curator.framework.recipes.cache.PathChildrenCache
	at org.apache.curator.framework.recipes.cache.TestPathChildrenCache.testDeleteThenCreate(TestPathChildrenCache.java:426)

testDeleteThenCreate(org.apache.curator.framework.recipes.cache.TestPathChildrenCache)  Time
elapsed: 0.014 sec  <<< FAILURE!
java.lang.NoClassDefFoundError: Could not initialize class org.apache.curator.framework.recipes.cache.PathChildrenCache
	at org.apache.curator.framework.recipes.cache.TestPathChildrenCache.testDeleteThenCreate(TestPathChildrenCache.java:426)

testEnsurePath(org.apache.curator.framework.recipes.cache.TestPathChildrenCache)  Time elapsed:
0.008 sec  <<< FAILURE!
java.lang.NoClassDefFoundError: Could not initialize class org.apache.curator.framework.recipes.cache.PathChildrenCache
	at org.apache.curator.framework.recipes.cache.TestPathChildrenCache.testEnsurePath(TestPathChildrenCache.java:380)

testEnsurePath(org.apache.curator.framework.recipes.cache.TestPathChildrenCache)  Time elapsed:
0.007 sec  <<< FAILURE!
java.lang.NoClassDefFoundError: Could not initialize class org.apache.curator.framework.recipes.cache.PathChildrenCache
	at org.apache.curator.framework.recipes.cache.TestPathChildrenCache.testEnsurePath(TestPathChildrenCache.java:380)

testInterruptedOperationOnShutdown(org.apache.curator.framework.recipes.cache.TestPathChildrenCache)
 Time elapsed: 0.008 sec  <<< FAILURE!
java.lang.NoClassDefFoundError: org.apache.curator.framework.recipes.cache.PathChildrenCache
	at org.apache.curator.framework.recipes.cache.TestPathChildrenCache.testInterruptedOperationOnShutdown(TestPathChildrenCache.java:1011)

testInterruptedOperationOnShutdown(org.apache.curator.framework.recipes.cache.TestPathChildrenCache)
 Time elapsed: 0.007 sec  <<< FAILURE!
java.lang.NoClassDefFoundError: org.apache.curator.framework.recipes.cache.PathChildrenCache
	at org.apache.curator.framework.recipes.cache.TestPathChildrenCache.testInterruptedOperationOnShutdown(TestPathChildrenCache.java:1011)

testIssue27(org.apache.curator.framework.recipes.cache.TestPathChildrenCache)  Time elapsed:
0.026 sec  <<< FAILURE!
java.lang.NoClassDefFoundError: Could not initialize class org.apache.curator.framework.recipes.cache.PathChildrenCache
	at org.apache.curator.framework.recipes.cache.TestPathChildrenCache.testIssue27(TestPathChildrenCache.java:587)

testIssue27(org.apache.curator.framework.recipes.cache.TestPathChildrenCache)  Time elapsed:
0.019 sec  <<< FAILURE!
java.lang.NoClassDefFoundError: Could not initialize class org.apache.curator.framework.recipes.cache.PathChildrenCache
	at org.apache.curator.framework.recipes.cache.TestPathChildrenCache.testIssue27(TestPathChildrenCache.java:587)

testIssue27Alt(org.apache.curator.framework.recipes.cache.TestPathChildrenCache)  Time elapsed:
0.017 sec  <<< FAILURE!
java.lang.NoClassDefFoundError: Could not initialize class org.apache.curator.framework.recipes.cache.PathChildrenCache
	at org.apache.curator.framework.recipes.cache.TestPathChildrenCache.testIssue27Alt(TestPathChildrenCache.java:644)

testIssue27Alt(org.apache.curator.framework.recipes.cache.TestPathChildrenCache)  Time elapsed:
0.018 sec  <<< FAILURE!
java.lang.NoClassDefFoundError: Could not initialize class org.apache.curator.framework.recipes.cache.PathChildrenCache
	at org.apache.curator.framework.recipes.cache.TestPathChildrenCache.testIssue27Alt(TestPathChildrenCache.java:644)

testKilledSession(org.apache.curator.framework.recipes.cache.TestPathChildrenCache)  Time
elapsed: 0.011 sec  <<< FAILURE!
java.lang.NoClassDefFoundError: Could not initialize class org.apache.curator.framework.recipes.cache.PathChildrenCache
	at org.apache.curator.framework.recipes.cache.TestPathChildrenCache.testKilledSession(TestPathChildrenCache.java:689)

testKilledSession(org.apache.curator.framework.recipes.cache.TestPathChildrenCache)  Time
elapsed: 0.012 sec  <<< FAILURE!
java.lang.NoClassDefFoundError: Could not initialize class org.apache.curator.framework.recipes.cache.PathChildrenCache
	at org.apache.curator.framework.recipes.cache.TestPathChildrenCache.testKilledSession(TestPathChildrenCache.java:689)

testModes(org.apache.curator.framework.recipes.cache.TestPathChildrenCache)  Time elapsed:
0.012 sec  <<< FAILURE!
java.lang.NoClassDefFoundError: Could not initialize class org.apache.curator.framework.recipes.cache.PathChildrenCache
	at org.apache.curator.framework.recipes.cache.TestPathChildrenCache.internalTestMode(TestPathChildrenCache.java:807)
	at org.apache.curator.framework.recipes.cache.TestPathChildrenCache.testModes(TestPathChildrenCache.java:749)

testModes(org.apache.curator.framework.recipes.cache.TestPathChildrenCache)  Time elapsed:
0.012 sec  <<< FAILURE!
java.lang.NoClassDefFoundError: Could not initialize class org.apache.curator.framework.recipes.cache.PathChildrenCache
	at org.apache.curator.framework.recipes.cache.TestPathChildrenCache.internalTestMode(TestPathChildrenCache.java:807)
	at org.apache.curator.framework.recipes.cache.TestPathChildrenCache.testModes(TestPathChildrenCache.java:749)

testPostInitializedForEmpty(org.apache.curator.framework.recipes.cache.TestPathChildrenCache)
 Time elapsed: 0.015 sec  <<< FAILURE!
java.lang.NoClassDefFoundError: Could not initialize class org.apache.curator.framework.recipes.cache.PathChildrenCache
	at org.apache.curator.framework.recipes.cache.TestPathChildrenCache.testPostInitializedForEmpty(TestPathChildrenCache.java:78)

testPostInitializedForEmpty(org.apache.curator.framework.recipes.cache.TestPathChildrenCache)
 Time elapsed: 0.007 sec  <<< FAILURE!
java.lang.NoClassDefFoundError: Could not initialize class org.apache.curator.framework.recipes.cache.PathChildrenCache
	at org.apache.curator.framework.recipes.cache.TestPathChildrenCache.testPostInitializedForEmpty(TestPathChildrenCache.java:78)

testRebuildAgainstOtherProcesses(org.apache.curator.framework.recipes.cache.TestPathChildrenCache)
 Time elapsed: 0.016 sec  <<< FAILURE!
java.lang.NoClassDefFoundError: Could not initialize class org.apache.curator.framework.recipes.cache.PathChildrenCache
	at org.apache.curator.framework.recipes.cache.TestPathChildrenCache.testRebuildAgainstOtherProcesses(TestPathChildrenCache.java:489)

testRebuildAgainstOtherProcesses(org.apache.curator.framework.recipes.cache.TestPathChildrenCache)
 Time elapsed: 0.017 sec  <<< FAILURE!
java.lang.NoClassDefFoundError: Could not initialize class org.apache.curator.framework.recipes.cache.PathChildrenCache
	at org.apache.curator.framework.recipes.cache.TestPathChildrenCache.testRebuildAgainstOtherProcesses(TestPathChildrenCache.java:489)

testRebuildNode(org.apache.curator.framework.recipes.cache.TestPathChildrenCache)  Time elapsed:
0.02 sec  <<< FAILURE!
java.lang.NoClassDefFoundError: org.apache.curator.framework.recipes.cache.PathChildrenCache
	at org.apache.curator.framework.recipes.cache.TestPathChildrenCache.testRebuildNode(TestPathChildrenCache.java:775)

testRebuildNode(org.apache.curator.framework.recipes.cache.TestPathChildrenCache)  Time elapsed:
0.016 sec  <<< FAILURE!
java.lang.NoClassDefFoundError: org.apache.curator.framework.recipes.cache.PathChildrenCache
	at org.apache.curator.framework.recipes.cache.TestPathChildrenCache.testRebuildNode(TestPathChildrenCache.java:775)

testUpdateWhenNotCachingData(org.apache.curator.framework.recipes.cache.TestPathChildrenCache)
 Time elapsed: 0.011 sec  <<< FAILURE!
java.lang.NoClassDefFoundError: Could not initialize class org.apache.curator.framework.recipes.cache.PathChildrenCache
	at org.apache.curator.framework.recipes.cache.TestPathChildrenCache.testUpdateWhenNotCachingData(TestPathChildrenCache.java:338)

testUpdateWhenNotCachingData(org.apache.curator.framework.recipes.cache.TestPathChildrenCache)
 Time elapsed: 0.01 sec  <<< FAILURE!
java.lang.NoClassDefFoundError: Could not initialize class org.apache.curator.framework.recipes.cache.PathChildrenCache
	at org.apache.curator.framework.recipes.cache.TestPathChildrenCache.testUpdateWhenNotCachingData(TestPathChildrenCache.java:338)

Running org.apache.curator.framework.recipes.cache.TestPathChildrenCacheInCluster
Tests run: 1, Failures: 1, Errors: 0, Skipped: 0, Time elapsed: 4.006 sec <<< FAILURE!
- in org.apache.curator.framework.recipes.cache.TestPathChildrenCacheInCluster
testServerLoss(org.apache.curator.framework.recipes.cache.TestPathChildrenCacheInCluster)
 Time elapsed: 3.713 sec  <<< FAILURE!
java.lang.ExceptionInInitializerError: null
	at org.apache.curator.utils.PathUtils.validatePath(PathUtils.java:48)
	at org.apache.curator.framework.recipes.cache.ChildData.<init>(ChildData.java:34)
	at org.apache.curator.framework.recipes.cache.PathChildrenCache.<clinit>(PathChildrenCache.java:91)
	at org.apache.curator.framework.recipes.cache.TestPathChildrenCacheInCluster.testServerLoss(TestPathChildrenCacheInCluster.java:52)

Running org.apache.curator.framework.recipes.cache.TestTreeCacheRandomTree
Tests run: 1, Failures: 0, Errors: 0, Skipped: 0, Time elapsed: 10.681 sec - in org.apache.curator.framework.recipes.cache.TestTreeCacheRandomTree
Running org.apache.curator.framework.client.TestBackgroundStates
Tests run: 2, Failures: 0, Errors: 0, Skipped: 0, Time elapsed: 136.434 sec - in org.apache.curator.framework.client.TestBackgroundStates
Running org.apache.curator.framework.client.TestResetConnectionWithBackgroundFailure
Tests run: 1, Failures: 0, Errors: 0, Skipped: 0, Time elapsed: 209.425 sec - in org.apache.curator.framework.client.TestResetConnectionWithBackgroundFailure

Results :

Failed tests: 
  TestDistributedQueue.testFlush:708 � IllegalArgument Path cannot be null
  TestDistributedQueue.testFlush:708 � IllegalArgument Path cannot be null
  TestDistributedQueue.testMultiPutterSingleGetter:669 � IllegalArgument Path ca...
  TestDistributedQueue.testMultiPutterSingleGetter:669 � IllegalArgument Path ca...
  TestDistributedQueue.testNoDuplicateProcessing:344 � IllegalArgument Path cann...
  TestDistributedQueue.testNoDuplicateProcessing:344 � IllegalArgument Path cann...
  TestDistributedQueue.testPutListener:226 � IllegalArgument Path cannot be null
  TestDistributedQueue.testPutListener:226 � IllegalArgument Path cannot be null
  TestDistributedQueue.testPutMulti:624 � IllegalArgument Path cannot be null
  TestDistributedQueue.testPutMulti:624 � IllegalArgument Path cannot be null
  TestDistributedQueue.testSafetyWithCrash:449 � IllegalArgument Path cannot be ...
  TestDistributedQueue.testSafetyWithCrash:449 � IllegalArgument Path cannot be ...
  TestDistributedQueue.testSimple:768 � IllegalArgument Path cannot be null
  TestDistributedQueue.testSimple:768 � IllegalArgument Path cannot be null
  TestDistributedIdQueue.testOrdering:97 � IllegalArgument Path cannot be null
  TestDistributedIdQueue.testOrdering:97 � IllegalArgument Path cannot be null
  TestDistributedDelayQueue.testBasic:83 � IllegalArgument Path cannot be null
  TestDistributedDelayQueue.testBasic:83 � IllegalArgument Path cannot be null
  TestDistributedDelayQueue.testLateAddition:52 � IllegalArgument Path cannot be...
  TestDistributedDelayQueue.testLateAddition:52 � IllegalArgument Path cannot be...
  TestDistributedDelayQueue.testSimple:112 � IllegalArgument Path cannot be null
  TestDistributedDelayQueue.testSimple:112 � IllegalArgument Path cannot be null
  TestDistributedDelayQueue.testSorting:151 � IllegalArgument Path cannot be nul...
  TestDistributedDelayQueue.testSorting:151 � IllegalArgument Path cannot be nul...
  TestQueueSharder.testDistribution:93 � IllegalState Already closed or has not ...
  TestQueueSharder.testDistribution:93 � IllegalState Already closed or has not ...
  TestQueueSharder.testSharderWatchSync:129 � IllegalState Already closed or has...
  TestQueueSharder.testSharderWatchSync:129 � IllegalState Already closed or has...
  TestQueueSharder.testSimpleDistributedQueue:186 � IllegalState Already closed ...
  TestQueueSharder.testSimpleDistributedQueue:186 � IllegalState Already closed ...
  TestDistributedPriorityQueue.testAdditions:150 � IllegalArgument Path cannot b...
  TestDistributedPriorityQueue.testAdditions:150 � IllegalArgument Path cannot b...
  TestDistributedPriorityQueue.testMinItemsBeforeRefresh:53 � IllegalArgument Pa...
  TestDistributedPriorityQueue.testMinItemsBeforeRefresh:53 � IllegalArgument Pa...
  TestDistributedPriorityQueue.testSimple:195 � IllegalArgument Path cannot be n...
  TestDistributedPriorityQueue.testSimple:195 � IllegalArgument Path cannot be n...
  TestDistributedPriorityQueue.testSortingWhileTaking:101 � IllegalArgument Path...
  TestDistributedPriorityQueue.testSortingWhileTaking:101 � IllegalArgument Path...
  TestBoundedDistributedQueue.testSimple:221 � IllegalArgument Path cannot be nu...
  TestBoundedDistributedQueue.testSimple:221 � IllegalArgument Path cannot be nu...
  TestPersistentEphemeralNode.testNullPath � Test 
Expected exception java.lang....
  TestPersistentEphemeralNode.testNullPath � Test 
Expected exception java.lang....
  TestPathChildrenCache.testAsyncInitialPopulation:195 ExceptionInInitializer
  TestPathChildrenCache.testAsyncInitialPopulation:195 NoClassDefFound Could not...
  TestPathChildrenCache.testBasics:858 NoClassDefFound Could not initialize clas...
  TestPathChildrenCache.testBasics:858 NoClassDefFound Could not initialize clas...
  TestPathChildrenCache.testBasicsOnTwoCachesWithSameExecutor:905 NoClassDefFound
  TestPathChildrenCache.testBasicsOnTwoCachesWithSameExecutor:905 NoClassDefFound
  TestPathChildrenCache.testChildrenInitialized:234 NoClassDefFound Could not in...
  TestPathChildrenCache.testChildrenInitialized:234 NoClassDefFound Could not in...
  TestPathChildrenCache.testChildrenInitializedNormal:288 NoClassDefFound Could ...
  TestPathChildrenCache.testChildrenInitializedNormal:288 NoClassDefFound Could ...
  TestPathChildrenCache.testClientClosedDuringRefreshErrorMessage:165 NoClassDefFound
  TestPathChildrenCache.testClientClosedDuringRefreshErrorMessage:165 NoClassDefFound
  TestPathChildrenCache.testDeleteNodeAfterCloseDoesntCallExecutor:974 NoClassDefFound
  TestPathChildrenCache.testDeleteNodeAfterCloseDoesntCallExecutor:974 NoClassDefFound
  TestPathChildrenCache.testDeleteThenCreate:426 NoClassDefFound Could not initi...
  TestPathChildrenCache.testDeleteThenCreate:426 NoClassDefFound Could not initi...
  TestPathChildrenCache.testEnsurePath:380 NoClassDefFound Could not initialize ...
  TestPathChildrenCache.testEnsurePath:380 NoClassDefFound Could not initialize ...
  TestPathChildrenCache.testInterruptedOperationOnShutdown:1011 NoClassDefFound ...
  TestPathChildrenCache.testInterruptedOperationOnShutdown:1011 NoClassDefFound ...
  TestPathChildrenCache.testIssue27:587 NoClassDefFound Could not initialize cla...
  TestPathChildrenCache.testIssue27:587 NoClassDefFound Could not initialize cla...
  TestPathChildrenCache.testIssue27Alt:644 NoClassDefFound Could not initialize ...
  TestPathChildrenCache.testIssue27Alt:644 NoClassDefFound Could not initialize ...
  TestPathChildrenCache.testKilledSession:689 NoClassDefFound Could not initiali...
  TestPathChildrenCache.testKilledSession:689 NoClassDefFound Could not initiali...
  TestPathChildrenCache.testModes:749->internalTestMode:807 NoClassDefFound Coul...
  TestPathChildrenCache.testModes:749->internalTestMode:807 NoClassDefFound Coul...
  TestPathChildrenCache.testPostInitializedForEmpty:78 NoClassDefFound Could not...
  TestPathChildrenCache.testPostInitializedForEmpty:78 NoClassDefFound Could not...
  TestPathChildrenCache.testRebuildAgainstOtherProcesses:489 NoClassDefFound Cou...
  TestPathChildrenCache.testRebuildAgainstOtherProcesses:489 NoClassDefFound Cou...
  TestPathChildrenCache.testRebuildNode:775 NoClassDefFound org.apache.curator.f...
  TestPathChildrenCache.testRebuildNode:775 NoClassDefFound org.apache.curator.f...
  TestPathChildrenCache.testUpdateWhenNotCachingData:338 NoClassDefFound Could n...
  TestPathChildrenCache.testUpdateWhenNotCachingData:338 NoClassDefFound Could n...
  TestPathChildrenCacheInCluster.testServerLoss:52 ExceptionInInitializer

Tests run: 245, Failures: 79, Errors: 0, Skipped: 0

[ERROR] There are test failures.

Please refer to <https://builds.apache.org/job/Curator/org.apache.curator$curator-recipes/ws/target/surefire-reports>
for the individual test results.
[JENKINS] Recording test results
[INFO] 
[INFO] --- maven-bundle-plugin:2.3.7:bundle (default-bundle) @ curator-recipes ---
[INFO] 
[INFO] --- maven-site-plugin:3.3:attach-descriptor (attach-descriptor) @ curator-recipes ---
[INFO] 
[INFO] --- maven-license-plugin:1.9.0:check (license) @ curator-recipes ---
[INFO] Checking licenses...
[INFO] Missing header in: <https://builds.apache.org/job/Curator/org.apache.curator$curator-recipes/ws/src/main/java/org/apache/curator/framework/recipes/shared/VersionedValue.java>
[CHECKSTYLE] No report found for mojo check

Mime
View raw message