curator-dev mailing list archives

Site index · List index
Message view « Date » · « Thread »
Top « Date » · « Thread »
From Apache Jenkins Server <jenk...@builds.apache.org>
Subject Build failed in Jenkins: Curator » curator-x-rpc #862
Date Sat, 07 Jun 2014 20:15:03 GMT
See <https://builds.apache.org/job/Curator/org.apache.curator$curator-x-rpc/862/changes>

Changes:

[randgalt] wip

[randgalt] wip

[randgalt] wip

[randgalt] wip

[randgalt] wip

[randgalt] wip

[randgalt] wip

[randgalt] wip

[randgalt] wip

[randgalt] wip

[randgalt] refinement of async and a test

[randgalt] wip

[randgalt] wip

[randgalt] first pass at a recipe: locking

[randgalt] null checks

[randgalt] temp checkin

[randgalt] Beginnings of CLI

[randgalt] more work on CLI

[randgalt] more work on CLI

[randgalt] more work on CLI - added airlift logging and logging config

[randgalt] more work on CLI - added airlift logging and logging config

[randgalt] configuration continues

[randgalt] configuration wip

[randgalt] working on moving to Dropwizard's config and logging

[randgalt] transitioned to Dropwizard config and logging

[randgalt] wip

[randgalt] wip

[randgalt] Completed move to new configuration. Connection specs are now fully specified in
the server via configuration. Clients create projections by name only.

[randgalt] wip

[randgalt] wip

[randgalt] Thrift doesn't support null method returns. Wrap with Optionals

[randgalt] Updated test

[randgalt] Updated test

[randgalt] Added getChildren

[randgalt] Added leader selector

[randgalt] some more leader methods - start of path children cache

[randgalt] refactoring

[randgalt] path children cache wip

[randgalt] Finished path children cache

[randgalt] node cache support

[randgalt] refactoring

[randgalt] support PersistentEphemeralNode

[randgalt] added semaphore support

[randgalt] consolidation and removal of old unused lines

[randgalt] Closer doesn't need to pass the value to its method. Thus, it also doesn't need
to be generic

[randgalt] refactoring

[randgalt] initial stab at exception support

[randgalt] started work on service discovery

[randgalt] wip on service discovery

[randgalt] service discovery is feature complete - needs testing

[randgalt] some testing of service discovery

[randgalt] updated

[randgalt] wip

[randgalt] work on packaging and doc

[randgalt] work on packaging and doc

[randgalt] doc wip

[randgalt] wip on doc

[randgalt] wip on doc

[randgalt] wip on doc

[randgalt] wip on doc

[randgalt] wip on doc

[randgalt] reference doc wip

[randgalt] completed initial doc

[randgalt] start writing RPC tests

[randgalt] Return null if the connection manager is closed

[randgalt] doc wip

[randgalt] test recoverable exceptions

[randgalt] doc wip

[randgalt] more tests

[randgalt] Added license header

[randgalt] updated

[randgalt] refactoring

------------------------------------------
[INFO]                                                                         
[INFO] ------------------------------------------------------------------------
[INFO] Building curator-x-rpc 2.5.1-SNAPSHOT
[INFO] ------------------------------------------------------------------------
Downloading: http://repo.maven.apache.org/maven2/org/apache/maven/plugins/maven-shade-plugin/2.3/maven-shade-plugin-2.3.pom
Downloaded: http://repo.maven.apache.org/maven2/org/apache/maven/plugins/maven-shade-plugin/2.3/maven-shade-plugin-2.3.pom
(8 KB at 551.5 KB/sec)
Downloading: http://repo.maven.apache.org/maven2/org/apache/maven/plugins/maven-shade-plugin/2.3/maven-shade-plugin-2.3.jar
Downloaded: http://repo.maven.apache.org/maven2/org/apache/maven/plugins/maven-shade-plugin/2.3/maven-shade-plugin-2.3.jar
(99 KB at 4297.9 KB/sec)
Downloading: http://repo.maven.apache.org/maven2/com/facebook/swift/swift-service/0.12.0/swift-service-0.12.0.pom
Downloaded: http://repo.maven.apache.org/maven2/com/facebook/swift/swift-service/0.12.0/swift-service-0.12.0.pom
(6 KB at 20.3 KB/sec)
Downloading: http://repo.maven.apache.org/maven2/com/facebook/swift/swift-root/0.12.0/swift-root-0.12.0.pom
Downloaded: http://repo.maven.apache.org/maven2/com/facebook/swift/swift-root/0.12.0/swift-root-0.12.0.pom
(13 KB at 79.2 KB/sec)
Downloading: http://repo.maven.apache.org/maven2/com/facebook/facebook-oss-pom/10/facebook-oss-pom-10.pom
Downloaded: http://repo.maven.apache.org/maven2/com/facebook/facebook-oss-pom/10/facebook-oss-pom-10.pom
(45 KB at 496.9 KB/sec)
Downloading: http://repo.maven.apache.org/maven2/com/facebook/swift/swift-annotations/0.12.0/swift-annotations-0.12.0.pom
Downloaded: http://repo.maven.apache.org/maven2/com/facebook/swift/swift-annotations/0.12.0/swift-annotations-0.12.0.pom
(2 KB at 6.5 KB/sec)
Downloading: http://repo.maven.apache.org/maven2/com/facebook/swift/swift-codec/0.12.0/swift-codec-0.12.0.pom
Downloaded: http://repo.maven.apache.org/maven2/com/facebook/swift/swift-codec/0.12.0/swift-codec-0.12.0.pom
(3 KB at 16.1 KB/sec)
Downloading: http://repo.maven.apache.org/maven2/com/thoughtworks/paranamer/paranamer/2.5.2/paranamer-2.5.2.pom
Downloaded: http://repo.maven.apache.org/maven2/com/thoughtworks/paranamer/paranamer/2.5.2/paranamer-2.5.2.pom
(4 KB at 315.9 KB/sec)
Downloading: http://repo.maven.apache.org/maven2/com/thoughtworks/paranamer/paranamer-parent/2.5.2/paranamer-parent-2.5.2.pom
Downloaded: http://repo.maven.apache.org/maven2/com/thoughtworks/paranamer/paranamer-parent/2.5.2/paranamer-parent-2.5.2.pom
(11 KB at 916.6 KB/sec)
Downloading: http://repo.maven.apache.org/maven2/com/facebook/nifty/nifty-client/0.12.0/nifty-client-0.12.0.pom
Downloaded: http://repo.maven.apache.org/maven2/com/facebook/nifty/nifty-client/0.12.0/nifty-client-0.12.0.pom
(3 KB at 11.6 KB/sec)
Downloading: http://repo.maven.apache.org/maven2/com/facebook/nifty/nifty-parent/0.12.0/nifty-parent-0.12.0.pom
Downloaded: http://repo.maven.apache.org/maven2/com/facebook/nifty/nifty-parent/0.12.0/nifty-parent-0.12.0.pom
(8 KB at 29.4 KB/sec)
Downloading: http://repo.maven.apache.org/maven2/com/facebook/nifty/nifty-core/0.12.0/nifty-core-0.12.0.pom
Downloaded: http://repo.maven.apache.org/maven2/com/facebook/nifty/nifty-core/0.12.0/nifty-core-0.12.0.pom
(3 KB at 12.2 KB/sec)
Downloading: http://repo.maven.apache.org/maven2/io/airlift/units/0.83/units-0.83.pom
Downloaded: http://repo.maven.apache.org/maven2/io/airlift/units/0.83/units-0.83.pom (2 KB
at 157.1 KB/sec)
Downloading: http://repo.maven.apache.org/maven2/io/airlift/airlift/0.83/airlift-0.83.pom
Downloaded: http://repo.maven.apache.org/maven2/io/airlift/airlift/0.83/airlift-0.83.pom (11
KB at 931.3 KB/sec)
Downloading: http://repo.maven.apache.org/maven2/io/airlift/airbase/13/airbase-13.pom
Downloaded: http://repo.maven.apache.org/maven2/io/airlift/airbase/13/airbase-13.pom (57 KB
at 3750.3 KB/sec)
Downloading: http://repo.maven.apache.org/maven2/io/airlift/configuration/0.83/configuration-0.83.pom
Downloaded: http://repo.maven.apache.org/maven2/io/airlift/configuration/0.83/configuration-0.83.pom
(2 KB at 19.6 KB/sec)
Downloading: http://repo.maven.apache.org/maven2/io/airlift/stats/0.83/stats-0.83.pom
Downloaded: http://repo.maven.apache.org/maven2/io/airlift/stats/0.83/stats-0.83.pom (2 KB
at 165.0 KB/sec)
Downloading: http://repo.maven.apache.org/maven2/org/weakref/jmxutils/1.13/jmxutils-1.13.pom
Downloaded: http://repo.maven.apache.org/maven2/org/weakref/jmxutils/1.13/jmxutils-1.13.pom
(6 KB at 493.7 KB/sec)
Downloading: http://repo.maven.apache.org/maven2/com/google/code/findbugs/annotations/2.0.1/annotations-2.0.1.pom
Downloaded: http://repo.maven.apache.org/maven2/com/google/code/findbugs/annotations/2.0.1/annotations-2.0.1.pom
(764 B at 62.2 KB/sec)
Downloading: http://repo.maven.apache.org/maven2/org/weakref/jmxutils/1.14/jmxutils-1.14.pom
Downloaded: http://repo.maven.apache.org/maven2/org/weakref/jmxutils/1.14/jmxutils-1.14.pom
(6 KB at 68.1 KB/sec)
Downloading: http://repo.maven.apache.org/maven2/io/dropwizard/dropwizard-configuration/0.7.0/dropwizard-configuration-0.7.0.pom
Downloaded: http://repo.maven.apache.org/maven2/io/dropwizard/dropwizard-configuration/0.7.0/dropwizard-configuration-0.7.0.pom
(2 KB at 103.1 KB/sec)
Downloading: http://repo.maven.apache.org/maven2/io/dropwizard/dropwizard-parent/0.7.0/dropwizard-parent-0.7.0.pom
Downloaded: http://repo.maven.apache.org/maven2/io/dropwizard/dropwizard-parent/0.7.0/dropwizard-parent-0.7.0.pom
(14 KB at 943.7 KB/sec)
Downloading: http://repo.maven.apache.org/maven2/io/dropwizard/dropwizard-jackson/0.7.0/dropwizard-jackson-0.7.0.pom
Downloaded: http://repo.maven.apache.org/maven2/io/dropwizard/dropwizard-jackson/0.7.0/dropwizard-jackson-0.7.0.pom
(4 KB at 335.0 KB/sec)
Downloading: http://repo.maven.apache.org/maven2/io/dropwizard/dropwizard-util/0.7.0/dropwizard-util-0.7.0.pom
Downloaded: http://repo.maven.apache.org/maven2/io/dropwizard/dropwizard-util/0.7.0/dropwizard-util-0.7.0.pom
(2 KB at 107.2 KB/sec)
Downloading: http://repo.maven.apache.org/maven2/com/google/code/findbugs/jsr305/2.0.3/jsr305-2.0.3.pom
Downloaded: http://repo.maven.apache.org/maven2/com/google/code/findbugs/jsr305/2.0.3/jsr305-2.0.3.pom
(2 KB at 112.8 KB/sec)
Downloading: http://repo.maven.apache.org/maven2/com/fasterxml/jackson/datatype/jackson-datatype-guava/2.3.2/jackson-datatype-guava-2.3.2.pom
Downloaded: http://repo.maven.apache.org/maven2/com/fasterxml/jackson/datatype/jackson-datatype-guava/2.3.2/jackson-datatype-guava-2.3.2.pom
(4 KB at 268.9 KB/sec)
Downloading: http://repo.maven.apache.org/maven2/com/fasterxml/jackson/module/jackson-module-afterburner/2.3.2/jackson-module-afterburner-2.3.2.pom
Downloaded: http://repo.maven.apache.org/maven2/com/fasterxml/jackson/module/jackson-module-afterburner/2.3.2/jackson-module-afterburner-2.3.2.pom
(5 KB at 389.6 KB/sec)
Downloading: http://repo.maven.apache.org/maven2/io/dropwizard/dropwizard-validation/0.7.0/dropwizard-validation-0.7.0.pom
Downloaded: http://repo.maven.apache.org/maven2/io/dropwizard/dropwizard-validation/0.7.0/dropwizard-validation-0.7.0.pom
(2 KB at 101.2 KB/sec)
Downloading: http://repo.maven.apache.org/maven2/org/glassfish/web/javax.el/2.2.6/javax.el-2.2.6.pom
Downloaded: http://repo.maven.apache.org/maven2/org/glassfish/web/javax.el/2.2.6/javax.el-2.2.6.pom
(11 KB at 912.3 KB/sec)
Downloading: http://repo.maven.apache.org/maven2/javax/el/javax.el-api/2.2.5/javax.el-api-2.2.5.pom
Downloaded: http://repo.maven.apache.org/maven2/javax/el/javax.el-api/2.2.5/javax.el-api-2.2.5.pom
(11 KB at 943.7 KB/sec)
Downloading: http://repo.maven.apache.org/maven2/io/dropwizard/dropwizard-logging/0.7.0/dropwizard-logging-0.7.0.pom
Downloaded: http://repo.maven.apache.org/maven2/io/dropwizard/dropwizard-logging/0.7.0/dropwizard-logging-0.7.0.pom
(3 KB at 257.6 KB/sec)
Downloading: http://repo.maven.apache.org/maven2/com/codahale/metrics/metrics-logback/3.0.1/metrics-logback-3.0.1.pom
Downloaded: http://repo.maven.apache.org/maven2/com/codahale/metrics/metrics-logback/3.0.1/metrics-logback-3.0.1.pom
(2 KB at 104.4 KB/sec)
Downloading: http://repo.maven.apache.org/maven2/com/codahale/metrics/metrics-parent/3.0.1/metrics-parent-3.0.1.pom
Downloaded: http://repo.maven.apache.org/maven2/com/codahale/metrics/metrics-parent/3.0.1/metrics-parent-3.0.1.pom
(11 KB at 835.9 KB/sec)
Downloading: http://repo.maven.apache.org/maven2/com/codahale/metrics/metrics-core/3.0.1/metrics-core-3.0.1.pom
Downloaded: http://repo.maven.apache.org/maven2/com/codahale/metrics/metrics-core/3.0.1/metrics-core-3.0.1.pom
(845 B at 75.0 KB/sec)
Downloading: http://repo.maven.apache.org/maven2/org/eclipse/jetty/jetty-util/9.0.7.v20131107/jetty-util-9.0.7.v20131107.pom
Downloaded: http://repo.maven.apache.org/maven2/org/eclipse/jetty/jetty-util/9.0.7.v20131107/jetty-util-9.0.7.v20131107.pom
(4 KB at 56.8 KB/sec)
Downloading: http://repo.maven.apache.org/maven2/org/eclipse/jetty/jetty-project/9.0.7.v20131107/jetty-project-9.0.7.v20131107.pom
Downloaded: http://repo.maven.apache.org/maven2/org/eclipse/jetty/jetty-project/9.0.7.v20131107/jetty-project-9.0.7.v20131107.pom
(31 KB at 2317.6 KB/sec)
Downloading: http://repo.maven.apache.org/maven2/com/facebook/swift/swift-service/0.12.0/swift-service-0.12.0.jar
Downloading: http://repo.maven.apache.org/maven2/com/facebook/swift/swift-annotations/0.12.0/swift-annotations-0.12.0.jar
Downloading: http://repo.maven.apache.org/maven2/com/facebook/swift/swift-codec/0.12.0/swift-codec-0.12.0.jar
Downloading: http://repo.maven.apache.org/maven2/com/thoughtworks/paranamer/paranamer/2.5.2/paranamer-2.5.2.jar
Downloading: http://repo.maven.apache.org/maven2/com/facebook/nifty/nifty-client/0.12.0/nifty-client-0.12.0.jar
Downloaded: http://repo.maven.apache.org/maven2/com/thoughtworks/paranamer/paranamer/2.5.2/paranamer-2.5.2.jar
(30 KB at 1403.9 KB/sec)
Downloading: http://repo.maven.apache.org/maven2/com/facebook/nifty/nifty-core/0.12.0/nifty-core-0.12.0.jar
Downloaded: http://repo.maven.apache.org/maven2/com/facebook/swift/swift-annotations/0.12.0/swift-annotations-0.12.0.jar
(8 KB at 43.3 KB/sec)
Downloading: http://repo.maven.apache.org/maven2/io/airlift/configuration/0.83/configuration-0.83.jar
Downloaded: http://repo.maven.apache.org/maven2/com/facebook/swift/swift-codec/0.12.0/swift-codec-0.12.0.jar
(184 KB at 1046.1 KB/sec)
Downloading: http://repo.maven.apache.org/maven2/io/airlift/stats/0.83/stats-0.83.jar
Downloaded: http://repo.maven.apache.org/maven2/io/airlift/configuration/0.83/configuration-0.83.jar
(56 KB at 2659.5 KB/sec)
Downloading: http://repo.maven.apache.org/maven2/io/airlift/units/0.83/units-0.83.jar
Downloaded: http://repo.maven.apache.org/maven2/io/airlift/units/0.83/units-0.83.jar (13 KB
at 1052.7 KB/sec)
Downloading: http://repo.maven.apache.org/maven2/org/weakref/jmxutils/1.14/jmxutils-1.14.jar
Downloaded: http://repo.maven.apache.org/maven2/io/airlift/stats/0.83/stats-0.83.jar (52 KB
at 624.5 KB/sec)
Downloading: http://repo.maven.apache.org/maven2/io/dropwizard/dropwizard-configuration/0.7.0/dropwizard-configuration-0.7.0.jar
Downloaded: http://repo.maven.apache.org/maven2/io/dropwizard/dropwizard-configuration/0.7.0/dropwizard-configuration-0.7.0.jar
(19 KB at 2271.2 KB/sec)
Downloading: http://repo.maven.apache.org/maven2/io/dropwizard/dropwizard-jackson/0.7.0/dropwizard-jackson-0.7.0.jar
Downloaded: http://repo.maven.apache.org/maven2/io/dropwizard/dropwizard-jackson/0.7.0/dropwizard-jackson-0.7.0.jar
(20 KB at 2456.1 KB/sec)
Downloading: http://repo.maven.apache.org/maven2/io/dropwizard/dropwizard-util/0.7.0/dropwizard-util-0.7.0.jar
Downloaded: http://repo.maven.apache.org/maven2/io/dropwizard/dropwizard-util/0.7.0/dropwizard-util-0.7.0.jar
(11 KB at 1316.5 KB/sec)
Downloading: http://repo.maven.apache.org/maven2/com/google/code/findbugs/jsr305/2.0.3/jsr305-2.0.3.jar
Downloaded: http://repo.maven.apache.org/maven2/com/google/code/findbugs/jsr305/2.0.3/jsr305-2.0.3.jar
(33 KB at 4032.1 KB/sec)
Downloading: http://repo.maven.apache.org/maven2/com/fasterxml/jackson/datatype/jackson-datatype-guava/2.3.2/jackson-datatype-guava-2.3.2.jar
Downloaded: http://repo.maven.apache.org/maven2/com/facebook/nifty/nifty-client/0.12.0/nifty-client-0.12.0.jar
(61 KB at 205.0 KB/sec)
Downloading: http://repo.maven.apache.org/maven2/com/fasterxml/jackson/module/jackson-module-afterburner/2.3.2/jackson-module-afterburner-2.3.2.jar
Downloaded: http://repo.maven.apache.org/maven2/com/facebook/swift/swift-service/0.12.0/swift-service-0.12.0.jar
(95 KB at 315.4 KB/sec)
Downloading: http://repo.maven.apache.org/maven2/io/dropwizard/dropwizard-validation/0.7.0/dropwizard-validation-0.7.0.jar
Downloaded: http://repo.maven.apache.org/maven2/com/fasterxml/jackson/datatype/jackson-datatype-guava/2.3.2/jackson-datatype-guava-2.3.2.jar
(59 KB at 5832.4 KB/sec)
Downloading: http://repo.maven.apache.org/maven2/org/glassfish/web/javax.el/2.2.6/javax.el-2.2.6.jar
Downloaded: http://repo.maven.apache.org/maven2/org/weakref/jmxutils/1.14/jmxutils-1.14.jar
(2128 KB at 20457.9 KB/sec)
Downloading: http://repo.maven.apache.org/maven2/javax/el/javax.el-api/2.2.5/javax.el-api-2.2.5.jar
Downloaded: http://repo.maven.apache.org/maven2/com/fasterxml/jackson/module/jackson-module-afterburner/2.3.2/jackson-module-afterburner-2.3.2.jar
(114 KB at 8095.0 KB/sec)
Downloading: http://repo.maven.apache.org/maven2/io/dropwizard/dropwizard-logging/0.7.0/dropwizard-logging-0.7.0.jar
Downloaded: http://repo.maven.apache.org/maven2/io/dropwizard/dropwizard-validation/0.7.0/dropwizard-validation-0.7.0.jar
(18 KB at 1799.4 KB/sec)
Downloading: http://repo.maven.apache.org/maven2/com/codahale/metrics/metrics-logback/3.0.1/metrics-logback-3.0.1.jar
Downloaded: http://repo.maven.apache.org/maven2/io/dropwizard/dropwizard-logging/0.7.0/dropwizard-logging-0.7.0.jar
(23 KB at 2552.1 KB/sec)
Downloading: http://repo.maven.apache.org/maven2/com/codahale/metrics/metrics-core/3.0.1/metrics-core-3.0.1.jar
Downloaded: http://repo.maven.apache.org/maven2/javax/el/javax.el-api/2.2.5/javax.el-api-2.2.5.jar
(38 KB at 3159.4 KB/sec)
Downloading: http://repo.maven.apache.org/maven2/org/eclipse/jetty/jetty-util/9.0.7.v20131107/jetty-util-9.0.7.v20131107.jar
Downloaded: http://repo.maven.apache.org/maven2/com/codahale/metrics/metrics-logback/3.0.1/metrics-logback-3.0.1.jar
(4 KB at 428.6 KB/sec)
Downloaded: http://repo.maven.apache.org/maven2/org/glassfish/web/javax.el/2.2.6/javax.el-2.2.6.jar
(115 KB at 4588.3 KB/sec)
Downloaded: http://repo.maven.apache.org/maven2/com/codahale/metrics/metrics-core/3.0.1/metrics-core-3.0.1.jar
(84 KB at 6418.9 KB/sec)
Downloaded: http://repo.maven.apache.org/maven2/org/eclipse/jetty/jetty-util/9.0.7.v20131107/jetty-util-9.0.7.v20131107.jar
(333 KB at 14474.1 KB/sec)
Downloaded: http://repo.maven.apache.org/maven2/com/facebook/nifty/nifty-core/0.12.0/nifty-core-0.12.0.jar
(79 KB at 213.4 KB/sec)
[INFO] 
[INFO] --- maven-clean-plugin:2.5:clean (default-clean) @ curator-x-rpc ---
[INFO] 
[INFO] --- maven-remote-resources-plugin:1.5:process (default) @ curator-x-rpc ---
[INFO] 
[INFO] --- maven-resources-plugin:2.6:resources (default-resources) @ curator-x-rpc ---
[INFO] Using 'UTF-8' encoding to copy filtered resources.
[INFO] Copying 1 resource
[INFO] Copying 1 resource
[INFO] Copying 3 resources
[INFO] 
[INFO] --- maven-compiler-plugin:3.1:compile (default-compile) @ curator-x-rpc ---
[INFO] Changes detected - recompiling the module!
[INFO] Compiling 63 source files to <https://builds.apache.org/job/Curator/org.apache.curator$curator-x-rpc/ws/target/classes>
[INFO] 
[INFO] --- maven-bundle-plugin:2.3.7:manifest (bundle-manifest) @ curator-x-rpc ---
[INFO] 
[INFO] --- maven-resources-plugin:2.6:testResources (default-testResources) @ curator-x-rpc
---
[INFO] Using 'UTF-8' encoding to copy filtered resources.
[INFO] Copying 4 resources
[INFO] Copying 3 resources
[INFO] 
[INFO] --- maven-compiler-plugin:3.1:testCompile (default-testCompile) @ curator-x-rpc ---
[INFO] Changes detected - recompiling the module!
[INFO] Compiling 52 source files to <https://builds.apache.org/job/Curator/org.apache.curator$curator-x-rpc/ws/target/test-classes>
[INFO] -------------------------------------------------------------
[WARNING] COMPILATION WARNING : 
[INFO] -------------------------------------------------------------
[WARNING] Note: Some input files use unchecked or unsafe operations.
[WARNING] Note: Recompile with -Xlint:unchecked for details.
[INFO] 2 warnings 
[INFO] -------------------------------------------------------------
[INFO] -------------------------------------------------------------
[ERROR] COMPILATION ERROR : 
[INFO] -------------------------------------------------------------
[ERROR] <https://builds.apache.org/job/Curator/org.apache.curator$curator-x-rpc/ws/src/test/java/org/apache/curator/generated/id.java>:[35,8]
class Id is public, should be declared in a file named Id.java
[INFO] 1 error
[INFO] -------------------------------------------------------------
[INFO] ------------------------------------------------------------------------
[INFO] Reactor Summary:
[INFO] 
[INFO] Apache Curator .................................... SUCCESS [27.137s]
[INFO] Curator Testing ................................... SUCCESS [6.112s]
[INFO] Curator Client .................................... SUCCESS [46.123s]
[INFO] Curator Framework ................................. SUCCESS [13:48.380s]
[INFO] Curator Recipes ................................... SUCCESS [49:56.512s]
[INFO] Curator Service Discovery ......................... SUCCESS [51.792s]
[INFO] Curator Examples .................................. SUCCESS [3.025s]
[INFO] Curator Service Discovery Server .................. SUCCESS [15.091s]
[INFO] curator-x-rpc ..................................... FAILURE [11.609s]
[INFO] ------------------------------------------------------------------------
[INFO] BUILD FAILURE
[INFO] ------------------------------------------------------------------------
[INFO] Total time: 1:06:41.340s
[INFO] Finished at: Sat Jun 07 20:14:30 UTC 2014
[INFO] Final Memory: 29M/217M
[INFO] ------------------------------------------------------------------------
Waiting for Jenkins to finish collecting data
[ERROR] Failed to execute goal org.apache.maven.plugins:maven-compiler-plugin:3.1:testCompile
(default-testCompile) on project curator-x-rpc: Compilation failure
[ERROR] <https://builds.apache.org/job/Curator/org.apache.curator$curator-x-rpc/ws/src/test/java/org/apache/curator/generated/id.java>:[35,8]
class Id is public, should be declared in a file named Id.java
[ERROR] -> [Help 1]
[ERROR] 
[ERROR] To see the full stack trace of the errors, re-run Maven with the -e switch.
[ERROR] Re-run Maven using the -X switch to enable full debug logging.
[ERROR] 
[ERROR] For more information about the errors and possible solutions, please read the following
articles:
[ERROR] [Help 1] http://cwiki.apache.org/confluence/display/MAVEN/MojoFailureException
[ERROR] 
[ERROR] After correcting the problems, you can resume the build with the command
[ERROR]   mvn <goals> -rf :curator-x-rpc

Mime
View raw message