curator-dev mailing list archives

Site index · List index
Message view « Date » · « Thread »
Top « Date » · « Thread »
From Apache Jenkins Server <jenk...@builds.apache.org>
Subject Build failed in Jenkins: Curator » Curator Recipes #819
Date Wed, 11 Sep 2013 16:09:19 GMT
See <https://builds.apache.org/job/Curator/org.apache.curator$curator-recipes/819/changes>

Changes:

[jordan.zimmerman] Added LeaderSelectorListenerAdapter to enforce/help with correct connection
state handling. Also, updated

------------------------------------------
[INFO] ------------------------------------------------------------------------
[INFO] Building Curator Recipes
[INFO]    task-segment: [clean, install]
[INFO] ------------------------------------------------------------------------
[INFO] [clean:clean {execution: default-clean}]
[INFO] [remote-resources:process {execution: default}]
[INFO] snapshot org.apache.curator:curator-framework:2.2.1-incubating-SNAPSHOT: checking for
updates from apache.snapshots
[debug] execute contextualize
[INFO] [resources:resources {execution: default-resources}]
[INFO] Using 'UTF-8' encoding to copy filtered resources.
[INFO] Copying 3 resources to META-INF
[INFO] Copying 3 resources
[INFO] [compiler:compile {execution: default-compile}]
[INFO] Changes detected - recompiling the module!
[INFO] Compiling 76 source files to <https://builds.apache.org/job/Curator/org.apache.curator$curator-recipes/ws/target/classes>
[INFO] -------------------------------------------------------------
[WARNING] COMPILATION WARNING : 
[INFO] -------------------------------------------------------------
[WARNING] Note: Some input files use or override a deprecated API.
[WARNING] Note: Recompile with -Xlint:deprecation for details.
[INFO] 2 warnings 
[INFO] -------------------------------------------------------------
[INFO] -------------------------------------------------------------
[ERROR] COMPILATION ERROR : 
[INFO] -------------------------------------------------------------
[ERROR] <https://builds.apache.org/job/Curator/org.apache.curator$curator-recipes/ws/src/main/java/org/apache/curator/framework/recipes/leader/CancelLeadershipException.java>:[52,9]
cannot find symbol
symbol  : constructor RuntimeException(java.lang.String,java.lang.Throwable,boolean,boolean)
location: class java.lang.RuntimeException
[INFO] 1 error
[INFO] -------------------------------------------------------------
[JENKINS] Archiving <https://builds.apache.org/job/Curator/org.apache.curator$curator-recipes/ws/pom.xml>
to /home/hudson/hudson/jobs/Curator/modules/org.apache.curator$curator-recipes/builds/2013-09-11_16-01-45/archive/org.apache.curator/curator-recipes/2.2.1-incubating-SNAPSHOT/curator-recipes-2.2.1-incubating-SNAPSHOT.pom
[INFO] ------------------------------------------------------------------------
[ERROR] BUILD FAILURE
[INFO] ------------------------------------------------------------------------
[INFO] Compilation failure
<https://builds.apache.org/job/Curator/org.apache.curator$curator-recipes/ws/src/main/java/org/apache/curator/framework/recipes/leader/CancelLeadershipException.java>:[52,9]
cannot find symbol
symbol  : constructor RuntimeException(java.lang.String,java.lang.Throwable,boolean,boolean)
location: class java.lang.RuntimeException

[INFO] ------------------------------------------------------------------------
[INFO] For more information, run Maven with the -e switch
[INFO] ------------------------------------------------------------------------
[INFO] Total time: 7 minutes 1 second
[INFO] Finished at: Wed Sep 11 16:09:15 UTC 2013
[INFO] Final Memory: 68M/426M
[INFO] ------------------------------------------------------------------------

Mime
View raw message