curator-dev mailing list archives

Site index · List index
Message view « Date » · « Thread »
Top « Date » · « Thread »
From Apache Jenkins Server <jenk...@builds.apache.org>
Subject Build failed in Jenkins: Curator #831
Date Wed, 25 Sep 2013 04:44:21 GMT
See <https://builds.apache.org/job/Curator/831/changes>

Changes:

[randgalt] CuratorEventType.SET_ACL didn't exist - wrong type was being set

[randgalt] Warn if session timeout is less than connection timeout

[randgalt] Use isTraceEnabled to prevent unnecessary string concat

[randgalt] Wrong path was being usedin getParticipantNodes()

------------------------------------------
[...truncated 141 lines...]
[INFO] [bundle:install {execution: default-install}]
[WARNING] Exception while updating local OBR: Unable to read repository xml: file:/home/jenkins/jenkins-slave/maven-repositories/0/repository.xml
org.apache.maven.plugin.MojoExecutionException: Unable to read repository xml: file:/home/jenkins/jenkins-slave/maven-repositories/0/repository.xml
	at org.apache.felix.obrplugin.ObrUpdate.parseRepositoryXml(ObrUpdate.java:324)
	at org.apache.felix.obrplugin.ObrInstall.execute(ObrInstall.java:141)
	at org.apache.maven.plugin.DefaultPluginManager.executeMojo(DefaultPluginManager.java:490)
	at hudson.maven.agent.PluginManagerInterceptor.executeMojo(PluginManagerInterceptor.java:182)
	at org.apache.maven.lifecycle.DefaultLifecycleExecutor.executeGoals(DefaultLifecycleExecutor.java:694)
	at org.apache.maven.lifecycle.DefaultLifecycleExecutor.executeGoalWithLifecycle(DefaultLifecycleExecutor.java:556)
	at org.apache.maven.lifecycle.DefaultLifecycleExecutor.executeGoal(DefaultLifecycleExecutor.java:535)
	at org.apache.maven.lifecycle.DefaultLifecycleExecutor.executeGoalAndHandleFailures(DefaultLifecycleExecutor.java:387)
	at org.apache.maven.lifecycle.DefaultLifecycleExecutor.executeTaskSegments(DefaultLifecycleExecutor.java:348)
	at org.apache.maven.lifecycle.DefaultLifecycleExecutor.execute(DefaultLifecycleExecutor.java:180)
	at org.apache.maven.lifecycle.LifecycleExecutorInterceptor.execute(LifecycleExecutorInterceptor.java:65)
	at org.apache.maven.DefaultMaven.doExecute(DefaultMaven.java:328)
	at org.apache.maven.DefaultMaven.execute(DefaultMaven.java:138)
	at org.apache.maven.cli.MavenCli.main(MavenCli.java:362)
	at sun.reflect.NativeMethodAccessorImpl.invoke0(Native Method)
	at sun.reflect.NativeMethodAccessorImpl.invoke(NativeMethodAccessorImpl.java:39)
	at sun.reflect.DelegatingMethodAccessorImpl.invoke(DelegatingMethodAccessorImpl.java:25)
	at java.lang.reflect.Method.invoke(Method.java:597)
	at org.codehaus.classworlds.Launcher.launchEnhanced(Launcher.java:315)
	at org.codehaus.classworlds.Launcher.launch(Launcher.java:255)
	at hudson.maven.agent.Main.launch(Main.java:204)
	at hudson.maven.MavenBuilder.call(MavenBuilder.java:154)
	at hudson.maven.Maven2Builder.call(Maven2Builder.java:79)
	at hudson.maven.Maven2Builder.call(Maven2Builder.java:55)
	at hudson.remoting.UserRequest.perform(UserRequest.java:118)
	at hudson.remoting.UserRequest.perform(UserRequest.java:48)
	at hudson.remoting.Request$2.run(Request.java:326)
	at hudson.remoting.InterceptingExecutorService$1.call(InterceptingExecutorService.java:72)
	at java.util.concurrent.FutureTask$Sync.innerRun(FutureTask.java:303)
	at java.util.concurrent.FutureTask.run(FutureTask.java:138)
	at java.util.concurrent.ThreadPoolExecutor$Worker.runTask(ThreadPoolExecutor.java:895)
	at java.util.concurrent.ThreadPoolExecutor$Worker.run(ThreadPoolExecutor.java:918)
	at java.lang.Thread.run(Thread.java:662)
Caused by: org.xmlpull.v1.XmlPullParserException: unexpected type (position:END_DOCUMENT null@3:1
in java.io.InputStreamReader@1833133) 
	at org.kxml2.io.KXmlParser.exception(Unknown Source)
	at org.kxml2.io.KXmlParser.nextTag(Unknown Source)
	at org.apache.felix.bundlerepository.impl.PullParser.parseRepository(PullParser.java:43)
	at org.apache.felix.bundlerepository.impl.DataModelHelperImpl.repository(DataModelHelperImpl.java:147)
	at org.apache.felix.bundlerepository.impl.DataModelHelperImpl.repository(DataModelHelperImpl.java:118)
	at org.apache.felix.obrplugin.ObrUpdate.parseRepositoryXml(ObrUpdate.java:316)
	... 32 more
[JENKINS] Archiving <https://builds.apache.org/job/Curator/ws/curator-client/pom.xml>
to /home/hudson/hudson/jobs/Curator/modules/org.apache.curator$curator-client/builds/2013-09-25_04-04-48/archive/org.apache.curator/curator-client/2.2.1-incubating-SNAPSHOT/curator-client-2.2.1-incubating-SNAPSHOT.pom
[JENKINS] Archiving <https://builds.apache.org/job/Curator/ws/curator-client/target/curator-client-2.2.1-incubating-SNAPSHOT.jar>
to /home/hudson/hudson/jobs/Curator/modules/org.apache.curator$curator-client/builds/2013-09-25_04-04-48/archive/org.apache.curator/curator-client/2.2.1-incubating-SNAPSHOT/curator-client-2.2.1-incubating-SNAPSHOT.jar
[INFO] ------------------------------------------------------------------------
[INFO] Building Curator Framework
[INFO]    task-segment: [clean, install]
[INFO] ------------------------------------------------------------------------
[INFO] [clean:clean {execution: default-clean}]
[INFO] [remote-resources:process {execution: default}]
[INFO] snapshot org.apache.curator:curator-client:2.2.1-incubating-SNAPSHOT: checking for
updates from apache.snapshots
[debug] execute contextualize
[INFO] [resources:resources {execution: default-resources}]
[INFO] Using 'UTF-8' encoding to copy filtered resources.
[INFO] Copying 3 resources to META-INF
[INFO] Copying 3 resources
[INFO] [compiler:compile {execution: default-compile}]
[INFO] Changes detected - recompiling the module!
[INFO] Compiling 94 source files to <https://builds.apache.org/job/Curator/ws/curator-framework/target/classes>
[WARNING] Note: Some input files use or override a deprecated API.
[WARNING] Note: Recompile with -Xlint:deprecation for details.
[INFO] [bundle:manifest {execution: bundle-manifest}]
[debug] execute contextualize
[INFO] [resources:testResources {execution: default-testResources}]
[INFO] Using 'UTF-8' encoding to copy filtered resources.
[INFO] Copying 1 resource
[INFO] Copying 3 resources
[INFO] [compiler:testCompile {execution: default-testCompile}]
[INFO] Changes detected - recompiling the module!
[INFO] Compiling 13 source files to <https://builds.apache.org/job/Curator/ws/curator-framework/target/test-classes>
[WARNING] Note: Some input files use or override a deprecated API.
[WARNING] Note: Recompile with -Xlint:deprecation for details.
[INFO] [surefire:test {execution: default-test}]
[INFO] Surefire report directory: <https://builds.apache.org/job/Curator/ws/curator-framework/target/surefire-reports>

-------------------------------------------------------
 T E S T S
-------------------------------------------------------
Running TestSuite
Tests run: 58, Failures: 0, Errors: 0, Skipped: 0, Time elapsed: 359.127 sec

Results :

Tests run: 58, Failures: 0, Errors: 0, Skipped: 0

[JENKINS] Recording test results
[INFO] [bundle:bundle {execution: default-bundle}]
[INFO] [license:check {execution: license}]
[INFO] Checking licenses...
[CHECKSTYLE] No report found for mojo check[INFO] [install:install {execution: default-install}]
[INFO] Installing <https://builds.apache.org/job/Curator/ws/curator-framework/target/curator-framework-2.2.1-incubating-SNAPSHOT.jar>
to /home/jenkins/jenkins-slave/maven-repositories/0/org/apache/curator/curator-framework/2.2.1-incubating-SNAPSHOT/curator-framework-2.2.1-incubating-SNAPSHOT.jar
[INFO] [bundle:install {execution: default-install}]
[WARNING] Exception while updating local OBR: Unable to read repository xml: file:/home/jenkins/jenkins-slave/maven-repositories/0/repository.xml
org.apache.maven.plugin.MojoExecutionException: Unable to read repository xml: file:/home/jenkins/jenkins-slave/maven-repositories/0/repository.xml
	at org.apache.felix.obrplugin.ObrUpdate.parseRepositoryXml(ObrUpdate.java:324)
	at org.apache.felix.obrplugin.ObrInstall.execute(ObrInstall.java:141)
	at org.apache.maven.plugin.DefaultPluginManager.executeMojo(DefaultPluginManager.java:490)
	at hudson.maven.agent.PluginManagerInterceptor.executeMojo(PluginManagerInterceptor.java:182)
	at org.apache.maven.lifecycle.DefaultLifecycleExecutor.executeGoals(DefaultLifecycleExecutor.java:694)
	at org.apache.maven.lifecycle.DefaultLifecycleExecutor.executeGoalWithLifecycle(DefaultLifecycleExecutor.java:556)
	at org.apache.maven.lifecycle.DefaultLifecycleExecutor.executeGoal(DefaultLifecycleExecutor.java:535)
	at org.apache.maven.lifecycle.DefaultLifecycleExecutor.executeGoalAndHandleFailures(DefaultLifecycleExecutor.java:387)
	at org.apache.maven.lifecycle.DefaultLifecycleExecutor.executeTaskSegments(DefaultLifecycleExecutor.java:348)
	at org.apache.maven.lifecycle.DefaultLifecycleExecutor.execute(DefaultLifecycleExecutor.java:180)
	at org.apache.maven.lifecycle.LifecycleExecutorInterceptor.execute(LifecycleExecutorInterceptor.java:65)
	at org.apache.maven.DefaultMaven.doExecute(DefaultMaven.java:328)
	at org.apache.maven.DefaultMaven.execute(DefaultMaven.java:138)
	at org.apache.maven.cli.MavenCli.main(MavenCli.java:362)
	at sun.reflect.NativeMethodAccessorImpl.invoke0(Native Method)
	at sun.reflect.NativeMethodAccessorImpl.invoke(NativeMethodAccessorImpl.java:39)
	at sun.reflect.DelegatingMethodAccessorImpl.invoke(DelegatingMethodAccessorImpl.java:25)
	at java.lang.reflect.Method.invoke(Method.java:597)
	at org.codehaus.classworlds.Launcher.launchEnhanced(Launcher.java:315)
	at org.codehaus.classworlds.Launcher.launch(Launcher.java:255)
	at hudson.maven.agent.Main.launch(Main.java:204)
	at hudson.maven.MavenBuilder.call(MavenBuilder.java:154)
	at hudson.maven.Maven2Builder.call(Maven2Builder.java:79)
	at hudson.maven.Maven2Builder.call(Maven2Builder.java:55)
	at hudson.remoting.UserRequest.perform(UserRequest.java:118)
	at hudson.remoting.UserRequest.perform(UserRequest.java:48)
	at hudson.remoting.Request$2.run(Request.java:326)

	at hudson.remoting.InterceptingExecutorService$1.call(InterceptingExecutorService.java:72)
	at java.util.concurrent.FutureTask$Sync.innerRun(FutureTask.java:303)
	at java.util.concurrent.FutureTask.run(FutureTask.java:138)
	at java.util.concurrent.ThreadPoolExecutor$Worker.runTask(ThreadPoolExecutor.java:895)
	at java.util.concurrent.ThreadPoolExecutor$Worker.run(ThreadPoolExecutor.java:918)
	at java.lang.Thread.run(Thread.java:662)
Caused by: org.xmlpull.v1.XmlPullParserException: unexpected type (position:END_DOCUMENT null@3:1
in java.io.InputStreamReader@ee9aab) 
	at org.kxml2.io.KXmlParser.exception(Unknown Source)
	at org.kxml2.io.KXmlParser.nextTag(Unknown Source)
	at org.apache.felix.bundlerepository.impl.PullParser.parseRepository(PullParser.java:43)
	at org.apache.felix.bundlerepository.impl.DataModelHelperImpl.repository(DataModelHelperImpl.java:147)
	at org.apache.felix.bundlerepository.impl.DataModelHelperImpl.repository(DataModelHelperImpl.java:118)
	at org.apache.felix.obrplugin.ObrUpdate.parseRepositoryXml(ObrUpdate.java:316)
	... 32 more
[JENKINS] Archiving <https://builds.apache.org/job/Curator/ws/curator-framework/pom.xml>
to /home/hudson/hudson/jobs/Curator/modules/org.apache.curator$curator-framework/builds/2013-09-25_04-04-48/archive/org.apache.curator/curator-framework/2.2.1-incubating-SNAPSHOT/curator-framework-2.2.1-incubating-SNAPSHOT.pom
[JENKINS] Archiving <https://builds.apache.org/job/Curator/ws/curator-framework/target/curator-framework-2.2.1-incubating-SNAPSHOT.jar>
to /home/hudson/hudson/jobs/Curator/modules/org.apache.curator$curator-framework/builds/2013-09-25_04-04-48/archive/org.apache.curator/curator-framework/2.2.1-incubating-SNAPSHOT/curator-framework-2.2.1-incubating-SNAPSHOT.jar
[INFO] ------------------------------------------------------------------------
[INFO] Building Curator Recipes
[INFO]    task-segment: [clean, install]
[INFO] ------------------------------------------------------------------------
[INFO] [clean:clean {execution: default-clean}]
[INFO] [remote-resources:process {execution: default}]
[INFO] snapshot org.apache.curator:curator-framework:2.2.1-incubating-SNAPSHOT: checking for
updates from apache.snapshots
[debug] execute contextualize
[INFO] [resources:resources {execution: default-resources}]
[INFO] Using 'UTF-8' encoding to copy filtered resources.
[INFO] Copying 3 resources to META-INF
[INFO] Copying 3 resources
[INFO] [compiler:compile {execution: default-compile}]
[INFO] Changes detected - recompiling the module!
[INFO] Compiling 76 source files to <https://builds.apache.org/job/Curator/ws/curator-recipes/target/classes>
[WARNING] Note: Some input files use or override a deprecated API.
[WARNING] Note: Recompile with -Xlint:deprecation for details.
[INFO] [bundle:manifest {execution: bundle-manifest}]
[debug] execute contextualize
[INFO] [resources:testResources {execution: default-testResources}]
[INFO] Using 'UTF-8' encoding to copy filtered resources.
[INFO] Copying 1 resource
[INFO] Copying 3 resources
[INFO] [compiler:testCompile {execution: default-testCompile}]
[INFO] Changes detected - recompiling the module!
[INFO] Compiling 39 source files to <https://builds.apache.org/job/Curator/ws/curator-recipes/target/test-classes>
[WARNING] Note: Some input files use or override a deprecated API.
[WARNING] Note: Recompile with -Xlint:deprecation for details.
[INFO] [surefire:test {execution: default-test}]
[INFO] Surefire report directory: <https://builds.apache.org/job/Curator/ws/curator-recipes/target/surefire-reports>

-------------------------------------------------------
 T E S T S
-------------------------------------------------------
Running TestSuite
Exception in thread "ThreadedStreamConsumer" java.lang.OutOfMemoryError: Java heap space
	at java.util.Arrays.copyOf(Arrays.java:2882)
	at java.lang.AbstractStringBuilder.expandCapacity(AbstractStringBuilder.java:100)
	at java.lang.AbstractStringBuilder.append(AbstractStringBuilder.java:390)
	at java.lang.StringBuilder.append(StringBuilder.java:119)
	at org.apache.maven.plugin.surefire.report.TestSetRunListener.getAsString(TestSetRunListener.java:221)
	at org.apache.maven.plugin.surefire.report.TestSetRunListener.wrap(TestSetRunListener.java:228)
	at org.apache.maven.plugin.surefire.report.TestSetRunListener.testSucceeded(TestSetRunListener.java:159)
	at org.apache.maven.plugin.surefire.booterclient.output.ForkClient.consumeLine(ForkClient.java:111)
	at org.apache.maven.plugin.surefire.booterclient.output.ThreadedStreamConsumer$Pumper.run(ThreadedStreamConsumer.java:67)
	at java.lang.Thread.run(Thread.java:662)
Exception in thread "Thread-17" java.lang.OutOfMemoryError: Java heap space
	at java.util.Arrays.copyOfRange(Arrays.java:3209)
	at java.lang.String.<init>(String.java:215)
	at java.io.BufferedReader.readLine(BufferedReader.java:331)
	at java.io.BufferedReader.readLine(BufferedReader.java:362)
	at org.apache.maven.surefire.shade.org.apache.maven.shared.utils.cli.StreamPumper.run(StreamPumper.java:66)

Results :

Tests run: 0, Failures: 0, Errors: 0, Skipped: 0

[JENKINS] Archiving <https://builds.apache.org/job/Curator/ws/curator-recipes/pom.xml>
to /home/hudson/hudson/jobs/Curator/modules/org.apache.curator$curator-recipes/builds/2013-09-25_04-04-48/archive/org.apache.curator/curator-recipes/2.2.1-incubating-SNAPSHOT/curator-recipes-2.2.1-incubating-SNAPSHOT.pom
[INFO] ------------------------------------------------------------------------
[ERROR] FATAL ERROR
[INFO] ------------------------------------------------------------------------
[INFO] The forked VM terminated without saying properly goodbye. VM crash or System.exit called
?
Command was/bin/sh -c cd <https://builds.apache.org/job/Curator/ws/curator-recipes>
&& /home/jenkins/tools/java/jdk1.6.0_45-32/jre/bin/java -jar <https://builds.apache.org/job/Curator/ws/curator-recipes/target/surefire/surefirebooter8965313546562951301.jar>
<https://builds.apache.org/job/Curator/ws/curator-recipes/target/surefire/surefire391842992103442871tmp>
<https://builds.apache.org/job/Curator/ws/curator-recipes/target/surefire/surefire_28374795648808283275tmp>
[INFO] ------------------------------------------------------------------------
[INFO] Trace
java.lang.RuntimeException: The forked VM terminated without saying properly goodbye. VM crash
or System.exit called ?
Command was/bin/sh -c cd <https://builds.apache.org/job/Curator/ws/curator-recipes>
&& /home/jenkins/tools/java/jdk1.6.0_45-32/jre/bin/java -jar <https://builds.apache.org/job/Curator/ws/curator-recipes/target/surefire/surefirebooter8965313546562951301.jar>
<https://builds.apache.org/job/Curator/ws/curator-recipes/target/surefire/surefire391842992103442871tmp>
<https://builds.apache.org/job/Curator/ws/curator-recipes/target/surefire/surefire_28374795648808283275tmp>
	at org.apache.maven.plugin.surefire.booterclient.ForkStarter.fork(ForkStarter.java:443)
	at org.apache.maven.plugin.surefire.booterclient.ForkStarter.run(ForkStarter.java:134)
	at org.apache.maven.plugin.surefire.AbstractSurefireMojo.executeProvider(AbstractSurefireMojo.java:796)
	at org.apache.maven.plugin.surefire.AbstractSurefireMojo.executeAfterPreconditionsChecked(AbstractSurefireMojo.java:691)
	at org.apache.maven.plugin.surefire.AbstractSurefireMojo.execute(AbstractSurefireMojo.java:620)
	at org.apache.maven.plugin.DefaultPluginManager.executeMojo(DefaultPluginManager.java:490)
	at hudson.maven.agent.PluginManagerInterceptor.executeMojo(PluginManagerInterceptor.java:182)
	at org.apache.maven.lifecycle.DefaultLifecycleExecutor.executeGoals(DefaultLifecycleExecutor.java:694)
	at org.apache.maven.lifecycle.DefaultLifecycleExecutor.executeGoalWithLifecycle(DefaultLifecycleExecutor.java:556)
	at org.apache.maven.lifecycle.DefaultLifecycleExecutor.executeGoal(DefaultLifecycleExecutor.java:535)
	at org.apache.maven.lifecycle.DefaultLifecycleExecutor.executeGoalAndHandleFailures(DefaultLifecycleExecutor.java:387)
	at org.apache.maven.lifecycle.DefaultLifecycleExecutor.executeTaskSegments(DefaultLifecycleExecutor.java:348)
	at org.apache.maven.lifecycle.DefaultLifecycleExecutor.execute(DefaultLifecycleExecutor.java:180)
	at org.apache.maven.lifecycle.LifecycleExecutorInterceptor.execute(LifecycleExecutorInterceptor.java:65)
	at org.apache.maven.DefaultMaven.doExecute(DefaultMaven.java:328)
	at org.apache.maven.DefaultMaven.execute(DefaultMaven.java:138)
	at org.apache.maven.cli.MavenCli.main(MavenCli.java:362)
	at sun.reflect.NativeMethodAccessorImpl.invoke0(Native Method)
	at sun.reflect.NativeMethodAccessorImpl.invoke(NativeMethodAccessorImpl.java:39)
	at sun.reflect.DelegatingMethodAccessorImpl.invoke(DelegatingMethodAccessorImpl.java:25)
	at java.lang.reflect.Method.invoke(Method.java:597)
	at org.codehaus.classworlds.Launcher.launchEnhanced(Launcher.java:315)
	at org.codehaus.classworlds.Launcher.launch(Launcher.java:255)
	at hudson.maven.agent.Main.launch(Main.java:204)
	at hudson.maven.MavenBuilder.call(MavenBuilder.java:154)
	at hudson.maven.Maven2Builder.call(Maven2Builder.java:79)
	at hudson.maven.Maven2Builder.call(Maven2Builder.java:55)
	at hudson.remoting.UserRequest.perform(UserRequest.java:118)
	at hudson.remoting.UserRequest.perform(UserRequest.java:48)
	at hudson.remoting.Request$2.run(Request.java:326)
	at hudson.remoting.InterceptingExecutorService$1.call(InterceptingExecutorService.java:72)
	at java.util.concurrent.FutureTask$Sync.innerRun(FutureTask.java:303)
	at java.util.concurrent.FutureTask.run(FutureTask.java:138)
	at java.util.concurrent.ThreadPoolExecutor$Worker.runTask(ThreadPoolExecutor.java:895)
	at java.util.concurrent.ThreadPoolExecutor$Worker.run(ThreadPoolExecutor.java:918)
	at java.lang.Thread.run(Thread.java:662)
[INFO] ------------------------------------------------------------------------
[INFO] Total time: 39 minutes 2 seconds
[INFO] Finished at: Wed Sep 25 04:44:15 UTC 2013
[INFO] Final Memory: 62M/664M
[INFO] ------------------------------------------------------------------------
channel stopped

Mime
View raw message