curator-dev mailing list archives

Site index · List index
Message view « Date » · « Thread »
Top « Date » · « Thread »
From Apache Jenkins Server <jenk...@builds.apache.org>
Subject Build failed in Jenkins: Curator #742
Date Sat, 06 Jul 2013 10:30:44 GMT
See <https://builds.apache.org/job/Curator/742/>

------------------------------------------
[...truncated 54 lines...]
[INFO] [site:attach-descriptor {execution: default-attach-descriptor}]
[INFO] [license:check {execution: license}]
[INFO] Checking licenses...
[CHECKSTYLE] No report found for mojo check
[INFO] [install:install {execution: default-install}]
[INFO] Installing <https://builds.apache.org/job/Curator/ws/pom.xml> to /home/jenkins/jenkins-slave/maven-repositories/0/org/apache/curator/apache-curator/2.1.1-incubating-SNAPSHOT/apache-curator-2.1.1-incubating-SNAPSHOT.pom
[INFO] Installing <https://builds.apache.org/job/Curator/ws/target/apache-curator-2.1.1-incubating-SNAPSHOT-site.xml>
to /home/jenkins/jenkins-slave/maven-repositories/0/org/apache/curator/apache-curator/2.1.1-incubating-SNAPSHOT/apache-curator-2.1.1-incubating-SNAPSHOT-site.xml
[JENKINS] Archiving <https://builds.apache.org/job/Curator/ws/pom.xml> to /home/hudson/hudson/jobs/Curator/modules/org.apache.curator$apache-curator/builds/2013-07-06_10-03-48/archive/org.apache.curator/apache-curator/2.1.1-incubating-SNAPSHOT/apache-curator-2.1.1-incubating-SNAPSHOT.pom
[JENKINS] Archiving <https://builds.apache.org/job/Curator/ws/target/apache-curator-2.1.1-incubating-SNAPSHOT-site.xml>
to /home/hudson/hudson/jobs/Curator/modules/org.apache.curator$apache-curator/builds/2013-07-06_10-03-48/archive/org.apache.curator/apache-curator/2.1.1-incubating-SNAPSHOT/apache-curator-2.1.1-incubating-SNAPSHOT-site.xml
[INFO] ------------------------------------------------------------------------
[INFO] Building Curator Testing
[INFO]    task-segment: [clean, install]
[INFO] ------------------------------------------------------------------------
[INFO] [clean:clean {execution: default-clean}]
[INFO] Deleting <https://builds.apache.org/job/Curator/ws/curator-test/target>
[INFO] [remote-resources:process {execution: default}]
[debug] execute contextualize
[INFO] [resources:resources {execution: default-resources}]
[INFO] Using 'UTF-8' encoding to copy filtered resources.
[INFO] Copying 3 resources to META-INF
[INFO] Copying 3 resources
[INFO] [compiler:compile {execution: default-compile}]
[INFO] Changes detected - recompiling the module!
[INFO] Compiling 13 source files to <https://builds.apache.org/job/Curator/ws/curator-test/target/classes>
[WARNING] Note: <https://builds.apache.org/job/Curator/ws/curator-test/src/main/java/org/apache/curator/test/ServerHelper.java>
uses unchecked or unsafe operations.
[WARNING] Note: Recompile with -Xlint:unchecked for details.
[debug] execute contextualize
[INFO] [resources:testResources {execution: default-testResources}]
[INFO] Using 'UTF-8' encoding to copy filtered resources.
[INFO] skip non existing resourceDirectory <https://builds.apache.org/job/Curator/ws/curator-test/src/test/resources>
[INFO] Copying 3 resources
[INFO] [compiler:testCompile {execution: default-testCompile}]
[INFO] No sources to compile
[INFO] [surefire:test {execution: default-test}]
[JENKINS] Recording test results
[INFO] [jar:jar {execution: default-jar}]
[INFO] Building jar: <https://builds.apache.org/job/Curator/ws/curator-test/target/curator-test-2.1.1-incubating-SNAPSHOT.jar>
[INFO] [license:check {execution: license}]
[INFO] Checking licenses...
[CHECKSTYLE] No report found for mojo check[INFO] [install:install {execution: default-install}]
[INFO] Installing <https://builds.apache.org/job/Curator/ws/curator-test/target/curator-test-2.1.1-incubating-SNAPSHOT.jar>
to /home/jenkins/jenkins-slave/maven-repositories/0/org/apache/curator/curator-test/2.1.1-incubating-SNAPSHOT/curator-test-2.1.1-incubating-SNAPSHOT.jar

[JENKINS] Archiving <https://builds.apache.org/job/Curator/ws/curator-test/pom.xml>
to /home/hudson/hudson/jobs/Curator/modules/org.apache.curator$curator-test/builds/2013-07-06_10-03-48/archive/org.apache.curator/curator-test/2.1.1-incubating-SNAPSHOT/curator-test-2.1.1-incubating-SNAPSHOT.pom
[JENKINS] Archiving <https://builds.apache.org/job/Curator/ws/curator-test/target/curator-test-2.1.1-incubating-SNAPSHOT.jar>
to /home/hudson/hudson/jobs/Curator/modules/org.apache.curator$curator-test/builds/2013-07-06_10-03-48/archive/org.apache.curator/curator-test/2.1.1-incubating-SNAPSHOT/curator-test-2.1.1-incubating-SNAPSHOT.jar
[INFO] ------------------------------------------------------------------------
[INFO] Building Curator Client
[INFO]    task-segment: [clean, install]
[INFO] ------------------------------------------------------------------------
[INFO] [clean:clean {execution: default-clean}]
[INFO] Deleting <https://builds.apache.org/job/Curator/ws/curator-client/target>
[INFO] [remote-resources:process {execution: default}]
[debug] execute contextualize
[INFO] [resources:resources {execution: default-resources}]
[INFO] Using 'UTF-8' encoding to copy filtered resources.
[INFO] Copying 3 resources to META-INF
[INFO] Copying 3 resources
[INFO] [compiler:compile {execution: default-compile}]
[INFO] Changes detected - recompiling the module!
[INFO] Compiling 30 source files to <https://builds.apache.org/job/Curator/ws/curator-client/target/classes>
[WARNING] Note: Some input files use or override a deprecated API.
[WARNING] Note: Recompile with -Xlint:deprecation for details.
[debug] execute contextualize
[INFO] [resources:testResources {execution: default-testResources}]
[INFO] Using 'UTF-8' encoding to copy filtered resources.
[INFO] Copying 1 resource
[INFO] Copying 3 resources
[INFO] [compiler:testCompile {execution: default-testCompile}]
[INFO] Changes detected - recompiling the module!
[INFO] Compiling 7 source files to <https://builds.apache.org/job/Curator/ws/curator-client/target/test-classes>
[WARNING] Note: Some input files use or override a deprecated API.
[WARNING] Note: Recompile with -Xlint:deprecation for details.
[INFO] [surefire:test {execution: default-test}]
[INFO] Surefire report directory: <https://builds.apache.org/job/Curator/ws/curator-client/target/surefire-reports>

-------------------------------------------------------
 T E S T S
-------------------------------------------------------
Running TestSuite
Tests run: 17, Failures: 0, Errors: 0, Skipped: 0, Time elapsed: 22.67 sec

Results :

Tests run: 17, Failures: 0, Errors: 0, Skipped: 0

[JENKINS] Recording test results
[INFO] [jar:jar {execution: default-jar}]
[INFO] Building jar: <https://builds.apache.org/job/Curator/ws/curator-client/target/curator-client-2.1.1-incubating-SNAPSHOT.jar>
[INFO] [license:check {execution: license}]
[INFO] Checking licenses...
[CHECKSTYLE] No report found for mojo check[INFO] [install:install {execution: default-install}]
[INFO] Installing <https://builds.apache.org/job/Curator/ws/curator-client/target/curator-client-2.1.1-incubating-SNAPSHOT.jar>
to /home/jenkins/jenkins-slave/maven-repositories/0/org/apache/curator/curator-client/2.1.1-incubating-SNAPSHOT/curator-client-2.1.1-incubating-SNAPSHOT.jar

[JENKINS] Archiving <https://builds.apache.org/job/Curator/ws/curator-client/pom.xml>
to /home/hudson/hudson/jobs/Curator/modules/org.apache.curator$curator-client/builds/2013-07-06_10-03-48/archive/org.apache.curator/curator-client/2.1.1-incubating-SNAPSHOT/curator-client-2.1.1-incubating-SNAPSHOT.pom
[JENKINS] Archiving <https://builds.apache.org/job/Curator/ws/curator-client/target/curator-client-2.1.1-incubating-SNAPSHOT.jar>
to /home/hudson/hudson/jobs/Curator/modules/org.apache.curator$curator-client/builds/2013-07-06_10-03-48/archive/org.apache.curator/curator-client/2.1.1-incubating-SNAPSHOT/curator-client-2.1.1-incubating-SNAPSHOT.jar
[INFO] ------------------------------------------------------------------------
[INFO] Building Curator Framework
[INFO]    task-segment: [clean, install]
[INFO] ------------------------------------------------------------------------
[INFO] [clean:clean {execution: default-clean}]
[INFO] Deleting <https://builds.apache.org/job/Curator/ws/curator-framework/target>
[INFO] [remote-resources:process {execution: default}]
[debug] execute contextualize
[INFO] [resources:resources {execution: default-resources}]
[INFO] Using 'UTF-8' encoding to copy filtered resources.
[INFO] Copying 3 resources to META-INF
[INFO] Copying 3 resources
[INFO] [compiler:compile {execution: default-compile}]
[INFO] Changes detected - recompiling the module!
[INFO] Compiling 94 source files to <https://builds.apache.org/job/Curator/ws/curator-framework/target/classes>
[WARNING] Note: Some input files use or override a deprecated API.
[WARNING] Note: Recompile with -Xlint:deprecation for details.
[debug] execute contextualize
[INFO] [resources:testResources {execution: default-testResources}]
[INFO] Using 'UTF-8' encoding to copy filtered resources.
[INFO] Copying 1 resource
[INFO] Copying 3 resources
[INFO] [compiler:testCompile {execution: default-testCompile}]
[INFO] Changes detected - recompiling the module!
[INFO] Compiling 13 source files to <https://builds.apache.org/job/Curator/ws/curator-framework/target/test-classes>
[WARNING] Note: Some input files use or override a deprecated API.
[WARNING] Note: Recompile with -Xlint:deprecation for details.
[INFO] [surefire:test {execution: default-test}]
[INFO] Surefire report directory: <https://builds.apache.org/job/Curator/ws/curator-framework/target/surefire-reports>

-------------------------------------------------------
 T E S T S
-------------------------------------------------------
Running TestSuite
Tests run: 56, Failures: 0, Errors: 0, Skipped: 0, Time elapsed: 319.355 sec

Results :

Tests run: 56, Failures: 0, Errors: 0, Skipped: 0

[JENKINS] Recording test results
[INFO] [jar:jar {execution: default-jar}]
[INFO] Building jar: <https://builds.apache.org/job/Curator/ws/curator-framework/target/curator-framework-2.1.1-incubating-SNAPSHOT.jar>
[INFO] [license:check {execution: license}]
[INFO] Checking licenses...
[CHECKSTYLE] No report found for mojo check[INFO] [install:install {execution: default-install}]
[INFO] Installing <https://builds.apache.org/job/Curator/ws/curator-framework/target/curator-framework-2.1.1-incubating-SNAPSHOT.jar>
to /home/jenkins/jenkins-slave/maven-repositories/0/org/apache/curator/curator-framework/2.1.1-incubating-SNAPSHOT/curator-framework-2.1.1-incubating-SNAPSHOT.jar

[JENKINS] Archiving <https://builds.apache.org/job/Curator/ws/curator-framework/pom.xml>
to /home/hudson/hudson/jobs/Curator/modules/org.apache.curator$curator-framework/builds/2013-07-06_10-03-48/archive/org.apache.curator/curator-framework/2.1.1-incubating-SNAPSHOT/curator-framework-2.1.1-incubating-SNAPSHOT.pom
[JENKINS] Archiving <https://builds.apache.org/job/Curator/ws/curator-framework/target/curator-framework-2.1.1-incubating-SNAPSHOT.jar>
to /home/hudson/hudson/jobs/Curator/modules/org.apache.curator$curator-framework/builds/2013-07-06_10-03-48/archive/org.apache.curator/curator-framework/2.1.1-incubating-SNAPSHOT/curator-framework-2.1.1-incubating-SNAPSHOT.jar
[INFO] ------------------------------------------------------------------------
[INFO] Building Curator Recipes
[INFO]    task-segment: [clean, install]
[INFO] ------------------------------------------------------------------------
[INFO] [clean:clean {execution: default-clean}]
[INFO] Deleting <https://builds.apache.org/job/Curator/ws/curator-recipes/target>
[INFO] [remote-resources:process {execution: default}]
[debug] execute contextualize
[INFO] [resources:resources {execution: default-resources}]
[INFO] Using 'UTF-8' encoding to copy filtered resources.
[INFO] Copying 3 resources to META-INF
[INFO] Copying 3 resources
[INFO] [compiler:compile {execution: default-compile}]
[INFO] Changes detected - recompiling the module!
[INFO] Compiling 74 source files to <https://builds.apache.org/job/Curator/ws/curator-recipes/target/classes>
[WARNING] Note: Some input files use or override a deprecated API.
[WARNING] Note: Recompile with -Xlint:deprecation for details.
[debug] execute contextualize
[INFO] [resources:testResources {execution: default-testResources}]
[INFO] Using 'UTF-8' encoding to copy filtered resources.
[INFO] Copying 1 resource
[INFO] Copying 3 resources
[INFO] [compiler:testCompile {execution: default-testCompile}]
[INFO] Changes detected - recompiling the module!
[INFO] Compiling 38 source files to <https://builds.apache.org/job/Curator/ws/curator-recipes/target/test-classes>
[WARNING] Note: Some input files use or override a deprecated API.
[WARNING] Note: Recompile with -Xlint:deprecation for details.
[INFO] [surefire:test {execution: default-test}]
[INFO] Surefire report directory: <https://builds.apache.org/job/Curator/ws/curator-recipes/target/surefire-reports>

-------------------------------------------------------
 T E S T S
-------------------------------------------------------
Running TestSuite
Tests run: 159, Failures: 1, Errors: 0, Skipped: 0, Time elapsed: 1,181.522 sec <<<
FAILURE!
testMaxPerSession(org.apache.curator.framework.recipes.locks.TestInterProcessSemaphore)  Time
elapsed: 156.057 sec  <<< FAILURE!
java.util.concurrent.ExecutionException: java.lang.AssertionError: expected object to not
be null
	at org.testng.Assert.fail(Assert.java:89)
	at org.testng.Assert.assertNotNull(Assert.java:399)
	at org.testng.Assert.assertNotNull(Assert.java:384)
	at org.apache.curator.framework.recipes.locks.TestInterProcessSemaphore$3.call(TestInterProcessSemaphore.java:191)
	at java.util.concurrent.FutureTask$Sync.innerRun(FutureTask.java:303)
	at java.util.concurrent.FutureTask.run(FutureTask.java:138)
	at java.util.concurrent.ThreadPoolExecutor$Worker.runTask(ThreadPoolExecutor.java:895)
	at java.util.concurrent.ThreadPoolExecutor$Worker.run(ThreadPoolExecutor.java:918)
	at java.lang.Thread.run(Thread.java:662)


Results :

Failed tests: 
  TestInterProcessSemaphore.testMaxPerSession:232 ? Execution java.lang.Assertio...

Tests run: 159, Failures: 1, Errors: 0, Skipped: 0

[ERROR] There are test failures.

Please refer to <https://builds.apache.org/job/Curator/ws/curator-recipes/target/surefire-reports>
for the individual test results.
[JENKINS] Recording test results
[JENKINS] Archiving <https://builds.apache.org/job/Curator/ws/curator-recipes/pom.xml>
to /home/hudson/hudson/jobs/Curator/modules/org.apache.curator$curator-recipes/builds/2013-07-06_10-03-48/archive/org.apache.curator/curator-recipes/2.1.1-incubating-SNAPSHOT/curator-recipes-2.1.1-incubating-SNAPSHOT.pom
[INFO] ------------------------------------------------------------------------
[ERROR] FATAL ERROR
[INFO] ------------------------------------------------------------------------
[INFO] Java heap space
[INFO] ------------------------------------------------------------------------
[INFO] Trace
java.lang.OutOfMemoryError: Java heap space
	at java.nio.HeapCharBuffer.<init>(HeapCharBuffer.java:39)
	at java.nio.CharBuffer.allocate(CharBuffer.java:312)
	at java.nio.charset.CharsetDecoder.decode(CharsetDecoder.java:775)
	at java.nio.charset.Charset.decode(Charset.java:771)
	at hudson.tasks.junit.SuiteResult.<init>(SuiteResult.java:215)
	at hudson.tasks.junit.SuiteResult.parseSuite(SuiteResult.java:147)
	at hudson.tasks.junit.SuiteResult.parse(SuiteResult.java:132)
	at hudson.tasks.junit.TestResult.parse(TestResult.java:267)
	at hudson.tasks.junit.TestResult.parsePossiblyEmpty(TestResult.java:223)
	at hudson.tasks.junit.TestResult.parse(TestResult.java:192)
	at hudson.maven.reporters.SurefireArchiver.postExecute(SurefireArchiver.java:148)
	at hudson.maven.Maven2Builder.postExecute(Maven2Builder.java:157)
	at hudson.maven.MavenBuilder$Adapter.postExecute(MavenBuilder.java:334)
	at hudson.maven.agent.PluginManagerInterceptor$1MojoIntercepterImpl.callPost(PluginManagerInterceptor.java:170)
	at hudson.maven.agent.PluginManagerInterceptor.executeMojo(PluginManagerInterceptor.java:183)
	at org.apache.maven.lifecycle.DefaultLifecycleExecutor.executeGoals(DefaultLifecycleExecutor.java:694)
	at org.apache.maven.lifecycle.DefaultLifecycleExecutor.executeGoalWithLifecycle(DefaultLifecycleExecutor.java:556)
	at org.apache.maven.lifecycle.DefaultLifecycleExecutor.executeGoal(DefaultLifecycleExecutor.java:535)
	at org.apache.maven.lifecycle.DefaultLifecycleExecutor.executeGoalAndHandleFailures(DefaultLifecycleExecutor.java:387)
	at org.apache.maven.lifecycle.DefaultLifecycleExecutor.executeTaskSegments(DefaultLifecycleExecutor.java:348)
	at org.apache.maven.lifecycle.DefaultLifecycleExecutor.execute(DefaultLifecycleExecutor.java:180)
	at org.apache.maven.lifecycle.LifecycleExecutorInterceptor.execute(LifecycleExecutorInterceptor.java:65)
	at org.apache.maven.DefaultMaven.doExecute(DefaultMaven.java:328)
	at org.apache.maven.DefaultMaven.execute(DefaultMaven.java:138)
	at org.apache.maven.cli.MavenCli.main(MavenCli.java:362)
	at sun.reflect.NativeMethodAccessorImpl.invoke0(Native Method)
	at sun.reflect.NativeMethodAccessorImpl.invoke(NativeMethodAccessorImpl.java:39)
	at sun.reflect.DelegatingMethodAccessorImpl.invoke(DelegatingMethodAccessorImpl.java:25)
	at java.lang.reflect.Method.invoke(Method.java:597)
	at org.codehaus.classworlds.Launcher.launchEnhanced(Launcher.java:315)
	at org.codehaus.classworlds.Launcher.launch(Launcher.java:255)
	at hudson.maven.agent.Main.launch(Main.java:185)
[INFO] ------------------------------------------------------------------------
[INFO] Total time: 26 minutes 19 seconds
[INFO] Finished at: Sat Jul 06 10:30:35 UTC 2013
[INFO] Final Memory: 58M/801M
[INFO] ------------------------------------------------------------------------
channel stopped

Mime
View raw message