curator-dev mailing list archives

Site index · List index
Message view « Date » · « Thread »
Top « Date » · « Thread »
From Apache Jenkins Server <jenk...@builds.apache.org>
Subject Build failed in Jenkins: Curator #697
Date Sun, 16 Jun 2013 08:29:21 GMT
See <https://builds.apache.org/job/Curator/697/>

------------------------------------------
[...truncated 30 lines...]
[Curator] $ /home/hudson/tools/java/latest1.6/bin/java -cp /home/jenkins/jenkins-slave/maven-agent.jar:/home/jenkins/jenkins-slave/classworlds.jar
hudson.maven.agent.Main /home/hudson/tools/maven/apache-maven-2.2.1 /home/jenkins/jenkins-slave/slave.jar
/home/jenkins/jenkins-slave/maven-interceptor.jar 41058 /home/jenkins/jenkins-slave/maven2.1-interceptor.jar
<===[JENKINS REMOTING CAPACITY]===>channel started
   log4j:WARN No appenders could be found for logger (org.apache.commons.beanutils.converters.BooleanConverter).
log4j:WARN Please initialize the log4j system properly.
Executing Maven:  -B -f <https://builds.apache.org/job/Curator/ws/pom.xml> -Dmaven.repo.local=/home/jenkins/jenkins-slave/maven-repositories/1
clean install
[INFO] Scanning for projects...
[INFO] Reactor build order: 
[INFO]   Apache Curator
[INFO]   Curator Testing
[INFO]   Curator Client
[INFO]   Curator Framework
[INFO]   Curator Recipes
[INFO]   Curator Service Discovery
[INFO]   Curator Examples
[INFO]   Curator Service Discovery Server
[INFO] ------------------------------------------------------------------------
[INFO] Building Apache Curator
[INFO]    task-segment: [clean, install]
[INFO] ------------------------------------------------------------------------
[INFO] [clean:clean {execution: default-clean}]
[INFO] Deleting <https://builds.apache.org/job/Curator/ws/target>
[INFO] [remote-resources:process {execution: default}]
[INFO] [site:attach-descriptor {execution: default-attach-descriptor}]
[INFO] [license:check {execution: license}]
[INFO] Checking licenses...
[CHECKSTYLE] No report found for mojo check[INFO] [install:install {execution: default-install}]

[INFO] Installing <https://builds.apache.org/job/Curator/ws/pom.xml> to /home/jenkins/jenkins-slave/maven-repositories/1/org/apache/curator/apache-curator/2.0.2-incubating-SNAPSHOT/apache-curator-2.0.2-incubating-SNAPSHOT.pom
[INFO] Installing <https://builds.apache.org/job/Curator/ws/target/apache-curator-2.0.2-incubating-SNAPSHOT-site.xml>
to /home/jenkins/jenkins-slave/maven-repositories/1/org/apache/curator/apache-curator/2.0.2-incubating-SNAPSHOT/apache-curator-2.0.2-incubating-SNAPSHOT-site.xml
[JENKINS] Archiving <https://builds.apache.org/job/Curator/ws/pom.xml> to /home/hudson/hudson/jobs/Curator/modules/org.apache.curator$apache-curator/builds/2013-06-16_08-01-45/archive/org.apache.curator/apache-curator/2.0.2-incubating-SNAPSHOT/apache-curator-2.0.2-incubating-SNAPSHOT.pom
[JENKINS] Archiving <https://builds.apache.org/job/Curator/ws/target/apache-curator-2.0.2-incubating-SNAPSHOT-site.xml>
to /home/hudson/hudson/jobs/Curator/modules/org.apache.curator$apache-curator/builds/2013-06-16_08-01-45/archive/org.apache.curator/apache-curator/2.0.2-incubating-SNAPSHOT/apache-curator-2.0.2-incubating-SNAPSHOT-site.xml
[INFO] ------------------------------------------------------------------------
[INFO] Building Curator Testing
[INFO]    task-segment: [clean, install]
[INFO] ------------------------------------------------------------------------
[INFO] [clean:clean {execution: default-clean}]
[INFO] Deleting <https://builds.apache.org/job/Curator/ws/curator-test/target>
[INFO] [remote-resources:process {execution: default}]
[debug] execute contextualize
[INFO] [resources:resources {execution: default-resources}]
[INFO] Using 'UTF-8' encoding to copy filtered resources.
[INFO] Copying 3 resources to META-INF
[INFO] Copying 3 resources
[INFO] [compiler:compile {execution: default-compile}]
[INFO] Changes detected - recompiling the module!
[INFO] Compiling 13 source files to <https://builds.apache.org/job/Curator/ws/curator-test/target/classes>
[WARNING] Note: <https://builds.apache.org/job/Curator/ws/curator-test/src/main/java/org/apache/curator/test/ServerHelper.java>
uses unchecked or unsafe operations.
[WARNING] Note: Recompile with -Xlint:unchecked for details.
[debug] execute contextualize
[INFO] [resources:testResources {execution: default-testResources}]
[INFO] Using 'UTF-8' encoding to copy filtered resources.
[INFO] skip non existing resourceDirectory <https://builds.apache.org/job/Curator/ws/curator-test/src/test/resources>
[INFO] Copying 3 resources
[INFO] [compiler:testCompile {execution: default-testCompile}]
[INFO] No sources to compile
[INFO] [surefire:test {execution: default-test}]
[JENKINS] Recording test results
[INFO] [jar:jar {execution: default-jar}]
[INFO] Building jar: <https://builds.apache.org/job/Curator/ws/curator-test/target/curator-test-2.0.2-incubating-SNAPSHOT.jar>
[INFO] [license:check {execution: license}]
[INFO] Checking licenses...
[CHECKSTYLE] No report found for mojo check[INFO] [install:install {execution: default-install}]
[INFO] Installing <https://builds.apache.org/job/Curator/ws/curator-test/target/curator-test-2.0.2-incubating-SNAPSHOT.jar>
to /home/jenkins/jenkins-slave/maven-repositories/1/org/apache/curator/curator-test/2.0.2-incubating-SNAPSHOT/curator-test-2.0.2-incubating-SNAPSHOT.jar

[JENKINS] Archiving <https://builds.apache.org/job/Curator/ws/curator-test/pom.xml>
to /home/hudson/hudson/jobs/Curator/modules/org.apache.curator$curator-test/builds/2013-06-16_08-01-45/archive/org.apache.curator/curator-test/2.0.2-incubating-SNAPSHOT/curator-test-2.0.2-incubating-SNAPSHOT.pom
[JENKINS] Archiving <https://builds.apache.org/job/Curator/ws/curator-test/target/curator-test-2.0.2-incubating-SNAPSHOT.jar>
to /home/hudson/hudson/jobs/Curator/modules/org.apache.curator$curator-test/builds/2013-06-16_08-01-45/archive/org.apache.curator/curator-test/2.0.2-incubating-SNAPSHOT/curator-test-2.0.2-incubating-SNAPSHOT.jar
[INFO] ------------------------------------------------------------------------
[INFO] Building Curator Client
[INFO]    task-segment: [clean, install]
[INFO] ------------------------------------------------------------------------
[INFO] [clean:clean {execution: default-clean}]
[INFO] Deleting <https://builds.apache.org/job/Curator/ws/curator-client/target>
[INFO] [remote-resources:process {execution: default}]
[debug] execute contextualize
[INFO] [resources:resources {execution: default-resources}]
[INFO] Using 'UTF-8' encoding to copy filtered resources.
[INFO] Copying 3 resources to META-INF
[INFO] Copying 3 resources
[INFO] [compiler:compile {execution: default-compile}]
[INFO] Changes detected - recompiling the module!
[INFO] Compiling 30 source files to <https://builds.apache.org/job/Curator/ws/curator-client/target/classes>
[WARNING] Note: Some input files use or override a deprecated API.
[WARNING] Note: Recompile with -Xlint:deprecation for details.
[debug] execute contextualize
[INFO] [resources:testResources {execution: default-testResources}]
[INFO] Using 'UTF-8' encoding to copy filtered resources.
[INFO] Copying 1 resource
[INFO] Copying 3 resources
[INFO] [compiler:testCompile {execution: default-testCompile}]
[INFO] Changes detected - recompiling the module!
[INFO] Compiling 7 source files to <https://builds.apache.org/job/Curator/ws/curator-client/target/test-classes>
[WARNING] Note: Some input files use or override a deprecated API.
[WARNING] Note: Recompile with -Xlint:deprecation for details.
[INFO] [surefire:test {execution: default-test}]
[INFO] Surefire report directory: <https://builds.apache.org/job/Curator/ws/curator-client/target/surefire-reports>

-------------------------------------------------------
 T E S T S
-------------------------------------------------------
Running TestSuite
Tests run: 17, Failures: 0, Errors: 0, Skipped: 0, Time elapsed: 25.511 sec

Results :

Tests run: 17, Failures: 0, Errors: 0, Skipped: 0

[JENKINS] Recording test results
[INFO] [jar:jar {execution: default-jar}]
[INFO] Building jar: <https://builds.apache.org/job/Curator/ws/curator-client/target/curator-client-2.0.2-incubating-SNAPSHOT.jar>
[INFO] [license:check {execution: license}]
[INFO] Checking licenses...
[CHECKSTYLE] No report found for mojo check[INFO] [install:install {execution: default-install}]
[INFO] Installing <https://builds.apache.org/job/Curator/ws/curator-client/target/curator-client-2.0.2-incubating-SNAPSHOT.jar>
to /home/jenkins/jenkins-slave/maven-repositories/1/org/apache/curator/curator-client/2.0.2-incubating-SNAPSHOT/curator-client-2.0.2-incubating-SNAPSHOT.jar

[JENKINS] Archiving <https://builds.apache.org/job/Curator/ws/curator-client/pom.xml>
to /home/hudson/hudson/jobs/Curator/modules/org.apache.curator$curator-client/builds/2013-06-16_08-01-45/archive/org.apache.curator/curator-client/2.0.2-incubating-SNAPSHOT/curator-client-2.0.2-incubating-SNAPSHOT.pom
[JENKINS] Archiving <https://builds.apache.org/job/Curator/ws/curator-client/target/curator-client-2.0.2-incubating-SNAPSHOT.jar>
to /home/hudson/hudson/jobs/Curator/modules/org.apache.curator$curator-client/builds/2013-06-16_08-01-45/archive/org.apache.curator/curator-client/2.0.2-incubating-SNAPSHOT/curator-client-2.0.2-incubating-SNAPSHOT.jar
[INFO] ------------------------------------------------------------------------
[INFO] Building Curator Framework
[INFO]    task-segment: [clean, install]
[INFO] ------------------------------------------------------------------------
[INFO] [clean:clean {execution: default-clean}]
[INFO] Deleting <https://builds.apache.org/job/Curator/ws/curator-framework/target>
[INFO] [remote-resources:process {execution: default}]
[debug] execute contextualize
[INFO] [resources:resources {execution: default-resources}]
[INFO] Using 'UTF-8' encoding to copy filtered resources.
[INFO] Copying 3 resources to META-INF
[INFO] Copying 3 resources
[INFO] [compiler:compile {execution: default-compile}]
[INFO] Changes detected - recompiling the module!
[INFO] Compiling 92 source files to <https://builds.apache.org/job/Curator/ws/curator-framework/target/classes>
[WARNING] Note: Some input files use or override a deprecated API.
[WARNING] Note: Recompile with -Xlint:deprecation for details.
[debug] execute contextualize
[INFO] [resources:testResources {execution: default-testResources}]
[INFO] Using 'UTF-8' encoding to copy filtered resources.
[INFO] Copying 1 resource
[INFO] Copying 3 resources
[INFO] [compiler:testCompile {execution: default-testCompile}]
[INFO] Changes detected - recompiling the module!
[INFO] Compiling 13 source files to <https://builds.apache.org/job/Curator/ws/curator-framework/target/test-classes>
[WARNING] Note: Some input files use or override a deprecated API.
[WARNING] Note: Recompile with -Xlint:deprecation for details.
[INFO] [surefire:test {execution: default-test}]
[INFO] Surefire report directory: <https://builds.apache.org/job/Curator/ws/curator-framework/target/surefire-reports>

-------------------------------------------------------
 T E S T S
-------------------------------------------------------
Running TestSuite
Tests run: 55, Failures: 0, Errors: 0, Skipped: 0, Time elapsed: 333.954 sec

Results :

Tests run: 55, Failures: 0, Errors: 0, Skipped: 0

[JENKINS] Recording test results
[INFO] [jar:jar {execution: default-jar}]
[INFO] Building jar: <https://builds.apache.org/job/Curator/ws/curator-framework/target/curator-framework-2.0.2-incubating-SNAPSHOT.jar>
[INFO] [license:check {execution: license}]
[INFO] Checking licenses...
[CHECKSTYLE] No report found for mojo check[INFO] [install:install {execution: default-install}]
[INFO] Installing <https://builds.apache.org/job/Curator/ws/curator-framework/target/curator-framework-2.0.2-incubating-SNAPSHOT.jar>
to /home/jenkins/jenkins-slave/maven-repositories/1/org/apache/curator/curator-framework/2.0.2-incubating-SNAPSHOT/curator-framework-2.0.2-incubating-SNAPSHOT.jar

[JENKINS] Archiving <https://builds.apache.org/job/Curator/ws/curator-framework/pom.xml>
to /home/hudson/hudson/jobs/Curator/modules/org.apache.curator$curator-framework/builds/2013-06-16_08-01-45/archive/org.apache.curator/curator-framework/2.0.2-incubating-SNAPSHOT/curator-framework-2.0.2-incubating-SNAPSHOT.pom
[JENKINS] Archiving <https://builds.apache.org/job/Curator/ws/curator-framework/target/curator-framework-2.0.2-incubating-SNAPSHOT.jar>
to /home/hudson/hudson/jobs/Curator/modules/org.apache.curator$curator-framework/builds/2013-06-16_08-01-45/archive/org.apache.curator/curator-framework/2.0.2-incubating-SNAPSHOT/curator-framework-2.0.2-incubating-SNAPSHOT.jar
[INFO] ------------------------------------------------------------------------
[INFO] Building Curator Recipes
[INFO]    task-segment: [clean, install]
[INFO] ------------------------------------------------------------------------
[INFO] [clean:clean {execution: default-clean}]
[INFO] Deleting <https://builds.apache.org/job/Curator/ws/curator-recipes/target>
[INFO] [remote-resources:process {execution: default}]
[debug] execute contextualize
[INFO] [resources:resources {execution: default-resources}]
[INFO] Using 'UTF-8' encoding to copy filtered resources.
[INFO] Copying 3 resources to META-INF
[INFO] Copying 3 resources
[INFO] [compiler:compile {execution: default-compile}]
[INFO] Changes detected - recompiling the module!
[INFO] Compiling 74 source files to <https://builds.apache.org/job/Curator/ws/curator-recipes/target/classes>
[WARNING] Note: Some input files use or override a deprecated API.
[WARNING] Note: Recompile with -Xlint:deprecation for details.
[debug] execute contextualize
[INFO] [resources:testResources {execution: default-testResources}]
[INFO] Using 'UTF-8' encoding to copy filtered resources.
[INFO] Copying 1 resource
[INFO] Copying 3 resources
[INFO] [compiler:testCompile {execution: default-testCompile}]
[INFO] Changes detected - recompiling the module!
[INFO] Compiling 38 source files to <https://builds.apache.org/job/Curator/ws/curator-recipes/target/test-classes>
[WARNING] Note: Some input files use or override a deprecated API.
[WARNING] Note: Recompile with -Xlint:deprecation for details.
[INFO] [surefire:test {execution: default-test}]
[INFO] Surefire report directory: <https://builds.apache.org/job/Curator/ws/curator-recipes/target/surefire-reports>

-------------------------------------------------------
 T E S T S
-------------------------------------------------------
Running TestSuite
Tests run: 159, Failures: 1, Errors: 0, Skipped: 0, Time elapsed: 1,182.508 sec <<<
FAILURE!
testMaxPerSession(org.apache.curator.framework.recipes.locks.TestInterProcessSemaphore)  Time
elapsed: 145.934 sec  <<< FAILURE!
java.util.concurrent.ExecutionException: java.lang.AssertionError: expected object to not
be null
	at org.testng.Assert.fail(Assert.java:89)
	at org.testng.Assert.assertNotNull(Assert.java:399)
	at org.testng.Assert.assertNotNull(Assert.java:384)
	at org.apache.curator.framework.recipes.locks.TestInterProcessSemaphore$3.call(TestInterProcessSemaphore.java:191)
	at java.util.concurrent.FutureTask$Sync.innerRun(FutureTask.java:303)
	at java.util.concurrent.FutureTask.run(FutureTask.java:138)
	at java.util.concurrent.ThreadPoolExecutor$Worker.runTask(ThreadPoolExecutor.java:895)
	at java.util.concurrent.ThreadPoolExecutor$Worker.run(ThreadPoolExecutor.java:918)
	at java.lang.Thread.run(Thread.java:662)


Results :

Failed tests: 
  TestInterProcessSemaphore.testMaxPerSession:232 ? Execution java.lang.Assertio...

Tests run: 159, Failures: 1, Errors: 0, Skipped: 0

[ERROR] There are test failures.

Please refer to <https://builds.apache.org/job/Curator/ws/curator-recipes/target/surefire-reports>
for the individual test results.
[JENKINS] Recording test results
[INFO] [jar:jar {execution: default-jar}]
[INFO] Building jar: <https://builds.apache.org/job/Curator/ws/curator-recipes/target/curator-recipes-2.0.2-incubating-SNAPSHOT.jar>
[INFO] [license:check {execution: license}]
[INFO] Checking licenses...
[INFO] Missing header in: <https://builds.apache.org/job/Curator/ws/curator-recipes/src/test/java/org/apache/curator/framework/recipes/nodes/TestPersistentEphemeralNode.java>
[INFO] Missing header in: <https://builds.apache.org/job/Curator/ws/curator-recipes/src/main/java/org/apache/curator/framework/recipes/nodes/PersistentEphemeralNode.java>
[CHECKSTYLE] No report found for mojo check
[JENKINS] Archiving <https://builds.apache.org/job/Curator/ws/curator-recipes/pom.xml>
to /home/hudson/hudson/jobs/Curator/modules/org.apache.curator$curator-recipes/builds/2013-06-16_08-01-45/archive/org.apache.curator/curator-recipes/2.0.2-incubating-SNAPSHOT/curator-recipes-2.0.2-incubating-SNAPSHOT.pom
[JENKINS] Archiving <https://builds.apache.org/job/Curator/ws/curator-recipes/target/curator-recipes-2.0.2-incubating-SNAPSHOT.jar>
to /home/hudson/hudson/jobs/Curator/modules/org.apache.curator$curator-recipes/builds/2013-06-16_08-01-45/archive/org.apache.curator/curator-recipes/2.0.2-incubating-SNAPSHOT/curator-recipes-2.0.2-incubating-SNAPSHOT.jar
[INFO] ------------------------------------------------------------------------
[ERROR] BUILD ERROR
[INFO] ------------------------------------------------------------------------
[INFO] Some files do not have the expected license header
[INFO] ------------------------------------------------------------------------
[INFO] For more information, run Maven with the -e switch
[INFO] ------------------------------------------------------------------------
[INFO] Total time: 26 minutes 54 seconds
[INFO] Finished at: Sun Jun 16 08:29:16 UTC 2013
[INFO] Final Memory: 73M/417M
[INFO] ------------------------------------------------------------------------
Waiting for Jenkins to finish collecting data
Maven failed with error.
Sending e-mails to: dev@curator.incubator.apache.org
channel stopped

Mime
View raw message