curator-dev mailing list archives

Site index · List index
Message view « Date » · « Thread »
Top « Date » · « Thread »
From Apache Jenkins Server <jenk...@builds.apache.org>
Subject Build failed in Jenkins: Curator #2
Date Sun, 31 Mar 2013 03:36:49 GMT
See <https://builds.apache.org/job/Curator/2/>

------------------------------------------
[...truncated 322 lines...]
[INFO] --- maven-clean-plugin:2.4.1:clean (default-clean) @ curator-x-discovery ---
[INFO] 
[INFO] --- maven-remote-resources-plugin:1.2.1:process (default) @ curator-x-discovery ---
[INFO] [debug] execute contextualize
[INFO] Using 'UTF-8' encoding to copy filtered resources.
[INFO] Copying 0 resource to META-INF
[INFO] Copying 3 resources

[INFO] --- maven-resources-plugin:2.5:resources (default-resources) @ curator-x-discovery
---
[INFO] Changes detected - recompiling the module!
[INFO] [INFO] Compiling 25 source files to <https://builds.apache.org/job/Curator/ws/curator-x-discovery/target/classes>

[INFO] --- maven-compiler-plugin:3.0:compile (default-compile) @ curator-x-discovery ---
[WARNING] <https://builds.apache.org/job/Curator/ws/curator-x-discovery/src/main/java/org/apache/curator/x/discovery/details/ServiceDiscoveryImpl.java>:
Some input files use or override a deprecated API.
[WARNING] <https://builds.apache.org/job/Curator/ws/curator-x-discovery/src/main/java/org/apache/curator/x/discovery/details/ServiceDiscoveryImpl.java>:
Recompile with -Xlint:deprecation for details.
[INFO] [debug] execute contextualize
[INFO] Using 'UTF-8' encoding to copy filtered resources.
[INFO] Copying 1 resource
[INFO] Copying 3 resources

[INFO] --- maven-resources-plugin:2.5:testResources (default-testResources) @ curator-x-discovery
---
[INFO] [INFO] Changes detected - recompiling the module!
[INFO] Compiling 6 source files to <https://builds.apache.org/job/Curator/ws/curator-x-discovery/target/test-classes>

[INFO] --- maven-compiler-plugin:3.0:testCompile (default-testCompile) @ curator-x-discovery
---
[WARNING] <https://builds.apache.org/job/Curator/ws/curator-x-discovery/src/test/java/org/apache/curator/x/discovery/TestServiceDiscovery.java>:
Some input files use or override a deprecated API.
[WARNING] <https://builds.apache.org/job/Curator/ws/curator-x-discovery/src/test/java/org/apache/curator/x/discovery/TestServiceDiscovery.java>:
Recompile with -Xlint:deprecation for details.
[INFO] [INFO] Surefire report directory: <https://builds.apache.org/job/Curator/ws/curator-x-discovery/target/surefire-reports>

-------------------------------------------------------
 T E S T S
-------------------------------------------------------

[INFO] --- maven-surefire-plugin:2.13:test (default-test) @ curator-x-discovery ---
Running TestSuite
Tests run: 23, Failures: 0, Errors: 0, Skipped: 0, Time elapsed: 16.707 sec

Results :

Tests run: 23, Failures: 0, Errors: 0, Skipped: 0

[JENKINS] Recording test results
[INFO] 
[INFO] --- maven-jar-plugin:2.3.1:jar (default-jar) @ curator-x-discovery ---
[INFO] Building jar: <https://builds.apache.org/job/Curator/ws/curator-x-discovery/target/curator-x-discovery-2.0.1-SNAPSHOT.jar>
[INFO] 
[INFO] --- maven-site-plugin:3.2:attach-descriptor (attach-descriptor) @ curator-x-discovery
---
[INFO] [INFO] Checking licenses...

[INFO] --- maven-license-plugin:1.9.0:check (license) @ curator-x-discovery ---
[INFO] Installing <https://builds.apache.org/job/Curator/ws/curator-x-discovery/target/curator-x-discovery-2.0.1-SNAPSHOT.jar>
to /home/jenkins/jenkins-slave/maven-repositories/1/org/apache/curator/curator-x-discovery/2.0.1-SNAPSHOT/curator-x-discovery-2.0.1-SNAPSHOT.jar
[INFO] Installing <https://builds.apache.org/job/Curator/ws/curator-x-discovery/pom.xml>
to /home/jenkins/jenkins-slave/maven-repositories/1/org/apache/curator/curator-x-discovery/2.0.1-SNAPSHOT/curator-x-discovery-2.0.1-SNAPSHOT.pom
[CHECKSTYLE] No report found for mojo check
[INFO] 
[INFO] --- maven-install-plugin:2.3.1:install (default-install) @ curator-x-discovery ---
[INFO]                                                                         
[INFO] ------------------------------------------------------------------------
[INFO] Building Curator Examples 2.0.1-SNAPSHOT
[INFO] ------------------------------------------------------------------------
[INFO] 
[INFO] --- maven-clean-plugin:2.4.1:clean (default-clean) @ curator-examples ---
[INFO] 
[INFO] --- maven-remote-resources-plugin:1.2.1:process (default) @ curator-examples ---
[debug] execute contextualize
[INFO] [INFO] Using 'UTF-8' encoding to copy filtered resources.
[INFO] Copying 0 resource to META-INF
[INFO] Copying 3 resources

[INFO] --- maven-resources-plugin:2.5:resources (default-resources) @ curator-examples ---
[INFO] [INFO] Changes detected - recompiling the module!
[INFO] Compiling 12 source files to <https://builds.apache.org/job/Curator/ws/curator-examples/target/classes>

[INFO] --- maven-compiler-plugin:3.0:compile (default-compile) @ curator-examples ---
[WARNING] <https://builds.apache.org/job/Curator/ws/curator-examples/src/main/java/locking/LockingExample.java>:
Some input files use or override a deprecated API.
[WARNING] <https://builds.apache.org/job/Curator/ws/curator-examples/src/main/java/locking/LockingExample.java>:
Recompile with -Xlint:deprecation for details.
[INFO] [debug] execute contextualize
[INFO] Using 'UTF-8' encoding to copy filtered resources.
[INFO] skip non existing resourceDirectory <https://builds.apache.org/job/Curator/ws/curator-examples/src/test/resources>
[INFO] Copying 3 resources

[INFO] --- maven-resources-plugin:2.5:testResources (default-testResources) @ curator-examples
---
[INFO] [INFO] No sources to compile

[INFO] --- maven-compiler-plugin:3.0:testCompile (default-testCompile) @ curator-examples
---
[INFO] 
[INFO] --- maven-surefire-plugin:2.13:test (default-test) @ curator-examples ---
[JENKINS] Recording test results
[INFO] 
[INFO] --- maven-jar-plugin:2.3.1:jar (default-jar) @ curator-examples ---
[INFO] Building jar: <https://builds.apache.org/job/Curator/ws/curator-examples/target/curator-examples-2.0.1-SNAPSHOT.jar>
[INFO] 
[INFO] --- maven-site-plugin:3.2:attach-descriptor (attach-descriptor) @ curator-examples
---
[INFO] [INFO] Checking licenses...

[INFO] --- maven-license-plugin:1.9.0:check (license) @ curator-examples ---
[CHECKSTYLE] No report found for mojo check[INFO] Installing <https://builds.apache.org/job/Curator/ws/curator-examples/target/curator-examples-2.0.1-SNAPSHOT.jar>
to /home/jenkins/jenkins-slave/maven-repositories/1/org/apache/curator/curator-examples/2.0.1-SNAPSHOT/curator-examples-2.0.1-SNAPSHOT.jar
[INFO] Installing <https://builds.apache.org/job/Curator/ws/curator-examples/pom.xml>
to /home/jenkins/jenkins-slave/maven-repositories/1/org/apache/curator/curator-examples/2.0.1-SNAPSHOT/curator-examples-2.0.1-SNAPSHOT.pom

[INFO] 
[INFO] --- maven-install-plugin:2.3.1:install (default-install) @ curator-examples ---
[INFO]                                                                         
[INFO] ------------------------------------------------------------------------
[INFO] Building Curator Service Discovery Server 2.0.1-SNAPSHOT
[INFO] ------------------------------------------------------------------------
Downloading: http://repo.maven.apache.org/maven2/com/sun/jersey/jersey-servlet/1.11/jersey-servlet-1.11.pom
Downloaded: http://repo.maven.apache.org/maven2/com/sun/jersey/jersey-servlet/1.11/jersey-servlet-1.11.pom
(0 B at 0.0 KB/sec)
Downloading: http://repo.maven.apache.org/maven2/org/jboss/resteasy/resteasy-jaxrs/2.3.0.GA/resteasy-jaxrs-2.3.0.GA.pom
Downloaded: http://repo.maven.apache.org/maven2/org/jboss/resteasy/resteasy-jaxrs/2.3.0.GA/resteasy-jaxrs-2.3.0.GA.pom
(4 KB at 7.5 KB/sec)
Downloading: http://repo.maven.apache.org/maven2/org/jboss/resteasy/resteasy-jaxrs-all/2.3.0.GA/resteasy-jaxrs-all-2.3.0.GA.pom
Downloaded: http://repo.maven.apache.org/maven2/org/jboss/resteasy/resteasy-jaxrs-all/2.3.0.GA/resteasy-jaxrs-all-2.3.0.GA.pom
(16 KB at 38.9 KB/sec)
Downloading: http://repo.maven.apache.org/maven2/org/jboss/resteasy/jaxrs-api/2.3.0.GA/jaxrs-api-2.3.0.GA.pom
Downloaded: http://repo.maven.apache.org/maven2/org/jboss/resteasy/jaxrs-api/2.3.0.GA/jaxrs-api-2.3.0.GA.pom
(963 B at 3.3 KB/sec)
Downloading: http://repo.maven.apache.org/maven2/com/sun/jersey/jersey-servlet/1.11/jersey-servlet-1.11.jar
Downloading: http://repo.maven.apache.org/maven2/org/jboss/resteasy/resteasy-jaxrs/2.3.0.GA/resteasy-jaxrs-2.3.0.GA.jar
Downloading: http://repo.maven.apache.org/maven2/org/jboss/resteasy/jaxrs-api/2.3.0.GA/jaxrs-api-2.3.0.GA.jar
Downloaded: http://repo.maven.apache.org/maven2/com/sun/jersey/jersey-servlet/1.11/jersey-servlet-1.11.jar
(0 B at 0.0 KB/sec)
Downloaded: http://repo.maven.apache.org/maven2/org/jboss/resteasy/jaxrs-api/2.3.0.GA/jaxrs-api-2.3.0.GA.jar
(46 KB at 108.2 KB/sec)
Downloaded: http://repo.maven.apache.org/maven2/org/jboss/resteasy/resteasy-jaxrs/2.3.0.GA/resteasy-jaxrs-2.3.0.GA.jar
(581 KB at 1103.5 KB/sec)
[INFO] 
[INFO] --- maven-clean-plugin:2.4.1:clean (default-clean) @ curator-x-discovery-server ---
[INFO] 
[INFO] --- maven-remote-resources-plugin:1.2.1:process (default) @ curator-x-discovery-server
---
[INFO] [debug] execute contextualize
[INFO] Using 'UTF-8' encoding to copy filtered resources.
[INFO] Copying 0 resource to META-INF
[INFO] Copying 3 resources

[INFO] --- maven-resources-plugin:2.5:resources (default-resources) @ curator-x-discovery-server
---
[INFO] [INFO] Changes detected - recompiling the module!
[INFO] Compiling 12 source files to <https://builds.apache.org/job/Curator/ws/curator-x-discovery-server/target/classes>

[INFO] --- maven-compiler-plugin:3.0:compile (default-compile) @ curator-x-discovery-server
---
[WARNING] <https://builds.apache.org/job/Curator/ws/curator-x-discovery-server/src/main/java/org/apache/curator/x/discovery/server/contexts/GenericDiscoveryContext.java>:
Some input files use unchecked or unsafe operations.
[WARNING] <https://builds.apache.org/job/Curator/ws/curator-x-discovery-server/src/main/java/org/apache/curator/x/discovery/server/contexts/GenericDiscoveryContext.java>:
Recompile with -Xlint:unchecked for details.
[debug] execute contextualize
[INFO] [INFO] Using 'UTF-8' encoding to copy filtered resources.
[INFO] Copying 1 resource
[INFO] Copying 3 resources

[INFO] --- maven-resources-plugin:2.5:testResources (default-testResources) @ curator-x-discovery-server
---
[INFO] [INFO] Changes detected - recompiling the module!
[INFO] Compiling 13 source files to <https://builds.apache.org/job/Curator/ws/curator-x-discovery-server/target/test-classes>

[INFO] --- maven-compiler-plugin:3.0:testCompile (default-testCompile) @ curator-x-discovery-server
---
[WARNING] <https://builds.apache.org/job/Curator/ws/curator-x-discovery-server/src/test/java/org/apache/curator/x/discovery/server/jetty_resteasy/StringDiscoveryResource.java>:
<https://builds.apache.org/job/Curator/ws/curator-x-discovery-server/src/test/java/org/apache/curator/x/discovery/server/jetty_resteasy/StringDiscoveryResource.java>
uses unchecked or unsafe operations.
[WARNING] <https://builds.apache.org/job/Curator/ws/curator-x-discovery-server/src/test/java/org/apache/curator/x/discovery/server/jetty_resteasy/StringDiscoveryResource.java>:
Recompile with -Xlint:unchecked for details.
[INFO] [INFO] Surefire report directory: <https://builds.apache.org/job/Curator/ws/curator-x-discovery-server/target/surefire-reports>

-------------------------------------------------------
 T E S T S
-------------------------------------------------------

[INFO] --- maven-surefire-plugin:2.13:test (default-test) @ curator-x-discovery-server ---
Running TestSuite
Tests run: 6, Failures: 0, Errors: 0, Skipped: 0, Time elapsed: 5.709 sec

Results :

Tests run: 6, Failures: 0, Errors: 0, Skipped: 0

[JENKINS] Recording test results
[INFO] 
[INFO] --- maven-jar-plugin:2.3.1:jar (default-jar) @ curator-x-discovery-server ---
[INFO] Building jar: <https://builds.apache.org/job/Curator/ws/curator-x-discovery-server/target/curator-x-discovery-server-2.0.1-SNAPSHOT.jar>
[INFO] 
[INFO] --- maven-site-plugin:3.2:attach-descriptor (attach-descriptor) @ curator-x-discovery-server
---
[INFO] [INFO] Checking licenses...

[INFO] --- maven-license-plugin:1.9.0:check (license) @ curator-x-discovery-server ---
[INFO] Missing header in: <https://builds.apache.org/job/Curator/ws/curator-x-discovery-server/README.txt>
[CHECKSTYLE] No report found for mojo check
[INFO] ------------------------------------------------------------------------
[INFO] Reactor Summary:
[INFO] 
[INFO] Apache Curator .................................... SUCCESS [30.330s]
[INFO] Curator Testing ................................... SUCCESS [10.650s]
[INFO] Curator Client .................................... SUCCESS [30.869s]
[INFO] Curator Framework ................................. SUCCESS [6:51.799s]
[INFO] Curator Recipes ................................... SUCCESS [20:15.357s]
[INFO] Curator Service Discovery ......................... SUCCESS [21.142s]
[INFO] Curator Examples .................................. SUCCESS [2.863s]
[INFO] Curator Service Discovery Server .................. FAILURE [14.662s]
[INFO] ------------------------------------------------------------------------
[INFO] BUILD FAILURE
[INFO] ------------------------------------------------------------------------
[INFO] Total time: 29:02.383s
[INFO] Finished at: Sun Mar 31 03:36:34 UTC 2013
[INFO] Final Memory: 32M/396M
[INFO] ------------------------------------------------------------------------
[JENKINS] Archiving <https://builds.apache.org/job/Curator/ws/curator-examples/pom.xml>
to /home/hudson/hudson/jobs/Curator/modules/org.apache.curator$curator-examples/builds/2013-03-31_03-07-07/archive/org.apache.curator/curator-examples/2.0.1-SNAPSHOT/curator-examples-2.0.1-SNAPSHOT.pom
[JENKINS] Archiving <https://builds.apache.org/job/Curator/ws/curator-examples/target/curator-examples-2.0.1-SNAPSHOT.jar>
to /home/hudson/hudson/jobs/Curator/modules/org.apache.curator$curator-examples/builds/2013-03-31_03-07-07/archive/org.apache.curator/curator-examples/2.0.1-SNAPSHOT/curator-examples-2.0.1-SNAPSHOT.jar
[JENKINS] Archiving <https://builds.apache.org/job/Curator/ws/curator-x-discovery/pom.xml>
to /home/hudson/hudson/jobs/Curator/modules/org.apache.curator$curator-x-discovery/builds/2013-03-31_03-07-07/archive/org.apache.curator/curator-x-discovery/2.0.1-SNAPSHOT/curator-x-discovery-2.0.1-SNAPSHOT.pom
[JENKINS] Archiving <https://builds.apache.org/job/Curator/ws/curator-x-discovery/target/curator-x-discovery-2.0.1-SNAPSHOT.jar>
to /home/hudson/hudson/jobs/Curator/modules/org.apache.curator$curator-x-discovery/builds/2013-03-31_03-07-07/archive/org.apache.curator/curator-x-discovery/2.0.1-SNAPSHOT/curator-x-discovery-2.0.1-SNAPSHOT.jar
[JENKINS] Archiving <https://builds.apache.org/job/Curator/ws/pom.xml> to /home/hudson/hudson/jobs/Curator/modules/org.apache.curator$curator/builds/2013-03-31_03-07-07/archive/org.apache.curator/curator/2.0.1-SNAPSHOT/curator-2.0.1-SNAPSHOT.pom
[JENKINS] Archiving <https://builds.apache.org/job/Curator/ws/target/curator-2.0.1-SNAPSHOT-site.xml>
to /home/hudson/hudson/jobs/Curator/modules/org.apache.curator$curator/builds/2013-03-31_03-07-07/archive/org.apache.curator/curator/2.0.1-SNAPSHOT/curator-2.0.1-SNAPSHOT-site.xml
[JENKINS] Archiving <https://builds.apache.org/job/Curator/ws/curator-recipes/pom.xml>
to /home/hudson/hudson/jobs/Curator/modules/org.apache.curator$curator-recipes/builds/2013-03-31_03-07-07/archive/org.apache.curator/curator-recipes/2.0.1-SNAPSHOT/curator-recipes-2.0.1-SNAPSHOT.pom
[JENKINS] Archiving <https://builds.apache.org/job/Curator/ws/curator-recipes/target/curator-recipes-2.0.1-SNAPSHOT.jar>
to /home/hudson/hudson/jobs/Curator/modules/org.apache.curator$curator-recipes/builds/2013-03-31_03-07-07/archive/org.apache.curator/curator-recipes/2.0.1-SNAPSHOT/curator-recipes-2.0.1-SNAPSHOT.jar
[JENKINS] Archiving <https://builds.apache.org/job/Curator/ws/curator-test/pom.xml>
to /home/hudson/hudson/jobs/Curator/modules/org.apache.curator$curator-test/builds/2013-03-31_03-07-07/archive/org.apache.curator/curator-test/2.0.1-SNAPSHOT/curator-test-2.0.1-SNAPSHOT.pom
[JENKINS] Archiving <https://builds.apache.org/job/Curator/ws/curator-test/target/curator-test-2.0.1-SNAPSHOT.jar>
to /home/hudson/hudson/jobs/Curator/modules/org.apache.curator$curator-test/builds/2013-03-31_03-07-07/archive/org.apache.curator/curator-test/2.0.1-SNAPSHOT/curator-test-2.0.1-SNAPSHOT.jar
[JENKINS] Archiving <https://builds.apache.org/job/Curator/ws/curator-framework/pom.xml>
to /home/hudson/hudson/jobs/Curator/modules/org.apache.curator$curator-framework/builds/2013-03-31_03-07-07/archive/org.apache.curator/curator-framework/2.0.1-SNAPSHOT/curator-framework-2.0.1-SNAPSHOT.pom
[JENKINS] Archiving <https://builds.apache.org/job/Curator/ws/curator-framework/target/curator-framework-2.0.1-SNAPSHOT.jar>
to /home/hudson/hudson/jobs/Curator/modules/org.apache.curator$curator-framework/builds/2013-03-31_03-07-07/archive/org.apache.curator/curator-framework/2.0.1-SNAPSHOT/curator-framework-2.0.1-SNAPSHOT.jar
[JENKINS] Archiving <https://builds.apache.org/job/Curator/ws/curator-client/pom.xml>
to /home/hudson/hudson/jobs/Curator/modules/org.apache.curator$curator-client/builds/2013-03-31_03-07-07/archive/org.apache.curator/curator-client/2.0.1-SNAPSHOT/curator-client-2.0.1-SNAPSHOT.pom
[JENKINS] Archiving <https://builds.apache.org/job/Curator/ws/curator-client/target/curator-client-2.0.1-SNAPSHOT.jar>
to /home/hudson/hudson/jobs/Curator/modules/org.apache.curator$curator-client/builds/2013-03-31_03-07-07/archive/org.apache.curator/curator-client/2.0.1-SNAPSHOT/curator-client-2.0.1-SNAPSHOT.jar
[JENKINS] Archiving <https://builds.apache.org/job/Curator/ws/curator-x-discovery-server/pom.xml>
to /home/hudson/hudson/jobs/Curator/modules/org.apache.curator$curator-x-discovery-server/builds/2013-03-31_03-07-07/archive/org.apache.curator/curator-x-discovery-server/2.0.1-SNAPSHOT/curator-x-discovery-server-2.0.1-SNAPSHOT.pom
[JENKINS] Archiving <https://builds.apache.org/job/Curator/ws/curator-x-discovery-server/target/curator-x-discovery-server-2.0.1-SNAPSHOT.jar>
to /home/hudson/hudson/jobs/Curator/modules/org.apache.curator$curator-x-discovery-server/builds/2013-03-31_03-07-07/archive/org.apache.curator/curator-x-discovery-server/2.0.1-SNAPSHOT/curator-x-discovery-server-2.0.1-SNAPSHOT.jar
Waiting for Jenkins to finish collecting data
mavenExecutionResult exceptions not empty
message : Failed to execute goal com.mycila.maven-license-plugin:maven-license-plugin:1.9.0:check
(license) on project curator-x-discovery-server: Some files do not have the expected license
header
cause : Some files do not have the expected license header
Stack trace : 
org.apache.maven.lifecycle.LifecycleExecutionException: Failed to execute goal com.mycila.maven-license-plugin:maven-license-plugin:1.9.0:check
(license) on project curator-x-discovery-server: Some files do not have the expected license
header
	at org.apache.maven.lifecycle.internal.MojoExecutor.execute(MojoExecutor.java:217)
	at org.apache.maven.lifecycle.internal.MojoExecutor.execute(MojoExecutor.java:153)
	at org.apache.maven.lifecycle.internal.MojoExecutor.execute(MojoExecutor.java:145)
	at org.apache.maven.lifecycle.internal.LifecycleModuleBuilder.buildProject(LifecycleModuleBuilder.java:84)
	at org.apache.maven.lifecycle.internal.LifecycleModuleBuilder.buildProject(LifecycleModuleBuilder.java:59)
	at org.apache.maven.lifecycle.internal.LifecycleStarter.singleThreadedBuild(LifecycleStarter.java:183)
	at org.apache.maven.lifecycle.internal.LifecycleStarter.execute(LifecycleStarter.java:161)
	at org.apache.maven.DefaultMaven.doExecute(DefaultMaven.java:320)
	at org.apache.maven.DefaultMaven.execute(DefaultMaven.java:156)
	at org.jvnet.hudson.maven3.launcher.Maven3Launcher.main(Maven3Launcher.java:79)
	at sun.reflect.NativeMethodAccessorImpl.invoke0(Native Method)
	at sun.reflect.NativeMethodAccessorImpl.invoke(NativeMethodAccessorImpl.java:57)
	at sun.reflect.DelegatingMethodAccessorImpl.invoke(DelegatingMethodAccessorImpl.java:43)
	at java.lang.reflect.Method.invoke(Method.java:616)
	at org.codehaus.plexus.classworlds.launcher.Launcher.launchStandard(Launcher.java:329)
	at org.codehaus.plexus.classworlds.launcher.Launcher.launch(Launcher.java:239)
	at org.jvnet.hudson.maven3.agent.Maven3Main.launch(Maven3Main.java:158)
	at hudson.maven.Maven3Builder.call(Maven3Builder.java:100)
	at hudson.maven.Maven3Builder.call(Maven3Builder.java:66)
	at hudson.remoting.UserRequest.perform(UserRequest.java:118)
	at hudson.remoting.UserRequest.perform(UserRequest.java:48)
	at hudson.remoting.Request$2.run(Request.java:326)
	at hudson.remoting.InterceptingExecutorService$1.call(InterceptingExecutorService.java:72)
	at java.util.concurrent.FutureTask$Sync.innerRun(FutureTask.java:334)
	at java.util.concurrent.FutureTask.run(FutureTask.java:166)
	at java.util.concurrent.ThreadPoolExecutor.runWorker(ThreadPoolExecutor.java:1146)
	at java.util.concurrent.ThreadPoolExecutor$Worker.run(ThreadPoolExecutor.java:615)
	at java.lang.Thread.run(Thread.java:679)
Caused by: org.apache.maven.plugin.MojoExecutionException: Some files do not have the expected
license header
	at com.google.code.mojo.license.LicenseCheckMojo.execute(LicenseCheckMojo.java:64)
	at org.apache.maven.plugin.DefaultBuildPluginManager.executeMojo(DefaultBuildPluginManager.java:101)
	at org.apache.maven.lifecycle.internal.MojoExecutor.execute(MojoExecutor.java:209)
	... 27 more
Maven failed with error.
Sending e-mails to: dev@curator.incubator.apache.org
Sending e-mails to: dev@curator.incubator.apache.org
Sending e-mails to: dev@curator.incubator.apache.org
channel stopped

Mime
View raw message