ctakes-notifications mailing list archives

Site index · List index
Message view « Date » · « Thread »
Top « Date » · « Thread »
From Apache Jenkins Server <jenk...@builds.apache.org>
Subject Build failed in Jenkins: cTAKES-trunk-Java-1.8 #36
Date Fri, 17 Nov 2017 19:37:40 GMT
See <https://builds.apache.org/job/cTAKES-trunk-Java-1.8/36/display/redirect?page=changes>

Changes:

[alexz] CTAKES-458: Upgrade apache parent pom, fix apache-rat

------------------------------------------
[...truncated 1.40 MB...]
[INFO] JavaCpdBlockIndexer is used for java
[INFO] Sensor CPD Block Indexer (done) | time=16ms
[INFO] -------------  Scan Apache cTAKES dictionary lookup fast
[INFO] Base dir: <https://builds.apache.org/job/cTAKES-trunk-Java-1.8/ws/ctakes-dictionary-lookup-fast>
[INFO] Working dir: <https://builds.apache.org/job/cTAKES-trunk-Java-1.8/ws/ctakes-dictionary-lookup-fast/target/sonar>
[INFO] Source paths: pom.xml, src/main/java
[INFO] Test paths: src/test/java
[INFO] Binary dirs: target/classes
[INFO] Source encoding: UTF-8, default locale: en_US
[INFO] Index files
[INFO] 49 files indexed
[INFO] Quality profile for java: Sonar way
[INFO] Sensor Lines Sensor
[INFO] Sensor Lines Sensor (done) | time=1ms
[INFO] Sensor JavaSquidSensor
[INFO] Configured Java source version (sonar.java.source): 8
[INFO] JavaClasspath initialization
[INFO] JavaClasspath initialization (done) | time=1ms
[INFO] JavaTestClasspath initialization
[INFO] JavaTestClasspath initialization (done) | time=0ms
[INFO] Java Main Files AST scan
[INFO] 46 source files to be analyzed
[WARNING] Class not found: jdk.nashorn.internal.ir.annotations.Immutable
[WARNING] Class not found: jdk.nashorn.internal.ir.annotations.Immutable
[INFO] Java Main Files AST scan (done) | time=4968ms
[INFO] Java Test Files AST scan
[INFO] 46/46 source files have been analyzed
[INFO] 3 source files to be analyzed
[WARNING] Class not found: jdk.nashorn.internal.ir.annotations.Immutable
[INFO] Java Test Files AST scan (done) | time=37ms
[INFO] Sensor JavaSquidSensor (done) | time=5011ms
[INFO] 3/3 source files have been analyzed
[INFO] Sensor SCM Sensor
[INFO] Sensor SCM Sensor (done) | time=2ms
[INFO] Sensor Coverage Report Import
[INFO] Sensor Coverage Report Import (done) | time=0ms
[INFO] Sensor Coverage Report Import
[INFO] Sensor Coverage Report Import (done) | time=0ms
[INFO] Sensor Unit Test Results Import
[INFO] Sensor Unit Test Results Import (done) | time=0ms
[INFO] Sensor SurefireSensor
[INFO] parsing <https://builds.apache.org/job/cTAKES-trunk-Java-1.8/ws/ctakes-dictionary-lookup-fast/target/surefire-reports>
[INFO] Sensor SurefireSensor (done) | time=1ms
[INFO] Sensor JaCoCoSensor
[INFO] JaCoCoSensor: JaCoCo report not found : <https://builds.apache.org/job/cTAKES-trunk-Java-1.8/ws/ctakes-dictionary-lookup-fast/target/jacoco.exec>
[INFO] Sensor JaCoCoSensor (done) | time=0ms
[INFO] Sensor JaCoCoItSensor
[INFO] JaCoCoItSensor: JaCoCo IT report not found: <https://builds.apache.org/job/cTAKES-trunk-Java-1.8/ws/ctakes-dictionary-lookup-fast/target/jacoco-it.exec>
[INFO] Sensor JaCoCoItSensor (done) | time=0ms
[INFO] Sensor JaCoCoOverallSensor
[INFO] Sensor JaCoCoOverallSensor (done) | time=0ms
[INFO] Sensor XmlFileSensor
[INFO] Sensor XmlFileSensor (done) | time=0ms
[INFO] Sensor Zero Coverage Sensor
[INFO] Sensor Zero Coverage Sensor (done) | time=4ms
[INFO] Sensor Code Colorizer Sensor
[INFO] Sensor Code Colorizer Sensor (done) | time=0ms
[INFO] Sensor CPD Block Indexer
[INFO] JavaCpdBlockIndexer is used for java
[INFO] Sensor CPD Block Indexer (done) | time=49ms
[INFO] -------------  Scan Apache cTAKES Resources dictionary-lookup-fast-res
[INFO] Base dir: <https://builds.apache.org/job/cTAKES-trunk-Java-1.8/ws/ctakes-dictionary-lookup-fast-res>
[INFO] Working dir: <https://builds.apache.org/job/cTAKES-trunk-Java-1.8/ws/ctakes-dictionary-lookup-fast-res/target/sonar>
[INFO] Source paths: pom.xml
[INFO] Binary dirs: target/classes
[INFO] Source encoding: UTF-8, default locale: en_US
[INFO] Index files
[INFO] 0 files indexed
[INFO] Sensor Lines Sensor
[INFO] Sensor Lines Sensor (done) | time=0ms
[INFO] Sensor SCM Sensor
[INFO] Sensor SCM Sensor (done) | time=0ms
[INFO] Sensor Coverage Report Import
[INFO] Sensor Coverage Report Import (done) | time=0ms
[INFO] Sensor Coverage Report Import
[INFO] Sensor Coverage Report Import (done) | time=0ms
[INFO] Sensor Unit Test Results Import
[INFO] Sensor Unit Test Results Import (done) | time=0ms
[INFO] Sensor XmlFileSensor
[INFO] Sensor XmlFileSensor (done) | time=0ms
[INFO] Sensor Zero Coverage Sensor
[INFO] Sensor Zero Coverage Sensor (done) | time=0ms
[INFO] Sensor Code Colorizer Sensor
[INFO] Sensor Code Colorizer Sensor (done) | time=0ms
[INFO] Sensor CPD Block Indexer
[INFO] Sensor CPD Block Indexer (done) | time=0ms
[INFO] -------------  Scan Apache cTAKES
[INFO] Base dir: <https://builds.apache.org/job/cTAKES-trunk-Java-1.8/ws/>
[INFO] Working dir: <https://builds.apache.org/job/cTAKES-trunk-Java-1.8/ws/target/sonar>
[INFO] Source encoding: UTF-8, default locale: en_US
[INFO] Sensor Lines Sensor
[INFO] Sensor Lines Sensor (done) | time=0ms
[INFO] Sensor SCM Sensor
[INFO] Sensor SCM Sensor (done) | time=0ms
[INFO] Sensor Coverage Report Import
[INFO] Sensor Coverage Report Import (done) | time=0ms
[INFO] Sensor Coverage Report Import
[INFO] Sensor Coverage Report Import (done) | time=0ms
[INFO] Sensor Unit Test Results Import
[INFO] Sensor Unit Test Results Import (done) | time=0ms
[INFO] Sensor XmlFileSensor
[INFO] Sensor XmlFileSensor (done) | time=0ms
[INFO] Sensor Zero Coverage Sensor
[INFO] Sensor Zero Coverage Sensor (done) | time=0ms
[INFO] Sensor Code Colorizer Sensor
[INFO] Sensor Code Colorizer Sensor (done) | time=0ms
[INFO] Sensor CPD Block Indexer
[INFO] Sensor CPD Block Indexer (done) | time=0ms
[INFO] Calculating CPD for 1099 files
[INFO] CPD calculation finished
[INFO] Analysis report generated in 1651ms, dir size=18 MB
[INFO] Analysis reports compressed in 3485ms, zip size=7 MB
[INFO] Analysis report uploaded in 3159ms
[INFO] ANALYSIS SUCCESSFUL, you can browse https://builds.apache.org/analysis/dashboard/index/org.apache.ctakes:ctakes
[INFO] Note that you will be able to access the updated dashboard once the server has processed
the submitted analysis report
[INFO] More about the report processing at https://builds.apache.org/analysis/api/ce/task?id=AV_LeSrTmqiS_xQKKaVj
[JENKINS] Archiving disabled
[JENKINS] Archiving disabled
[JENKINS] Archiving disabled
[JENKINS] Archiving disabled
[JENKINS] Archiving disabled
[JENKINS] Archiving disabled
[JENKINS] Archiving disabled
[JENKINS] Archiving disabled
[JENKINS] Archiving disabled
[JENKINS] Archiving disabled
[JENKINS] Archiving disabled
[JENKINS] Archiving disabled
[JENKINS] Archiving disabled
[JENKINS] Archiving disabled
[JENKINS] Archiving disabled
[JENKINS] Archiving disabled
[JENKINS] Archiving disabled
[JENKINS] Archiving disabled
[JENKINS] Archiving disabled
[JENKINS] Archiving disabled
[JENKINS] Archiving disabled
[JENKINS] Archiving disabled
[JENKINS] Archiving disabled
[JENKINS] Archiving disabled
[JENKINS] Archiving disabled
[JENKINS] Archiving disabled
[JENKINS] Archiving disabled
[JENKINS] Archiving disabled
[JENKINS] Archiving disabled
[JENKINS] Archiving disabled
[JENKINS] Archiving disabled
[JENKINS] Archiving disabled
[JENKINS] Archiving disabled
[JENKINS] Archiving disabled
[JENKINS] Archiving disabled
[JENKINS] Archiving disabled
[JENKINS] Archiving disabled
[JENKINS] Archiving disabled
[JENKINS] Archiving disabled
[JENKINS] Archiving disabled
[JENKINS] Archiving disabled
[JENKINS] Archiving disabled
[JENKINS] Archiving disabled
[JENKINS] Archiving disabled
[JENKINS] Archiving disabled
[JENKINS] Archiving disabled
[JENKINS] Archiving disabled
[JENKINS] Archiving disabled
[JENKINS] Archiving disabled
[JENKINS] Archiving disabled
[JENKINS] Archiving disabled
[JENKINS] Archiving disabled
[JENKINS] Archiving disabled
[INFO] ------------------------------------------------------------------------
[INFO] Reactor Summary:
[INFO] 
[INFO] Apache cTAKES ...................................... SUCCESS [05:28 min]
[INFO] ctakes-gui-res ..................................... SUCCESS [  4.545 s]
[INFO] Apache cTAKES Resources core ....................... SUCCESS [  2.815 s]
[INFO] Apache cTAKES common type system ................... SUCCESS [  7.547 s]
[INFO] Apache cTAKES utils ................................ SUCCESS [  4.040 s]
[INFO] Apache cTAKES core ................................. SUCCESS [ 35.919 s]
[INFO] ctakes-gui ......................................... SUCCESS [ 17.500 s]
[INFO] Apache cTAKES Resources pos-tagger ................. SUCCESS [  3.542 s]
[INFO] Apache cTAKES part-of-speech tagger ................ SUCCESS [  5.401 s]
[INFO] Apache cTAKES Resources ctakes-chunker-res ......... SUCCESS [  3.356 s]
[INFO] Apache cTAKES chunker .............................. SUCCESS [  3.879 s]
[INFO] Apache cTAKES document preprocessor ................ SUCCESS [  5.323 s]
[INFO] Apache cTAKES Resources dictionary-lookup .......... SUCCESS [ 23.779 s]
[INFO] Apache cTAKES dictionary lookup .................... SUCCESS [  4.909 s]
[INFO] Apache cTAKES context dependent tokenizer .......... SUCCESS [  5.804 s]
[INFO] Apache cTAKES Resources lvg ........................ SUCCESS [ 30.590 s]
[INFO] Apache cTAKES LVG lexical tools .................... SUCCESS [  5.061 s]
[INFO] Apache cTAKES Resources ne-contexts ................ SUCCESS [  2.595 s]
[INFO] Apache cTAKES named entity contexts ................ SUCCESS [  4.576 s]
[INFO] Apache cTAKES Resources constituency-parser ........ SUCCESS [  5.056 s]
[INFO] Apache cTAKES Constituency Parser .................. SUCCESS [  3.563 s]
[INFO] Apache cTAKES Resources coreference ................ SUCCESS [  6.717 s]
[INFO] Apache cTAKES Resources temporal ................... SUCCESS [  3.065 s]
[INFO] Apache cTAKES Resources relation-extractor ......... SUCCESS [  2.731 s]
[INFO] Apache cTAKES Resources dictionary-lookup-fast-res . SUCCESS [  4.455 s]
[INFO] Apache cTAKES dictionary lookup fast ............... SUCCESS [  3.514 s]
[INFO] Apache cTAKES Resources assertion .................. SUCCESS [  4.390 s]
[INFO] Apache cTAKES Resources dependency-parser .......... SUCCESS [ 34.330 s]
[INFO] Apache cTAKES Dependency Parser .................... SUCCESS [ 38.830 s]
[INFO] Apache cTAKES Assertion ............................ SUCCESS [  6.356 s]
[INFO] ctakes-clinical-pipeline-res ....................... SUCCESS [  2.493 s]
[INFO] Apache cTAKES ctakes-clinical-pipeline ............. SUCCESS [  6.516 s]
[INFO] Apache cTAKES Relation Extractor ................... SUCCESS [ 37.169 s]
[INFO] Apache cTAKES Temporal Information Extraction ...... FAILURE [15:09 min]
[INFO] Apache cTAKES CoReference Resolver ................. SKIPPED
[INFO] Apache cTAKES Resources drug-ner ................... SUCCESS [  3.060 s]
[INFO] Apache cTAKES Drug NER ............................. SUCCESS [ 10.546 s]
[INFO] Apache cTAKES Resources side-effect ................ SUCCESS [  2.727 s]
[INFO] Apache cTAKES Side Effects ......................... SUCCESS [  6.313 s]
[INFO] Apache cTAKES Resources smoking-status ............. SUCCESS [  3.006 s]
[INFO] Apache cTAKES Smoking Status ....................... SUCCESS [ 39.656 s]
[INFO] Apache cTAKES Resources assertion-zoner ............ SUCCESS [ 46.725 s]
[INFO] Apache cTAKES Assertion's zoner .................... SUCCESS [01:22 min]
[INFO] ctakes-examples-res ................................ SUCCESS [ 36.332 s]
[INFO] ctakes-examples .................................... SKIPPED
[INFO] Apache cTAKES Resources ctakes-ytex-res ............ SUCCESS [01:09 min]
[INFO] Apache cTAKES YTEX ................................. SUCCESS [03:39 min]
[INFO] Apache cTAKES YTEX UIMA ............................ FAILURE [03:27 min]
[INFO] Apache cTAKES YTEX Web ............................. SUCCESS [04:36 min]
[INFO] Apache cTAKES Distribution ......................... SKIPPED
[INFO] Apache cTAKES Regression-test ...................... SKIPPED
[INFO] Apache cTAKES template filler ...................... SUCCESS [01:35 min]
[INFO] ------------------------------------------------------------------------
[INFO] BUILD FAILURE
[INFO] ------------------------------------------------------------------------
[INFO] Total time: 54:30 min
[INFO] Finished at: 2017-11-17T19:37:03Z
[INFO] Final Memory: 156M/3368M
[INFO] ------------------------------------------------------------------------
[ERROR] Failed to execute goal org.apache.maven.plugins:maven-surefire-plugin:2.12.1:test
(default-test) on project ctakes-temporal: Failure or timeout -> [Help 1]
[ERROR] Failed to execute goal org.apache.maven.plugins:maven-surefire-plugin:2.12.1:test
(surefire-it) on project ctakes-ytex-uima: There are test failures.
[ERROR] 
[ERROR] Please refer to <https://builds.apache.org/job/cTAKES-trunk-Java-1.8/ws/ctakes-ytex-uima/target/surefire-reports>
for the individual test results.
[ERROR] -> [Help 2]
[ERROR] 
[ERROR] To see the full stack trace of the errors, re-run Maven with the -e switch.
[ERROR] Re-run Maven using the -X switch to enable full debug logging.
[ERROR] 
[ERROR] For more information about the errors and possible solutions, please read the following
articles:
[ERROR] [Help 1] http://cwiki.apache.org/confluence/display/MAVEN/MojoExecutionException
[ERROR] [Help 2] http://cwiki.apache.org/confluence/display/MAVEN/MojoFailureException
[ERROR] 
[ERROR] After correcting the problems, you can resume the build with the command
[ERROR]   mvn <goals> -rf :ctakes-temporal
Sending e-mails to: notifications@ctakes.apache.org
Sending e-mails to: notifications@ctakes.apache.org
channel stopped

Mime
View raw message