ctakes-notifications mailing list archives

Site index · List index
Message view « Date » · « Thread »
Top « Date » · « Thread »
From Apache Jenkins Server <jenk...@builds.apache.org>
Subject Build failed in Jenkins: cTAKES-trunk-Java-1.8 » Apache cTAKES dictionary lookup fast #30
Date Thu, 16 Nov 2017 22:39:35 GMT
See <https://builds.apache.org/job/cTAKES-trunk-Java-1.8/org.apache.ctakes$ctakes-dictionary-lookup-fast/30/display/redirect?page=changes>

Changes:

[alexz] CTAKES-479: skip testCPE when UMLS credentials not exported as env vars

------------------------------------------
[INFO] 
[INFO] ------------------------------------------------------------------------
[INFO] Building Apache cTAKES dictionary lookup fast 4.0.1-SNAPSHOT
[INFO] ------------------------------------------------------------------------
[INFO] 
[INFO] --- maven-clean-plugin:2.4.1:clean (default-clean) @ ctakes-dictionary-lookup-fast
---
[INFO] 
[INFO] --- maven-remote-resources-plugin:1.4:process (default) @ ctakes-dictionary-lookup-fast
---
[INFO] 
[INFO] --- maven-resources-plugin:2.5:resources (default-resources) @ ctakes-dictionary-lookup-fast
---
[debug] execute contextualize
[INFO] Using 'UTF-8' encoding to copy filtered resources.
[INFO] skip non existing resourceDirectory <https://builds.apache.org/job/cTAKES-trunk-Java-1.8/org.apache.ctakes$ctakes-dictionary-lookup-fast/ws/src/main/resources>
[INFO] Copying 3 resources
[INFO] 
[INFO] --- maven-compiler-plugin:2.4:compile (default-compile) @ ctakes-dictionary-lookup-fast
---
[INFO] Compiling 46 source files to <https://builds.apache.org/job/cTAKES-trunk-Java-1.8/org.apache.ctakes$ctakes-dictionary-lookup-fast/ws/target/classes>
[INFO] -------------------------------------------------------------
[ERROR] COMPILATION ERROR : 
[INFO] -------------------------------------------------------------
[ERROR] <https://builds.apache.org/job/cTAKES-trunk-Java-1.8/org.apache.ctakes$ctakes-dictionary-lookup-fast/ws/src/main/java/org/apache/ctakes/dictionary/lookup2/util/UmlsUserApprover.java>:[21,32]
error: cannot find symbol
[ERROR]   symbol:   class UmlsEnvironmentConfiguration
  location: package org.apache.ctakes.core.ae
<https://builds.apache.org/job/cTAKES-trunk-Java-1.8/org.apache.ctakes$ctakes-dictionary-lookup-fast/ws/src/main/java/org/apache/ctakes/dictionary/lookup2/util/UmlsUserApprover.java>:[187,77]
error: cannot find symbol
[ERROR]   symbol:   class UmlsEnvironmentConfiguration
  location: class UmlsUserApprover
<https://builds.apache.org/job/cTAKES-trunk-Java-1.8/org.apache.ctakes$ctakes-dictionary-lookup-fast/ws/src/main/java/org/apache/ctakes/dictionary/lookup2/ae/AbstractJCasTermAnnotator.java>:[106,54]
[unchecked] unchecked cast
[ERROR]   required: Class<? extends Annotation>
  found:    Class<CAP#1>
  where CAP#1 is a fresh type-variable:
    CAP#1 extends Object from capture of ?
<https://builds.apache.org/job/cTAKES-trunk-Java-1.8/org.apache.ctakes$ctakes-dictionary-lookup-fast/ws/src/main/java/org/apache/ctakes/dictionary/lookup2/util/UmlsUserApprover.java>:[78,79]
error: package UmlsEnvironmentConfiguration does not exist
[ERROR] <https://builds.apache.org/job/cTAKES-trunk-Java-1.8/org.apache.ctakes$ctakes-dictionary-lookup-fast/ws/src/main/java/org/apache/ctakes/dictionary/lookup2/util/UmlsUserApprover.java>:[82,78]
error: package UmlsEnvironmentConfiguration does not exist
[ERROR] <https://builds.apache.org/job/cTAKES-trunk-Java-1.8/org.apache.ctakes$ctakes-dictionary-lookup-fast/ws/src/main/java/org/apache/ctakes/dictionary/lookup2/util/UmlsUserApprover.java>:[86,76]
error: package UmlsEnvironmentConfiguration does not exist
[ERROR] <https://builds.apache.org/job/cTAKES-trunk-Java-1.8/org.apache.ctakes$ctakes-dictionary-lookup-fast/ws/src/main/java/org/apache/ctakes/dictionary/lookup2/util/UmlsUserApprover.java>:[93,76]
error: package UmlsEnvironmentConfiguration does not exist
[ERROR] <https://builds.apache.org/job/cTAKES-trunk-Java-1.8/org.apache.ctakes$ctakes-dictionary-lookup-fast/ws/src/main/java/org/apache/ctakes/dictionary/lookup2/util/UmlsUserApprover.java>:[193,59]
error: cannot find symbol
[ERROR]   symbol:   variable UmlsEnvironmentConfiguration
  location: class UmlsUserApprover
<https://builds.apache.org/job/cTAKES-trunk-Java-1.8/org.apache.ctakes$ctakes-dictionary-lookup-fast/ws/src/main/java/org/apache/ctakes/dictionary/lookup2/util/UmlsUserApprover.java>:[197,59]
error: cannot find symbol
[ERROR]   symbol:   variable UmlsEnvironmentConfiguration
  location: class UmlsUserApprover
<https://builds.apache.org/job/cTAKES-trunk-Java-1.8/org.apache.ctakes$ctakes-dictionary-lookup-fast/ws/src/main/java/org/apache/ctakes/dictionary/lookup2/ae/OverlapJCasTermAnnotator.java>:[223,12]
[deprecation] DICTIONARY_DESCRIPTOR_KEY in JCasTermAnnotator has been deprecated
[ERROR] <https://builds.apache.org/job/cTAKES-trunk-Java-1.8/org.apache.ctakes$ctakes-dictionary-lookup-fast/ws/src/main/java/org/apache/ctakes/dictionary/lookup2/ae/OverlapJCasTermAnnotator.java>:[231,12]
[deprecation] DICTIONARY_DESCRIPTOR_KEY in JCasTermAnnotator has been deprecated
[INFO] 11 errors 
[INFO] -------------------------------------------------------------
[JENKINS] Archiving disabled

Mime
View raw message