ctakes-notifications mailing list archives

Site index · List index
Message view « Date » · « Thread »
Top « Date » · « Thread »
From Apache Jenkins Server <jenk...@builds.apache.org>
Subject Build failed in Jenkins: cTAKES-trunk-Java-1.8 #26
Date Wed, 15 Nov 2017 02:06:04 GMT
See <https://builds.apache.org/job/cTAKES-trunk-Java-1.8/26/display/redirect?page=changes>

Changes:

[alexz] CTAKES-334: fix GramMatrixExporterImp::setBagOfWordsExporter signature

[seanfinan] CTAKES-441 : Add LabValueFinder annotator.  Many thanks to the original author
Kean Kaufmann.

[seanfinan] TextSpan refactor (package move).  Prep for LabValueFinder

[alexz] "svn ignore IntelliJ IDEA project files - *.iml, .idea"

------------------------------------------
[...truncated 1.58 MB...]
[INFO] Test paths: src/test/java
[INFO] Binary dirs: target/classes
[INFO] Source encoding: UTF-8, default locale: en_US
[INFO] Index files
[INFO] 49 files indexed
[INFO] Quality profile for java: Sonar way
[INFO] Sensor Lines Sensor
[INFO] Sensor Lines Sensor (done) | time=1ms
[INFO] Sensor JavaSquidSensor
[INFO] Configured Java source version (sonar.java.source): 8
[INFO] JavaClasspath initialization
[INFO] JavaClasspath initialization (done) | time=1ms
[INFO] JavaTestClasspath initialization
[INFO] JavaTestClasspath initialization (done) | time=0ms
[INFO] Java Main Files AST scan
[INFO] 46 source files to be analyzed
[WARNING] Class not found: jdk.nashorn.internal.ir.annotations.Immutable
[WARNING] Class not found: jdk.nashorn.internal.ir.annotations.Immutable
[INFO] Java Main Files AST scan (done) | time=5946ms
[INFO] Java Test Files AST scan
[INFO] 3 source files to be analyzed
[INFO] 46/46 source files have been analyzed
[WARNING] Class not found: jdk.nashorn.internal.ir.annotations.Immutable
[INFO] Java Test Files AST scan (done) | time=41ms
[INFO] Sensor JavaSquidSensor (done) | time=5996ms
[INFO] Sensor SCM Sensor
[INFO] 3/3 source files have been analyzed
[INFO] SCM provider for this project is: svn
[INFO] 1 files to be analyzed
[INFO] 1/1 files analyzed
[INFO] Sensor SCM Sensor (done) | time=330ms
[INFO] Sensor Coverage Report Import
[INFO] Sensor Coverage Report Import (done) | time=0ms
[INFO] Sensor Coverage Report Import
[INFO] Sensor Coverage Report Import (done) | time=0ms
[INFO] Sensor Unit Test Results Import
[INFO] Sensor Unit Test Results Import (done) | time=0ms
[INFO] Sensor SurefireSensor
[INFO] parsing <https://builds.apache.org/job/cTAKES-trunk-Java-1.8/ws/ctakes-dictionary-lookup-fast/target/surefire-reports>
[INFO] Sensor SurefireSensor (done) | time=0ms
[INFO] Sensor JaCoCoSensor
[INFO] JaCoCoSensor: JaCoCo report not found : <https://builds.apache.org/job/cTAKES-trunk-Java-1.8/ws/ctakes-dictionary-lookup-fast/target/jacoco.exec>
[INFO] Sensor JaCoCoSensor (done) | time=0ms
[INFO] Sensor JaCoCoItSensor
[INFO] JaCoCoItSensor: JaCoCo IT report not found: <https://builds.apache.org/job/cTAKES-trunk-Java-1.8/ws/ctakes-dictionary-lookup-fast/target/jacoco-it.exec>
[INFO] Sensor JaCoCoItSensor (done) | time=0ms
[INFO] Sensor JaCoCoOverallSensor
[INFO] Sensor JaCoCoOverallSensor (done) | time=1ms
[INFO] Sensor XmlFileSensor
[INFO] Sensor XmlFileSensor (done) | time=0ms
[INFO] Sensor Zero Coverage Sensor
[INFO] Sensor Zero Coverage Sensor (done) | time=8ms
[INFO] Sensor Code Colorizer Sensor
[INFO] Sensor Code Colorizer Sensor (done) | time=1ms
[INFO] Sensor CPD Block Indexer
[INFO] JavaCpdBlockIndexer is used for java
[INFO] Sensor CPD Block Indexer (done) | time=56ms
[INFO] -------------  Scan Apache cTAKES Resources dictionary-lookup-fast-res
[INFO] Base dir: <https://builds.apache.org/job/cTAKES-trunk-Java-1.8/ws/ctakes-dictionary-lookup-fast-res>
[INFO] Working dir: <https://builds.apache.org/job/cTAKES-trunk-Java-1.8/ws/ctakes-dictionary-lookup-fast-res/target/sonar>
[INFO] Source paths: pom.xml
[INFO] Binary dirs: target/classes
[INFO] Source encoding: UTF-8, default locale: en_US
[INFO] Index files
[INFO] 0 files indexed
[INFO] Sensor Lines Sensor
[INFO] Sensor Lines Sensor (done) | time=0ms
[INFO] Sensor SCM Sensor
[INFO] Sensor SCM Sensor (done) | time=0ms
[INFO] Sensor Coverage Report Import
[INFO] Sensor Coverage Report Import (done) | time=0ms
[INFO] Sensor Coverage Report Import
[INFO] Sensor Coverage Report Import (done) | time=0ms
[INFO] Sensor Unit Test Results Import
[INFO] Sensor Unit Test Results Import (done) | time=0ms
[INFO] Sensor XmlFileSensor
[INFO] Sensor XmlFileSensor (done) | time=0ms
[INFO] Sensor Zero Coverage Sensor
[INFO] Sensor Zero Coverage Sensor (done) | time=0ms
[INFO] Sensor Code Colorizer Sensor
[INFO] Sensor Code Colorizer Sensor (done) | time=0ms
[INFO] Sensor CPD Block Indexer
[INFO] Sensor CPD Block Indexer (done) | time=0ms
[INFO] -------------  Scan Apache cTAKES
[INFO] Base dir: <https://builds.apache.org/job/cTAKES-trunk-Java-1.8/ws/>
[INFO] Working dir: <https://builds.apache.org/job/cTAKES-trunk-Java-1.8/ws/target/sonar>
[INFO] Source encoding: UTF-8, default locale: en_US
[INFO] Sensor Lines Sensor
[INFO] Sensor Lines Sensor (done) | time=0ms
[INFO] Sensor SCM Sensor
[INFO] Sensor SCM Sensor (done) | time=0ms
[INFO] Sensor Coverage Report Import
[INFO] Sensor Coverage Report Import (done) | time=0ms
[INFO] Sensor Coverage Report Import
[INFO] Sensor Coverage Report Import (done) | time=0ms
[INFO] Sensor Unit Test Results Import
[INFO] Sensor Unit Test Results Import (done) | time=0ms
[INFO] Sensor XmlFileSensor
[INFO] Sensor XmlFileSensor (done) | time=0ms
[INFO] Sensor Zero Coverage Sensor
[INFO] Sensor Zero Coverage Sensor (done) | time=0ms
[INFO] Sensor Code Colorizer Sensor
[INFO] Sensor Code Colorizer Sensor (done) | time=0ms
[INFO] Sensor CPD Block Indexer
[INFO] Sensor CPD Block Indexer (done) | time=0ms
[INFO] Calculating CPD for 1098 files
[INFO] CPD calculation finished
[INFO] Analysis report generated in 2089ms, dir size=18 MB
[INFO] Analysis reports compressed in 4110ms, zip size=7 MB
[INFO] Analysis report uploaded in 2519ms
[INFO] ANALYSIS SUCCESSFUL, you can browse https://builds.apache.org/analysis/dashboard/index/org.apache.ctakes:ctakes
[INFO] Note that you will be able to access the updated dashboard once the server has processed
the submitted analysis report
[INFO] More about the report processing at https://builds.apache.org/analysis/api/ce/task?id=AV-9bAyomqiS_xQKKaUj
[JENKINS] Archiving disabled
[JENKINS] Archiving disabled
[JENKINS] Archiving disabled
[JENKINS] Archiving disabled
[JENKINS] Archiving disabled
[JENKINS] Archiving disabled
[JENKINS] Archiving disabled
[JENKINS] Archiving disabled
[JENKINS] Archiving disabled
[JENKINS] Archiving disabled
[JENKINS] Archiving disabled
[JENKINS] Archiving disabled
[JENKINS] Archiving disabled
[JENKINS] Archiving disabled
[JENKINS] Archiving disabled
[JENKINS] Archiving disabled
[JENKINS] Archiving disabled
[JENKINS] Archiving disabled
[JENKINS] Archiving disabled
[JENKINS] Archiving disabled
[JENKINS] Archiving disabled
[JENKINS] Archiving disabled
[JENKINS] Archiving disabled
[JENKINS] Archiving disabled
[JENKINS] Archiving disabled
[JENKINS] Archiving disabled
[JENKINS] Archiving disabled
[JENKINS] Archiving disabled
[JENKINS] Archiving disabled
[JENKINS] Archiving disabled
[JENKINS] Archiving disabled
[JENKINS] Archiving disabled
[JENKINS] Archiving disabled
[JENKINS] Archiving disabled
[JENKINS] Archiving disabled
[JENKINS] Archiving disabled
[JENKINS] Archiving disabled
[JENKINS] Archiving disabled
[JENKINS] Archiving disabled
[JENKINS] Archiving disabled
[JENKINS] Archiving disabled
[JENKINS] Archiving disabled
[JENKINS] Archiving disabled
[JENKINS] Archiving disabled
[JENKINS] Archiving disabled
[JENKINS] Archiving disabled
[JENKINS] Archiving disabled
[JENKINS] Archiving disabled
[JENKINS] Archiving disabled
[JENKINS] Archiving disabled
[JENKINS] Archiving disabled
[JENKINS] Archiving disabled
[JENKINS] Archiving disabled
[INFO] ------------------------------------------------------------------------
[INFO] Reactor Summary:
[INFO] 
[INFO] Apache cTAKES ...................................... SUCCESS [06:01 min]
[INFO] ctakes-gui-res ..................................... SUCCESS [  4.807 s]
[INFO] Apache cTAKES Resources core ....................... SUCCESS [  2.800 s]
[INFO] Apache cTAKES common type system ................... SUCCESS [  8.698 s]
[INFO] Apache cTAKES utils ................................ SUCCESS [  4.358 s]
[INFO] Apache cTAKES core ................................. SUCCESS [ 31.254 s]
[INFO] ctakes-gui ......................................... SUCCESS [  4.749 s]
[INFO] Apache cTAKES Resources pos-tagger ................. SUCCESS [  3.561 s]
[INFO] Apache cTAKES part-of-speech tagger ................ SUCCESS [  6.304 s]
[INFO] Apache cTAKES Resources ctakes-chunker-res ......... SUCCESS [  3.529 s]
[INFO] Apache cTAKES chunker .............................. SUCCESS [  3.998 s]
[INFO] Apache cTAKES document preprocessor ................ SUCCESS [  4.018 s]
[INFO] Apache cTAKES Resources dictionary-lookup .......... SUCCESS [ 25.339 s]
[INFO] Apache cTAKES dictionary lookup .................... SUCCESS [  5.151 s]
[INFO] Apache cTAKES context dependent tokenizer .......... SUCCESS [  5.465 s]
[INFO] Apache cTAKES Resources lvg ........................ SUCCESS [ 53.239 s]
[INFO] Apache cTAKES LVG lexical tools .................... SUCCESS [  8.980 s]
[INFO] Apache cTAKES Resources ne-contexts ................ SUCCESS [  2.368 s]
[INFO] Apache cTAKES named entity contexts ................ SUCCESS [  4.976 s]
[INFO] Apache cTAKES Resources constituency-parser ........ SUCCESS [  5.051 s]
[INFO] Apache cTAKES Constituency Parser .................. SUCCESS [  3.295 s]
[INFO] Apache cTAKES Resources coreference ................ SUCCESS [  8.606 s]
[INFO] Apache cTAKES Resources temporal ................... SUCCESS [  3.087 s]
[INFO] Apache cTAKES Resources relation-extractor ......... SUCCESS [  2.653 s]
[INFO] Apache cTAKES Resources dictionary-lookup-fast-res . SUCCESS [  4.262 s]
[INFO] Apache cTAKES dictionary lookup fast ............... SUCCESS [  3.646 s]
[INFO] Apache cTAKES Resources assertion .................. SUCCESS [  4.458 s]
[INFO] Apache cTAKES Resources dependency-parser .......... SUCCESS [ 20.742 s]
[INFO] Apache cTAKES Dependency Parser .................... SUCCESS [ 50.825 s]
[INFO] Apache cTAKES Assertion ............................ SUCCESS [  7.342 s]
[INFO] ctakes-clinical-pipeline-res ....................... SUCCESS [  2.427 s]
[INFO] Apache cTAKES ctakes-clinical-pipeline ............. SUCCESS [  7.521 s]
[INFO] Apache cTAKES Relation Extractor ................... SUCCESS [ 11.718 s]
[INFO] Apache cTAKES Temporal Information Extraction ...... SUCCESS [02:48 min]
[INFO] Apache cTAKES CoReference Resolver ................. SUCCESS [ 10.944 s]
[INFO] Apache cTAKES Resources drug-ner ................... SUCCESS [  2.619 s]
[INFO] Apache cTAKES Drug NER ............................. SUCCESS [  8.485 s]
[INFO] Apache cTAKES Resources side-effect ................ SUCCESS [  2.695 s]
[INFO] Apache cTAKES Side Effects ......................... SUCCESS [  7.103 s]
[INFO] Apache cTAKES Resources smoking-status ............. SUCCESS [  2.564 s]
[INFO] Apache cTAKES Smoking Status ....................... SUCCESS [  7.085 s]
[INFO] Apache cTAKES Resources assertion-zoner ............ SUCCESS [  2.545 s]
[INFO] Apache cTAKES Assertion's zoner .................... SUCCESS [  3.202 s]
[INFO] ctakes-examples-res ................................ SUCCESS [  2.517 s]
[INFO] ctakes-examples .................................... SUCCESS [  9.817 s]
[INFO] Apache cTAKES Resources ctakes-ytex-res ............ SUCCESS [  2.485 s]
[INFO] Apache cTAKES YTEX ................................. SUCCESS [01:24 min]
[INFO] Apache cTAKES YTEX UIMA ............................ FAILURE [01:52 min]
[INFO] Apache cTAKES YTEX Web ............................. SUCCESS [01:14 min]
[INFO] Apache cTAKES Distribution ......................... SKIPPED
[INFO] Apache cTAKES Regression-test ...................... FAILURE [ 14.918 s]
[INFO] Apache cTAKES template filler ...................... SUCCESS [ 13.651 s]
[INFO] ------------------------------------------------------------------------
[INFO] BUILD FAILURE
[INFO] ------------------------------------------------------------------------
[INFO] Total time: 22:18 min
[INFO] Finished at: 2017-11-15T02:05:39Z
[INFO] Final Memory: 165M/1722M
[INFO] ------------------------------------------------------------------------
[ERROR] Failed to execute goal org.apache.maven.plugins:maven-surefire-plugin:2.12.1:test
(surefire-it) on project ctakes-ytex-uima: There are test failures.
[ERROR] 
[ERROR] Please refer to <https://builds.apache.org/job/cTAKES-trunk-Java-1.8/ws/ctakes-ytex-uima/target/surefire-reports>
for the individual test results.
[ERROR] -> [Help 1]
[ERROR] Failed to execute goal org.apache.maven.plugins:maven-surefire-plugin:2.12.1:test
(default-test) on project ctakes-regression-test: There are test failures.
[ERROR] 
[ERROR] Please refer to <https://builds.apache.org/job/cTAKES-trunk-Java-1.8/ws/ctakes-regression-test/target/surefire-reports>
for the individual test results.
[ERROR] -> [Help 1]
[ERROR] 
[ERROR] To see the full stack trace of the errors, re-run Maven with the -e switch.
[ERROR] Re-run Maven using the -X switch to enable full debug logging.
[ERROR] 
[ERROR] For more information about the errors and possible solutions, please read the following
articles:
[ERROR] [Help 1] http://cwiki.apache.org/confluence/display/MAVEN/MojoFailureException
[ERROR] 
[ERROR] After correcting the problems, you can resume the build with the command
[ERROR]   mvn <goals> -rf :ctakes-ytex-uima
Sending e-mails to: notifications@ctakes.apache.org sean.finan@tch.harvard.edu
Sending e-mails to: notifications@ctakes.apache.org alexz@apache.org
Sending e-mails to: notifications@ctakes.apache.org
channel stopped

Mime
View raw message