ctakes-notifications mailing list archives

Site index · List index
Message view « Date » · « Thread »
Top « Date » · « Thread »
From Apache Jenkins Server <jenk...@builds.apache.org>
Subject Build failed in Jenkins: cTAKES-trunk-Java-1.8 #18
Date Mon, 30 Oct 2017 02:44:37 GMT
See <https://builds.apache.org/job/cTAKES-trunk-Java-1.8/18/display/redirect?page=changes>

Changes:

[alexz] CTAKES-463: update deprecated FileLocator.locateFile with FileLocator.getFile

------------------------------------------
[...truncated 1.17 MB...]
[INFO] -------------  Scan Apache cTAKES dictionary lookup fast
[INFO] Base dir: <https://builds.apache.org/job/cTAKES-trunk-Java-1.8/ws/ctakes-dictionary-lookup-fast>
[INFO] Working dir: <https://builds.apache.org/job/cTAKES-trunk-Java-1.8/ws/ctakes-dictionary-lookup-fast/target/sonar>
[INFO] Source paths: pom.xml, src/main/java
[INFO] Test paths: src/test/java
[INFO] Binary dirs: target/classes
[INFO] Source encoding: UTF-8, default locale: en_US
[INFO] Index files
[INFO] 49 files indexed
[INFO] Quality profile for java: Sonar way
[INFO] Sensor Lines Sensor
[INFO] Sensor Lines Sensor (done) | time=1ms
[INFO] Sensor JavaSquidSensor
[INFO] Configured Java source version (sonar.java.source): 8
[INFO] JavaClasspath initialization
[INFO] JavaClasspath initialization (done) | time=0ms
[INFO] JavaTestClasspath initialization
[INFO] JavaTestClasspath initialization (done) | time=0ms
[INFO] Java Main Files AST scan
[INFO] 46 source files to be analyzed
[WARNING] Class not found: jdk.nashorn.internal.ir.annotations.Immutable
[WARNING] Class not found: jdk.nashorn.internal.ir.annotations.Immutable
[INFO] Java Main Files AST scan (done) | time=4933ms
[INFO] Java Test Files AST scan
[INFO] 46/46 source files have been analyzed
[INFO] 3 source files to be analyzed
[WARNING] Class not found: jdk.nashorn.internal.ir.annotations.Immutable
[INFO] Java Test Files AST scan (done) | time=28ms
[INFO] Sensor JavaSquidSensor (done) | time=4970ms
[INFO] Sensor SCM Sensor
[INFO] 3/3 source files have been analyzed
[INFO] Sensor SCM Sensor (done) | time=3ms
[INFO] Sensor Coverage Report Import
[INFO] Sensor Coverage Report Import (done) | time=0ms
[INFO] Sensor Coverage Report Import
[INFO] Sensor Coverage Report Import (done) | time=0ms
[INFO] Sensor Unit Test Results Import
[INFO] Sensor Unit Test Results Import (done) | time=0ms
[INFO] Sensor SurefireSensor
[INFO] parsing <https://builds.apache.org/job/cTAKES-trunk-Java-1.8/ws/ctakes-dictionary-lookup-fast/target/surefire-reports>
[INFO] Sensor SurefireSensor (done) | time=0ms
[INFO] Sensor JaCoCoSensor
[INFO] JaCoCoSensor: JaCoCo report not found : <https://builds.apache.org/job/cTAKES-trunk-Java-1.8/ws/ctakes-dictionary-lookup-fast/target/jacoco.exec>
[INFO] Sensor JaCoCoSensor (done) | time=0ms
[INFO] Sensor JaCoCoItSensor
[INFO] JaCoCoItSensor: JaCoCo IT report not found: <https://builds.apache.org/job/cTAKES-trunk-Java-1.8/ws/ctakes-dictionary-lookup-fast/target/jacoco-it.exec>
[INFO] Sensor JaCoCoItSensor (done) | time=0ms
[INFO] Sensor JaCoCoOverallSensor
[INFO] Sensor JaCoCoOverallSensor (done) | time=1ms
[INFO] Sensor XmlFileSensor
[INFO] Sensor XmlFileSensor (done) | time=0ms
[INFO] Sensor Zero Coverage Sensor
[INFO] Sensor Zero Coverage Sensor (done) | time=4ms
[INFO] Sensor Code Colorizer Sensor
[INFO] Sensor Code Colorizer Sensor (done) | time=1ms
[INFO] Sensor CPD Block Indexer
[INFO] JavaCpdBlockIndexer is used for java
[INFO] Sensor CPD Block Indexer (done) | time=51ms
[INFO] -------------  Scan Apache cTAKES Resources dictionary-lookup-fast-res
[INFO] Base dir: <https://builds.apache.org/job/cTAKES-trunk-Java-1.8/ws/ctakes-dictionary-lookup-fast-res>
[INFO] Working dir: <https://builds.apache.org/job/cTAKES-trunk-Java-1.8/ws/ctakes-dictionary-lookup-fast-res/target/sonar>
[INFO] Source paths: pom.xml
[INFO] Binary dirs: target/classes
[INFO] Source encoding: UTF-8, default locale: en_US
[INFO] Index files
[INFO] 0 files indexed
[INFO] Sensor Lines Sensor
[INFO] Sensor Lines Sensor (done) | time=0ms
[INFO] Sensor SCM Sensor
[INFO] Sensor SCM Sensor (done) | time=0ms
[INFO] Sensor Coverage Report Import
[INFO] Sensor Coverage Report Import (done) | time=0ms
[INFO] Sensor Coverage Report Import
[INFO] Sensor Coverage Report Import (done) | time=0ms
[INFO] Sensor Unit Test Results Import
[INFO] Sensor Unit Test Results Import (done) | time=0ms
[INFO] Sensor XmlFileSensor
[INFO] Sensor XmlFileSensor (done) | time=0ms
[INFO] Sensor Zero Coverage Sensor
[INFO] Sensor Zero Coverage Sensor (done) | time=0ms
[INFO] Sensor Code Colorizer Sensor
[INFO] Sensor Code Colorizer Sensor (done) | time=0ms
[INFO] Sensor CPD Block Indexer
[INFO] Sensor CPD Block Indexer (done) | time=0ms
[INFO] -------------  Scan Apache cTAKES
[INFO] Base dir: <https://builds.apache.org/job/cTAKES-trunk-Java-1.8/ws/>
[INFO] Working dir: <https://builds.apache.org/job/cTAKES-trunk-Java-1.8/ws/target/sonar>
[INFO] Source encoding: UTF-8, default locale: en_US
[INFO] Sensor Lines Sensor
[INFO] Sensor Lines Sensor (done) | time=0ms
[INFO] Sensor SCM Sensor
[INFO] Sensor SCM Sensor (done) | time=0ms
[INFO] Sensor Coverage Report Import
[INFO] Sensor Coverage Report Import (done) | time=0ms
[INFO] Sensor Coverage Report Import
[INFO] Sensor Coverage Report Import (done) | time=0ms
[INFO] Sensor Unit Test Results Import
[INFO] Sensor Unit Test Results Import (done) | time=0ms
[INFO] Sensor XmlFileSensor
[INFO] Sensor XmlFileSensor (done) | time=0ms
[INFO] Sensor Zero Coverage Sensor
[INFO] Sensor Zero Coverage Sensor (done) | time=0ms
[INFO] Sensor Code Colorizer Sensor
[INFO] Sensor Code Colorizer Sensor (done) | time=0ms
[INFO] Sensor CPD Block Indexer
[INFO] Sensor CPD Block Indexer (done) | time=0ms
[INFO] Calculating CPD for 1095 files
[INFO] CPD calculation finished
[INFO] Analysis report generated in 1693ms, dir size=18 MB
[INFO] Analysis reports compressed in 3227ms, zip size=7 MB
[INFO] Analysis report uploaded in 2135ms
[INFO] ANALYSIS SUCCESSFUL, you can browse https://builds.apache.org/analysis/dashboard/index/org.apache.ctakes:ctakes
[INFO] Note that you will be able to access the updated dashboard once the server has processed
the submitted analysis report
[INFO] More about the report processing at https://builds.apache.org/analysis/api/ce/task?id=AV9rKaLyiuI1oxQxO_v0
[JENKINS] Archiving disabled
[JENKINS] Archiving disabled
[JENKINS] Archiving disabled
[JENKINS] Archiving disabled
[JENKINS] Archiving disabled
[JENKINS] Archiving disabled
[JENKINS] Archiving disabled
[JENKINS] Archiving disabled
[JENKINS] Archiving disabled
[JENKINS] Archiving disabled
[JENKINS] Archiving disabled
[JENKINS] Archiving disabled
[JENKINS] Archiving disabled
[JENKINS] Archiving disabled
[JENKINS] Archiving disabled
[JENKINS] Archiving disabled
[JENKINS] Archiving disabled
[JENKINS] Archiving disabled
[JENKINS] Archiving disabled
[JENKINS] Archiving disabled
[JENKINS] Archiving disabled
[JENKINS] Archiving disabled
[JENKINS] Archiving disabled
[JENKINS] Archiving disabled
[JENKINS] Archiving disabled
[JENKINS] Archiving disabled
[JENKINS] Archiving disabled
[JENKINS] Archiving disabled
[JENKINS] Archiving disabled
[JENKINS] Archiving disabled
[JENKINS] Archiving disabled
[JENKINS] Archiving disabled
[JENKINS] Archiving disabled
[JENKINS] Archiving disabled
[JENKINS] Archiving disabled
[JENKINS] Archiving disabled
[JENKINS] Archiving disabled
[JENKINS] Archiving disabled
[JENKINS] Archiving disabled
[JENKINS] Archiving disabled
[JENKINS] Archiving disabled
[JENKINS] Archiving disabled
[JENKINS] Archiving disabled
[JENKINS] Archiving disabled
[JENKINS] Archiving disabled
[JENKINS] Archiving disabled
[JENKINS] Archiving disabled
[JENKINS] Archiving disabled
[JENKINS] Archiving disabled
[JENKINS] Archiving disabled
[JENKINS] Archiving disabled
[JENKINS] Archiving disabled
[JENKINS] Archiving disabled
[INFO] ------------------------------------------------------------------------
[INFO] Reactor Summary:
[INFO] 
[INFO] Apache cTAKES ...................................... SUCCESS [04:59 min]
[INFO] ctakes-gui-res ..................................... SUCCESS [  4.662 s]
[INFO] Apache cTAKES Resources core ....................... SUCCESS [  2.621 s]
[INFO] Apache cTAKES common type system ................... SUCCESS [  8.686 s]
[INFO] Apache cTAKES utils ................................ SUCCESS [  4.074 s]
[INFO] Apache cTAKES core ................................. SUCCESS [ 23.962 s]
[INFO] ctakes-gui ......................................... SUCCESS [  4.827 s]
[INFO] Apache cTAKES Resources pos-tagger ................. SUCCESS [  3.175 s]
[INFO] Apache cTAKES part-of-speech tagger ................ SUCCESS [  5.341 s]
[INFO] Apache cTAKES Resources ctakes-chunker-res ......... SUCCESS [  3.194 s]
[INFO] Apache cTAKES chunker .............................. SUCCESS [  3.843 s]
[INFO] Apache cTAKES document preprocessor ................ SUCCESS [  3.749 s]
[INFO] Apache cTAKES Resources dictionary-lookup .......... SUCCESS [ 10.983 s]
[INFO] Apache cTAKES dictionary lookup .................... SUCCESS [  4.607 s]
[INFO] Apache cTAKES context dependent tokenizer .......... SUCCESS [  4.816 s]
[INFO] Apache cTAKES Resources lvg ........................ SUCCESS [ 32.048 s]
[INFO] Apache cTAKES LVG lexical tools .................... SUCCESS [  7.877 s]
[INFO] Apache cTAKES Resources ne-contexts ................ SUCCESS [  2.402 s]
[INFO] Apache cTAKES named entity contexts ................ SUCCESS [  4.460 s]
[INFO] Apache cTAKES Resources constituency-parser ........ SUCCESS [  4.809 s]
[INFO] Apache cTAKES Constituency Parser .................. SUCCESS [  3.185 s]
[INFO] Apache cTAKES Resources coreference ................ SUCCESS [  6.926 s]
[INFO] Apache cTAKES Resources temporal ................... SUCCESS [  2.864 s]
[INFO] Apache cTAKES Resources relation-extractor ......... SUCCESS [  2.449 s]
[INFO] Apache cTAKES Resources dictionary-lookup-fast-res . SUCCESS [  3.108 s]
[INFO] Apache cTAKES dictionary lookup fast ............... SUCCESS [  3.629 s]
[INFO] Apache cTAKES Resources assertion .................. SUCCESS [  4.460 s]
[INFO] Apache cTAKES Resources dependency-parser .......... SUCCESS [ 21.886 s]
[INFO] Apache cTAKES Dependency Parser .................... SUCCESS [ 43.379 s]
[INFO] Apache cTAKES Assertion ............................ SUCCESS [  6.511 s]
[INFO] ctakes-clinical-pipeline-res ....................... SUCCESS [  2.363 s]
[INFO] Apache cTAKES ctakes-clinical-pipeline ............. SUCCESS [  6.738 s]
[INFO] Apache cTAKES Relation Extractor ................... SUCCESS [ 10.668 s]
[INFO] Apache cTAKES Temporal Information Extraction ...... SUCCESS [02:12 min]
[INFO] Apache cTAKES CoReference Resolver ................. SUCCESS [  9.521 s]
[INFO] Apache cTAKES Resources drug-ner ................... SUCCESS [  2.474 s]
[INFO] Apache cTAKES Drug NER ............................. SUCCESS [  7.059 s]
[INFO] Apache cTAKES Resources side-effect ................ SUCCESS [  2.692 s]
[INFO] Apache cTAKES Side Effects ......................... SUCCESS [  6.464 s]
[INFO] Apache cTAKES Resources smoking-status ............. SUCCESS [  2.481 s]
[INFO] Apache cTAKES Smoking Status ....................... SUCCESS [  6.335 s]
[INFO] Apache cTAKES Resources assertion-zoner ............ SUCCESS [  2.540 s]
[INFO] Apache cTAKES Assertion's zoner .................... SUCCESS [  2.989 s]
[INFO] ctakes-examples-res ................................ SUCCESS [  2.466 s]
[INFO] ctakes-examples .................................... SUCCESS [  8.974 s]
[INFO] Apache cTAKES Resources ctakes-ytex-res ............ SUCCESS [  2.475 s]
[INFO] Apache cTAKES YTEX ................................. FAILURE [01:17 min]
[INFO] Apache cTAKES YTEX UIMA ............................ SKIPPED
[INFO] Apache cTAKES YTEX Web ............................. SKIPPED
[INFO] Apache cTAKES Distribution ......................... SKIPPED
[INFO] Apache cTAKES Regression-test ...................... FAILURE [ 12.032 s]
[INFO] Apache cTAKES template filler ...................... SUCCESS [  7.777 s]
[INFO] ------------------------------------------------------------------------
[INFO] BUILD FAILURE
[INFO] ------------------------------------------------------------------------
[INFO] Total time: 15:53 min
[INFO] Finished at: 2017-10-30T02:44:09Z
[INFO] Final Memory: 153M/1658M
[INFO] ------------------------------------------------------------------------
[ERROR] Failed to execute goal org.apache.maven.plugins:maven-surefire-plugin:2.12.1:test
(surefire-it) on project ctakes-ytex: There are test failures.
[ERROR] 
[ERROR] Please refer to <https://builds.apache.org/job/cTAKES-trunk-Java-1.8/ws/ctakes-ytex/target/surefire-reports>
for the individual test results.
[ERROR] -> [Help 1]
[ERROR] Failed to execute goal org.apache.maven.plugins:maven-surefire-plugin:2.12.1:test
(default-test) on project ctakes-regression-test: There are test failures.
[ERROR] 
[ERROR] Please refer to <https://builds.apache.org/job/cTAKES-trunk-Java-1.8/ws/ctakes-regression-test/target/surefire-reports>
for the individual test results.
[ERROR] -> [Help 1]
[ERROR] 
[ERROR] To see the full stack trace of the errors, re-run Maven with the -e switch.
[ERROR] Re-run Maven using the -X switch to enable full debug logging.
[ERROR] 
[ERROR] For more information about the errors and possible solutions, please read the following
articles:
[ERROR] [Help 1] http://cwiki.apache.org/confluence/display/MAVEN/MojoFailureException
[ERROR] 
[ERROR] After correcting the problems, you can resume the build with the command
[ERROR]   mvn <goals> -rf :ctakes-ytex
Sending e-mails to: notifications@ctakes.apache.org
Sending e-mails to: notifications@ctakes.apache.org
channel stopped

Mime
View raw message